var c k i y;
varexo A;


parameters alpha beta delta sigma;
alpha = 0.3;
beta = 0.98;
delta = 0.025;
sigma = 1;

model;
c^(-sigma) = beta*c(+1)^(-sigma)*(alpha*A(+1)*k^(alpha-1)+1-delta);
c+i=y;
k = (1-delta)*k(-1)+i;
y = A*k(-1)^alpha;
end;

steady_state_model;
k = ((1-beta*(1-delta))/(beta*alpha*A))^(1/(alpha-1));
c = A*k^alpha-delta*k;
i = delta*k;
y = c+i;
end;

initval;
A=1;
end;

steady;

histval;
k(0) = 0.5*((1-beta*(1-delta))/(beta*alpha))^(1/(alpha-1));
end;

perfect_foresight_setup(periods=200);
perfect_foresight_solver;

plot(simulation("k"))
savefig("k1.pdf")
plot(simulation("c"))
savefig("c1.pdf")
plot(simulation("i"))
savefig("i1.pdf")
plot(simulation("y"))
savefig("y1.pdf")

