//------------------------------------------------------------------------------------------------------------------------
//1. Variable declaration
//------------------------------------------------------------------------------------------------------------------------

var pie, c, h, r, z;

//4 variables + 1 shock

varexo u;




//------------------------------------------------------------------------------------------------------------------------
// 2. Parameter declaration and calibration
//-------------------------------------------------------------------------------------------------------------------------

parameters beta, rho, chi, theta, phi, tau;

beta=0.99;
chi = 1;          //coefficient associated to labor effort disutility  
theta=5;          //elasticity for each variety of consumption
phi=1;            //price stickyness
tau=1/(theta-1);  //efficient tax
rho=0.9;  //coefficient associated to productivity shock


//-----------------------------------------------------------------------------------------------------------------------
// 3. The model
//-----------------------------------------------------------------------------------------------------------------------


model;
z = rho*z(-1)+u;
1/c = beta*(1/c(+1))*((1+r)/pie(+1));
(tau*(1-theta)+1) +theta*(chi*h*c/exp(z)-1) = phi*(pie-1)*pie - beta*phi*(pie(+1)-1)*pie(+1);
exp(z)*h = c*(1+(phi/2)*(pie-1)^2);
end;

//--------------------------------------------------------------------------------------------------------------------------
// 5. Ramsey problem
//--------------------------------------------------------------------------------------------------------------------------

planner_objective(log(c)-(chi/2)*h^2);

ramsey_model(planner_discount=0.99);

//--------------------------------------------------------------------------------------------------------------------------
// 5. Steady state under Ramsey policy
//---------------------------------------------------------------------------------------------------------------------------

initval;
  u = 0;
  pie = 1.5;
  r = 1/beta - 0.5;
  c = 1.5;
  h = 1.5;
  z = 0;
end;

steady; 

//---------------------------------------------------------------------------------------------------------------------------
// 6. shocks
//---------------------------------------------------------------------------------------------------------------------------

shocks;
  var u;
  periods 1;
  values 0.01;
end;

//---------------------------------------------------------------------------------------------------------------------------
// 7. Perfect foresight simulation 
//---------------------------------------------------------------------------------------------------------------------------

perfect_foresight_setup(periods = 100);
perfect_foresight_solver;

//---------------------------------------------------------------------------------------------------------------------------
// 8. Plots
//---------------------------------------------------------------------------------------------------------------------------

plot(simulation(:r));
plot(simulation(:pie));


