{
    "footer": {
        "home": "Початок",
        "news": "Новини",
        "checklist": "Чеклист"
    },
    "article": {
        "comment": "Коментар",
        "comments": "Коментарі",
        "share": "Поділитися",
        "report": "Повідомити",
        "reply": "Відповісти",
        "addComment": "Додати коментар",
        "save": "Зберегти",
        "cancel": "Скасувати",
        "categories": "Категорії",
        "createTitle": "Заголовок вашої статті",
        "createText": "Вставте текст",
        "createStreet": "Вулиця-замінник 1, 12345 Місто"
    },
    "checklist": {
        "header": "Ваш ідеальний старт в",
        "noArticle": "Для цього пункту немає статей."
    },
    "search": "Пошук...",
    "profile": {
        "guest": "Гість",
        "logout": "Вийти",
        "login": "Увійти",
        "friends": "Друзі",
        "edit": "Редагувати",
        "recentActivities": "Останні активності",
        "comingSoon": "Незабаром..."
    },
    "alert": {
        "login": "Будь ласка, увійдіть, щоб скористатися цією функцією",
        "forms": "Будь ласка, заповніть всі поля",
        "passwords": "Паролі не співпадають",
        "email": "Будь ласка, введіть дійсну адресу електронної пошти",
        "failedLogin": "Не вдалося увійти. Ім'я користувача і пароль не співпадають."
    },
    "login": {
        "loginNow": "Увійти зараз",
        "username": "Ім'я користувача",
        "password": "Пароль",
        "login": "Увійти",
        "asGuest": "Увійти як гість",
        "noAccount": "Ще немає облікового запису? Зареєструйтесь зараз!"
    },
    "register": {
        "registerNow": "Зареєструватися зараз",
        "username": "Ім'я користувача",
        "password": "Пароль",
        "verify": "Повторіть пароль",
        "email": "Адреса електронної пошти",
        "signUp": "Зареєструватися",
        "asGuest": "Увійти як гість",
        "hasAccount": "Вже є обліковий запис? Увійдіть зараз!"
    },
    "report": {
        "translation": "Неправильний або відсутній переклад",
        "inappropriate": "Нецензурний контент",
        "submit": "Подати",
        "cancel": "Скасувати",
        "selectReason": "Причина вашої скарги:"
    }
}
