{
    "footer": {
        "home": "Start",
        "news": "Neuigkeiten",
        "checklist": "Checklist"
    },
    "article": {
        "comment": "Kommentar",
        "comments": "Kommentare",
        "share": "Teilen",
        "report": "Melden",
        "reply": "Antworten",
        "addComment": "Kommentieren",
        "save": "Speichern",
        "cancel": "Abbrechen",
        "categories": "Kategorien",
        "createTitle": "Titel ihres Artikels",
        "createText": "Text einfügen",
        "createStreet": "Platzhalterstraße 1, 12345 Stadt"
    },
    "checklist": {
        "header": "Dein Perfekter Start in",
        "noArticle": "Es gibt keinen Artikel für diesen Punkt."

    },
    "search": "Suche...",
    "profile": {
        "guest": "Gast",
        "logout": "Abmelden",
        "login": "Anmelden",
        "friends": "Freunde",
        "edit": "Bearbeiten",
        "recentActivities": "Kürzliche Aktivitäten",
        "comingSoon": "Bald verfügbar..."
    },
    "alert": {
        "login": "Bite loggen Sie sich ein um diese Funktion zu nutzen",
        "forms": "Bitte füllen sie alle Felder aus",
        "passwords": "Die Passwörter stimmen nicht überein",
        "email": "Bitte geben Sie eine valide Email-Adresse ein",
        "failedLogin": "Anmeldung fehlgeschlagen. Benutzername und Passwort stimmen nicht überein."
    },
    "login": {
        "loginNow": "Jetzt anmelden",
        "username": "Benutzername",
        "password": "Passwort",
        "login": "Anmelden",
        "asGuest": "Als Gast anmelden",
        "noAccount": "Noch kein Konto? Jetzt registrieren!"
    },
    "register": {
        "registerNow": "Jetzt registrieren",
        "username": "Benutzername",
        "password": "Passwort",
        "verify": "Passwort wiederholen",
        "email": "E-Mail Adresse",
        "signUp": "Registrieren",
        "asGuest": "Als Gast anmelden",
        "hasAccount": "Konto schon vorhanden? Jetzt anmelden!"
    },
    "report": {
        "translation": "Falsche oder fehlende Übersetzung",
        "inappropriate": "Anstoßende Inhalte",
        "submit": "Melden",
        "cancel": "Abbrechen",
        "selectReason": "Grund für ihre Meldung:",
        "wrongInformation": "Alte oder falsche Information"
    }
}