-- Merging decision tree log ---
manifest
ADDED from C:\Users\utente\Documents\diagnostica_test\diagnostica_test\app\src\main\AndroidManifest.xml:2:1-64:12
INJECTED from C:\Users\utente\Documents\diagnostica_test\diagnostica_test\app\src\main\AndroidManifest.xml:2:1-64:12
INJECTED from C:\Users\utente\Documents\diagnostica_test\diagnostica_test\app\src\main\AndroidManifest.xml:2:1-64:12
INJECTED from C:\Users\utente\Documents\diagnostica_test\diagnostica_test\app\src\main\AndroidManifest.xml:2:1-64:12
MERGED from [com.android.volley:volley:1.2.0] C:\Users\utente\.gradle\caches\transforms-2\files-2.1\788a3bf8a34d1cead396076dc9df96a2\volley-1.2.0\AndroidManifest.xml:2:1-7:12
MERGED from [com.android.support:design:26.1.0] C:\Users\utente\.gradle\caches\transforms-2\files-2.1\125d3ff0b027c78d90520e25bf5a5f2c\design-26.1.0\AndroidManifest.xml:17:1-31:12
MERGED from [com.android.support:appcompat-v7:26.1.0] C:\Users\utente\.gradle\caches\transforms-2\files-2.1\d5a7471d3c55fcbb2a793f49551e3314\appcompat-v7-26.1.0\AndroidManifest.xml:17:1-31:12
MERGED from [com.google.android.gms:play-services-appindexing:8.1.0] C:\Users\utente\.gradle\caches\transforms-2\files-2.1\4ddb9897314c401df348fa1dea5fb17d\play-services-appindexing-8.1.0\AndroidManifest.xml:16:1-20:12
MERGED from [com.android.support:animated-vector-drawable:26.1.0] C:\Users\utente\.gradle\caches\transforms-2\files-2.1\35758ef179b8f2001422bd8e733be5a5\animated-vector-drawable-26.1.0\AndroidManifest.xml:17:1-28:12
MERGED from [com.android.support:support-vector-drawable:26.1.0] C:\Users\utente\.gradle\caches\transforms-2\files-2.1\1d3b376abf27db29af42117432f21daf\support-vector-drawable-26.1.0\AndroidManifest.xml:17:1-28:12
MERGED from [com.android.support:recyclerview-v7:26.1.0] C:\Users\utente\.gradle\caches\transforms-2\files-2.1\a02d6e1eb93a3a918810cfea32f2dddc\recyclerview-v7-26.1.0\AndroidManifest.xml:17:1-28:12
MERGED from [com.android.support:transition:26.1.0] C:\Users\utente\.gradle\caches\transforms-2\files-2.1\23f4dec2671b2e7ec052f5750e1eefeb\transition-26.1.0\AndroidManifest.xml:17:1-28:12
MERGED from [com.google.android.gms:play-services-basement:8.1.0] C:\Users\utente\.gradle\caches\transforms-2\files-2.1\04ba9b033d3dea4e46238bdee8668c6f\play-services-basement-8.1.0\AndroidManifest.xml:16:1-26:12
MERGED from [com.android.support:support-v4:26.1.0] C:\Users\utente\.gradle\caches\transforms-2\files-2.1\8a8b49ac6fefc2295cb94c8290c78d69\support-v4-26.1.0\AndroidManifest.xml:17:1-31:12
MERGED from [com.android.support:support-media-compat:26.1.0] C:\Users\utente\.gradle\caches\transforms-2\files-2.1\020e3e414aff10cce9f59250b3ba1e0d\support-media-compat-26.1.0\AndroidManifest.xml:17:1-31:12
MERGED from [com.android.support:support-fragment:26.1.0] C:\Users\utente\.gradle\caches\transforms-2\files-2.1\05dbe5280d2b8061ac4fd3a4ac721daa\support-fragment-26.1.0\AndroidManifest.xml:17:1-31:12
MERGED from [com.android.support:support-core-utils:26.1.0] C:\Users\utente\.gradle\caches\transforms-2\files-2.1\4a8dbf6c9999da4d0ded9ff32c231f70\support-core-utils-26.1.0\AndroidManifest.xml:17:1-31:12
MERGED from [com.android.support:support-core-ui:26.1.0] C:\Users\utente\.gradle\caches\transforms-2\files-2.1\b256d14ebc7f87d3e5da9b302f3f3d5d\support-core-ui-26.1.0\AndroidManifest.xml:17:1-31:12
MERGED from [com.android.support:support-compat:26.1.0] C:\Users\utente\.gradle\caches\transforms-2\files-2.1\183340c01d99c4ed903c01a2dcd804a3\support-compat-26.1.0\AndroidManifest.xml:17:1-31:12
MERGED from [android.arch.lifecycle:runtime:1.0.0] C:\Users\utente\.gradle\caches\transforms-2\files-2.1\f27b791f42bc0a338f9d8bea31504c56\runtime-1.0.0\AndroidManifest.xml:17:1-30:12
INJECTED from C:\Users\utente\Documents\diagnostica_test\diagnostica_test\app\src\main\AndroidManifest.xml:2:1-64:12
INJECTED from C:\Users\utente\Documents\diagnostica_test\diagnostica_test\app\src\main\AndroidManifest.xml:2:1-64:12
INJECTED from C:\Users\utente\Documents\diagnostica_test\diagnostica_test\app\src\main\AndroidManifest.xml:2:1-64:12
	package
		ADDED from C:\Users\utente\Documents\diagnostica_test\diagnostica_test\app\src\main\AndroidManifest.xml:4:5-40
		INJECTED from C:\Users\utente\Documents\diagnostica_test\diagnostica_test\app\src\main\AndroidManifest.xml
		INJECTED from C:\Users\utente\Documents\diagnostica_test\diagnostica_test\app\src\main\AndroidManifest.xml
	android:versionName
		INJECTED from C:\Users\utente\Documents\diagnostica_test\diagnostica_test\app\src\main\AndroidManifest.xml
		ADDED from C:\Users\utente\Documents\diagnostica_test\diagnostica_test\app\src\main\AndroidManifest.xml:2:1-64:12
		INJECTED from C:\Users\utente\Documents\diagnostica_test\diagnostica_test\app\src\main\AndroidManifest.xml
	xmlns:tools
		ADDED from C:\Users\utente\Documents\diagnostica_test\diagnostica_test\app\src\main\AndroidManifest.xml:3:5-51
	android:versionCode
		INJECTED from C:\Users\utente\Documents\diagnostica_test\diagnostica_test\app\src\main\AndroidManifest.xml
		ADDED from C:\Users\utente\Documents\diagnostica_test\diagnostica_test\app\src\main\AndroidManifest.xml:2:1-64:12
		INJECTED from C:\Users\utente\Documents\diagnostica_test\diagnostica_test\app\src\main\AndroidManifest.xml
	xmlns:android
		ADDED from C:\Users\utente\Documents\diagnostica_test\diagnostica_test\app\src\main\AndroidManifest.xml:2:11-69
uses-permission#android.permission.READ_INTERNAL_STORAGE
ADDED from C:\Users\utente\Documents\diagnostica_test\diagnostica_test\app\src\main\AndroidManifest.xml:6:5-79
	android:name
		ADDED from C:\Users\utente\Documents\diagnostica_test\diagnostica_test\app\src\main\AndroidManifest.xml:6:22-77
uses-permission#android.permission.READ_EXTERNAL_STORAGE
ADDED from C:\Users\utente\Documents\diagnostica_test\diagnostica_test\app\src\main\AndroidManifest.xml:7:5-79
	android:name
		ADDED from C:\Users\utente\Documents\diagnostica_test\diagnostica_test\app\src\main\AndroidManifest.xml:7:22-77
uses-permission#android.permission.WRITE_EXTERNAL_STORAGE
ADDED from C:\Users\utente\Documents\diagnostica_test\diagnostica_test\app\src\main\AndroidManifest.xml:8:5-80
	android:name
		ADDED from C:\Users\utente\Documents\diagnostica_test\diagnostica_test\app\src\main\AndroidManifest.xml:8:22-78
uses-permission#android.permission.WRITE_INTERNAL_STORAGE
ADDED from C:\Users\utente\Documents\diagnostica_test\diagnostica_test\app\src\main\AndroidManifest.xml:9:5-80
	android:name
		ADDED from C:\Users\utente\Documents\diagnostica_test\diagnostica_test\app\src\main\AndroidManifest.xml:9:22-78
uses-permission#com.android.launcher.permission.READ_SETTINGS
ADDED from C:\Users\utente\Documents\diagnostica_test\diagnostica_test\app\src\main\AndroidManifest.xml:10:5-85
	android:name
		ADDED from C:\Users\utente\Documents\diagnostica_test\diagnostica_test\app\src\main\AndroidManifest.xml:10:22-82
uses-permission#com.android.launcher.permission.WRITE_SETTINGS
ADDED from C:\Users\utente\Documents\diagnostica_test\diagnostica_test\app\src\main\AndroidManifest.xml:11:5-86
	android:name
		ADDED from C:\Users\utente\Documents\diagnostica_test\diagnostica_test\app\src\main\AndroidManifest.xml:11:22-83
uses-permission#android.permission.CAMERA
ADDED from C:\Users\utente\Documents\diagnostica_test\diagnostica_test\app\src\main\AndroidManifest.xml:12:5-65
	android:name
		ADDED from C:\Users\utente\Documents\diagnostica_test\diagnostica_test\app\src\main\AndroidManifest.xml:12:22-62
uses-feature#android.hardware.camera
ADDED from C:\Users\utente\Documents\diagnostica_test\diagnostica_test\app\src\main\AndroidManifest.xml:13:5-60
	android:name
		ADDED from C:\Users\utente\Documents\diagnostica_test\diagnostica_test\app\src\main\AndroidManifest.xml:13:19-57
uses-feature#android.hardware.camera.autofocus
ADDED from C:\Users\utente\Documents\diagnostica_test\diagnostica_test\app\src\main\AndroidManifest.xml:14:5-70
	android:name
		ADDED from C:\Users\utente\Documents\diagnostica_test\diagnostica_test\app\src\main\AndroidManifest.xml:14:19-67
uses-feature#android.permission.REBOOT
ADDED from C:\Users\utente\Documents\diagnostica_test\diagnostica_test\app\src\main\AndroidManifest.xml:15:5-62
	android:name
		ADDED from C:\Users\utente\Documents\diagnostica_test\diagnostica_test\app\src\main\AndroidManifest.xml:15:19-59
uses-permission#android.permission.INTERNET
ADDED from C:\Users\utente\Documents\diagnostica_test\diagnostica_test\app\src\main\AndroidManifest.xml:16:5-67
	android:name
		ADDED from C:\Users\utente\Documents\diagnostica_test\diagnostica_test\app\src\main\AndroidManifest.xml:16:22-64
uses-permission#android.permission.ACCESS_NETWORK_STATE
ADDED from C:\Users\utente\Documents\diagnostica_test\diagnostica_test\app\src\main\AndroidManifest.xml:17:5-79
	android:name
		ADDED from C:\Users\utente\Documents\diagnostica_test\diagnostica_test\app\src\main\AndroidManifest.xml:17:22-76
uses-permission#android.permission.ACCESS_WIFI_STATE
ADDED from C:\Users\utente\Documents\diagnostica_test\diagnostica_test\app\src\main\AndroidManifest.xml:18:5-76
	android:name
		ADDED from C:\Users\utente\Documents\diagnostica_test\diagnostica_test\app\src\main\AndroidManifest.xml:18:22-73
uses-permission#android.permission.CHANGE_WIFI_STATE
ADDED from C:\Users\utente\Documents\diagnostica_test\diagnostica_test\app\src\main\AndroidManifest.xml:19:5-76
	android:name
		ADDED from C:\Users\utente\Documents\diagnostica_test\diagnostica_test\app\src\main\AndroidManifest.xml:19:22-73
uses-permission#android.permission.ACCESS_FINE_LOCATION
ADDED from C:\Users\utente\Documents\diagnostica_test\diagnostica_test\app\src\main\AndroidManifest.xml:20:5-79
	android:name
		ADDED from C:\Users\utente\Documents\diagnostica_test\diagnostica_test\app\src\main\AndroidManifest.xml:20:22-76
uses-permission#android.permission.ACCESS_COARSE_LOCATION
ADDED from C:\Users\utente\Documents\diagnostica_test\diagnostica_test\app\src\main\AndroidManifest.xml:21:5-81
	android:name
		ADDED from C:\Users\utente\Documents\diagnostica_test\diagnostica_test\app\src\main\AndroidManifest.xml:21:22-78
uses-permission#android.permission.ACCESS_BACKGROUND_LOCATION
ADDED from C:\Users\utente\Documents\diagnostica_test\diagnostica_test\app\src\main\AndroidManifest.xml:22:5-85
	android:name
		ADDED from C:\Users\utente\Documents\diagnostica_test\diagnostica_test\app\src\main\AndroidManifest.xml:22:22-82
uses-permission#android.permission.MANAGE_EXTERNAL_STORAGE
ADDED from C:\Users\utente\Documents\diagnostica_test\diagnostica_test\app\src\main\AndroidManifest.xml:23:5-24:40
	tools:ignore
		ADDED from C:\Users\utente\Documents\diagnostica_test\diagnostica_test\app\src\main\AndroidManifest.xml:24:9-37
	android:name
		ADDED from C:\Users\utente\Documents\diagnostica_test\diagnostica_test\app\src\main\AndroidManifest.xml:23:22-79
uses-permission#android.permission.ACCESS_MEDIA_LOCATION
ADDED from C:\Users\utente\Documents\diagnostica_test\diagnostica_test\app\src\main\AndroidManifest.xml:25:5-79
	android:name
		ADDED from C:\Users\utente\Documents\diagnostica_test\diagnostica_test\app\src\main\AndroidManifest.xml:25:22-77
uses-permission#android.permission.WRITE_MEDIA_STORAGE
ADDED from C:\Users\utente\Documents\diagnostica_test\diagnostica_test\app\src\main\AndroidManifest.xml:26:5-27:47
	tools:ignore
		ADDED from C:\Users\utente\Documents\diagnostica_test\diagnostica_test\app\src\main\AndroidManifest.xml:27:9-44
	android:name
		ADDED from C:\Users\utente\Documents\diagnostica_test\diagnostica_test\app\src\main\AndroidManifest.xml:26:22-75
application
ADDED from C:\Users\utente\Documents\diagnostica_test\diagnostica_test\app\src\main\AndroidManifest.xml:29:5-60:19
MERGED from [com.android.support:design:26.1.0] C:\Users\utente\.gradle\caches\transforms-2\files-2.1\125d3ff0b027c78d90520e25bf5a5f2c\design-26.1.0\AndroidManifest.xml:25:5-29:19
MERGED from [com.android.support:design:26.1.0] C:\Users\utente\.gradle\caches\transforms-2\files-2.1\125d3ff0b027c78d90520e25bf5a5f2c\design-26.1.0\AndroidManifest.xml:25:5-29:19
MERGED from [com.android.support:appcompat-v7:26.1.0] C:\Users\utente\.gradle\caches\transforms-2\files-2.1\d5a7471d3c55fcbb2a793f49551e3314\appcompat-v7-26.1.0\AndroidManifest.xml:25:5-29:19
MERGED from [com.android.support:appcompat-v7:26.1.0] C:\Users\utente\.gradle\caches\transforms-2\files-2.1\d5a7471d3c55fcbb2a793f49551e3314\appcompat-v7-26.1.0\AndroidManifest.xml:25:5-29:19
MERGED from [com.google.android.gms:play-services-appindexing:8.1.0] C:\Users\utente\.gradle\caches\transforms-2\files-2.1\4ddb9897314c401df348fa1dea5fb17d\play-services-appindexing-8.1.0\AndroidManifest.xml:19:5-20
MERGED from [com.google.android.gms:play-services-appindexing:8.1.0] C:\Users\utente\.gradle\caches\transforms-2\files-2.1\4ddb9897314c401df348fa1dea5fb17d\play-services-appindexing-8.1.0\AndroidManifest.xml:19:5-20
MERGED from [com.android.support:animated-vector-drawable:26.1.0] C:\Users\utente\.gradle\caches\transforms-2\files-2.1\35758ef179b8f2001422bd8e733be5a5\animated-vector-drawable-26.1.0\AndroidManifest.xml:22:5-26:19
MERGED from [com.android.support:animated-vector-drawable:26.1.0] C:\Users\utente\.gradle\caches\transforms-2\files-2.1\35758ef179b8f2001422bd8e733be5a5\animated-vector-drawable-26.1.0\AndroidManifest.xml:22:5-26:19
MERGED from [com.android.support:support-vector-drawable:26.1.0] C:\Users\utente\.gradle\caches\transforms-2\files-2.1\1d3b376abf27db29af42117432f21daf\support-vector-drawable-26.1.0\AndroidManifest.xml:22:5-26:19
MERGED from [com.android.support:support-vector-drawable:26.1.0] C:\Users\utente\.gradle\caches\transforms-2\files-2.1\1d3b376abf27db29af42117432f21daf\support-vector-drawable-26.1.0\AndroidManifest.xml:22:5-26:19
MERGED from [com.android.support:recyclerview-v7:26.1.0] C:\Users\utente\.gradle\caches\transforms-2\files-2.1\a02d6e1eb93a3a918810cfea32f2dddc\recyclerview-v7-26.1.0\AndroidManifest.xml:22:5-26:19
MERGED from [com.android.support:recyclerview-v7:26.1.0] C:\Users\utente\.gradle\caches\transforms-2\files-2.1\a02d6e1eb93a3a918810cfea32f2dddc\recyclerview-v7-26.1.0\AndroidManifest.xml:22:5-26:19
MERGED from [com.android.support:transition:26.1.0] C:\Users\utente\.gradle\caches\transforms-2\files-2.1\23f4dec2671b2e7ec052f5750e1eefeb\transition-26.1.0\AndroidManifest.xml:22:5-26:19
MERGED from [com.android.support:transition:26.1.0] C:\Users\utente\.gradle\caches\transforms-2\files-2.1\23f4dec2671b2e7ec052f5750e1eefeb\transition-26.1.0\AndroidManifest.xml:22:5-26:19
MERGED from [com.google.android.gms:play-services-basement:8.1.0] C:\Users\utente\.gradle\caches\transforms-2\files-2.1\04ba9b033d3dea4e46238bdee8668c6f\play-services-basement-8.1.0\AndroidManifest.xml:20:5-24:19
MERGED from [com.google.android.gms:play-services-basement:8.1.0] C:\Users\utente\.gradle\caches\transforms-2\files-2.1\04ba9b033d3dea4e46238bdee8668c6f\play-services-basement-8.1.0\AndroidManifest.xml:20:5-24:19
MERGED from [com.android.support:support-v4:26.1.0] C:\Users\utente\.gradle\caches\transforms-2\files-2.1\8a8b49ac6fefc2295cb94c8290c78d69\support-v4-26.1.0\AndroidManifest.xml:25:5-29:19
MERGED from [com.android.support:support-v4:26.1.0] C:\Users\utente\.gradle\caches\transforms-2\files-2.1\8a8b49ac6fefc2295cb94c8290c78d69\support-v4-26.1.0\AndroidManifest.xml:25:5-29:19
MERGED from [com.android.support:support-media-compat:26.1.0] C:\Users\utente\.gradle\caches\transforms-2\files-2.1\020e3e414aff10cce9f59250b3ba1e0d\support-media-compat-26.1.0\AndroidManifest.xml:25:5-29:19
MERGED from [com.android.support:support-media-compat:26.1.0] C:\Users\utente\.gradle\caches\transforms-2\files-2.1\020e3e414aff10cce9f59250b3ba1e0d\support-media-compat-26.1.0\AndroidManifest.xml:25:5-29:19
MERGED from [com.android.support:support-fragment:26.1.0] C:\Users\utente\.gradle\caches\transforms-2\files-2.1\05dbe5280d2b8061ac4fd3a4ac721daa\support-fragment-26.1.0\AndroidManifest.xml:25:5-29:19
MERGED from [com.android.support:support-fragment:26.1.0] C:\Users\utente\.gradle\caches\transforms-2\files-2.1\05dbe5280d2b8061ac4fd3a4ac721daa\support-fragment-26.1.0\AndroidManifest.xml:25:5-29:19
MERGED from [com.android.support:support-core-utils:26.1.0] C:\Users\utente\.gradle\caches\transforms-2\files-2.1\4a8dbf6c9999da4d0ded9ff32c231f70\support-core-utils-26.1.0\AndroidManifest.xml:25:5-29:19
MERGED from [com.android.support:support-core-utils:26.1.0] C:\Users\utente\.gradle\caches\transforms-2\files-2.1\4a8dbf6c9999da4d0ded9ff32c231f70\support-core-utils-26.1.0\AndroidManifest.xml:25:5-29:19
MERGED from [com.android.support:support-core-ui:26.1.0] C:\Users\utente\.gradle\caches\transforms-2\files-2.1\b256d14ebc7f87d3e5da9b302f3f3d5d\support-core-ui-26.1.0\AndroidManifest.xml:25:5-29:19
MERGED from [com.android.support:support-core-ui:26.1.0] C:\Users\utente\.gradle\caches\transforms-2\files-2.1\b256d14ebc7f87d3e5da9b302f3f3d5d\support-core-ui-26.1.0\AndroidManifest.xml:25:5-29:19
MERGED from [com.android.support:support-compat:26.1.0] C:\Users\utente\.gradle\caches\transforms-2\files-2.1\183340c01d99c4ed903c01a2dcd804a3\support-compat-26.1.0\AndroidManifest.xml:25:5-29:19
MERGED from [com.android.support:support-compat:26.1.0] C:\Users\utente\.gradle\caches\transforms-2\files-2.1\183340c01d99c4ed903c01a2dcd804a3\support-compat-26.1.0\AndroidManifest.xml:25:5-29:19
MERGED from [android.arch.lifecycle:runtime:1.0.0] C:\Users\utente\.gradle\caches\transforms-2\files-2.1\f27b791f42bc0a338f9d8bea31504c56\runtime-1.0.0\AndroidManifest.xml:24:5-28:19
MERGED from [android.arch.lifecycle:runtime:1.0.0] C:\Users\utente\.gradle\caches\transforms-2\files-2.1\f27b791f42bc0a338f9d8bea31504c56\runtime-1.0.0\AndroidManifest.xml:24:5-28:19
	android:screenOrientation
		ADDED from C:\Users\utente\Documents\diagnostica_test\diagnostica_test\app\src\main\AndroidManifest.xml:33:9-46
	android:extractNativeLibs
		ADDED from C:\Users\utente\Documents\diagnostica_test\diagnostica_test\app\src\main\AndroidManifest.xml:38:9-41
	android:supportsRtl
		ADDED from C:\Users\utente\Documents\diagnostica_test\diagnostica_test\app\src\main\AndroidManifest.xml:34:9-35
	android:label
		ADDED from C:\Users\utente\Documents\diagnostica_test\diagnostica_test\app\src\main\AndroidManifest.xml:32:9-41
	android:windowSoftInputMode
		ADDED from C:\Users\utente\Documents\diagnostica_test\diagnostica_test\app\src\main\AndroidManifest.xml:37:9-51
	android:icon
		ADDED from C:\Users\utente\Documents\diagnostica_test\diagnostica_test\app\src\main\AndroidManifest.xml:31:9-43
	android:allowBackup
		ADDED from C:\Users\utente\Documents\diagnostica_test\diagnostica_test\app\src\main\AndroidManifest.xml:30:9-35
	android:theme
		ADDED from C:\Users\utente\Documents\diagnostica_test\diagnostica_test\app\src\main\AndroidManifest.xml:35:9-40
	android:usesCleartextTraffic
		ADDED from C:\Users\utente\Documents\diagnostica_test\diagnostica_test\app\src\main\AndroidManifest.xml:36:9-44
activity#com.topquality.velvetskin.Diagnostica
ADDED from C:\Users\utente\Documents\diagnostica_test\diagnostica_test\app\src\main\AndroidManifest.xml:39:9-49:20
	android:launchMode
		ADDED from C:\Users\utente\Documents\diagnostica_test\diagnostica_test\app\src\main\AndroidManifest.xml:40:13-43
	android:name
		ADDED from C:\Users\utente\Documents\diagnostica_test\diagnostica_test\app\src\main\AndroidManifest.xml:39:19-71
intent-filter#action:name:android.intent.action.MAIN+category:name:android.intent.category.DEFAULT+category:name:android.intent.category.HOME+category:name:android.intent.category.LAUNCHER
ADDED from C:\Users\utente\Documents\diagnostica_test\diagnostica_test\app\src\main\AndroidManifest.xml:42:13-48:29
action#android.intent.action.MAIN
ADDED from C:\Users\utente\Documents\diagnostica_test\diagnostica_test\app\src\main\AndroidManifest.xml:43:17-69
	android:name
		ADDED from C:\Users\utente\Documents\diagnostica_test\diagnostica_test\app\src\main\AndroidManifest.xml:43:25-66
category#android.intent.category.LAUNCHER
ADDED from C:\Users\utente\Documents\diagnostica_test\diagnostica_test\app\src\main\AndroidManifest.xml:45:17-77
	android:name
		ADDED from C:\Users\utente\Documents\diagnostica_test\diagnostica_test\app\src\main\AndroidManifest.xml:45:27-74
category#android.intent.category.HOME
ADDED from C:\Users\utente\Documents\diagnostica_test\diagnostica_test\app\src\main\AndroidManifest.xml:46:17-73
	android:name
		ADDED from C:\Users\utente\Documents\diagnostica_test\diagnostica_test\app\src\main\AndroidManifest.xml:46:27-70
category#android.intent.category.DEFAULT
ADDED from C:\Users\utente\Documents\diagnostica_test\diagnostica_test\app\src\main\AndroidManifest.xml:47:17-76
	android:name
		ADDED from C:\Users\utente\Documents\diagnostica_test\diagnostica_test\app\src\main\AndroidManifest.xml:47:27-73
meta-data#com.google.android.gms.version
ADDED from C:\Users\utente\Documents\diagnostica_test\diagnostica_test\app\src\main\AndroidManifest.xml:53:9-55:69
MERGED from [com.google.android.gms:play-services-basement:8.1.0] C:\Users\utente\.gradle\caches\transforms-2\files-2.1\04ba9b033d3dea4e46238bdee8668c6f\play-services-basement-8.1.0\AndroidManifest.xml:21:9-23:69
MERGED from [com.google.android.gms:play-services-basement:8.1.0] C:\Users\utente\.gradle\caches\transforms-2\files-2.1\04ba9b033d3dea4e46238bdee8668c6f\play-services-basement-8.1.0\AndroidManifest.xml:21:9-23:69
	android:value
		ADDED from C:\Users\utente\Documents\diagnostica_test\diagnostica_test\app\src\main\AndroidManifest.xml:55:13-66
	android:name
		ADDED from C:\Users\utente\Documents\diagnostica_test\diagnostica_test\app\src\main\AndroidManifest.xml:54:13-58
meta-data#preloaded_fonts
ADDED from C:\Users\utente\Documents\diagnostica_test\diagnostica_test\app\src\main\AndroidManifest.xml:56:9-58:57
	android:resource
		ADDED from C:\Users\utente\Documents\diagnostica_test\diagnostica_test\app\src\main\AndroidManifest.xml:58:13-54
	android:name
		ADDED from C:\Users\utente\Documents\diagnostica_test\diagnostica_test\app\src\main\AndroidManifest.xml:57:13-43
uses-permission#android.permission.RECEIVE_BOOT_COMPLETED
ADDED from C:\Users\utente\Documents\diagnostica_test\diagnostica_test\app\src\main\AndroidManifest.xml:62:5-81
	android:name
		ADDED from C:\Users\utente\Documents\diagnostica_test\diagnostica_test\app\src\main\AndroidManifest.xml:62:22-78
uses-sdk
INJECTED from C:\Users\utente\Documents\diagnostica_test\diagnostica_test\app\src\main\AndroidManifest.xml reason: use-sdk injection requested
INJECTED from C:\Users\utente\Documents\diagnostica_test\diagnostica_test\app\src\main\AndroidManifest.xml
INJECTED from C:\Users\utente\Documents\diagnostica_test\diagnostica_test\app\src\main\AndroidManifest.xml
MERGED from [com.android.volley:volley:1.2.0] C:\Users\utente\.gradle\caches\transforms-2\files-2.1\788a3bf8a34d1cead396076dc9df96a2\volley-1.2.0\AndroidManifest.xml:5:5-43
MERGED from [com.android.volley:volley:1.2.0] C:\Users\utente\.gradle\caches\transforms-2\files-2.1\788a3bf8a34d1cead396076dc9df96a2\volley-1.2.0\AndroidManifest.xml:5:5-43
MERGED from [com.android.support:design:26.1.0] C:\Users\utente\.gradle\caches\transforms-2\files-2.1\125d3ff0b027c78d90520e25bf5a5f2c\design-26.1.0\AndroidManifest.xml:21:5-23:62
MERGED from [com.android.support:design:26.1.0] C:\Users\utente\.gradle\caches\transforms-2\files-2.1\125d3ff0b027c78d90520e25bf5a5f2c\design-26.1.0\AndroidManifest.xml:21:5-23:62
MERGED from [com.android.support:appcompat-v7:26.1.0] C:\Users\utente\.gradle\caches\transforms-2\files-2.1\d5a7471d3c55fcbb2a793f49551e3314\appcompat-v7-26.1.0\AndroidManifest.xml:21:5-23:78
MERGED from [com.android.support:appcompat-v7:26.1.0] C:\Users\utente\.gradle\caches\transforms-2\files-2.1\d5a7471d3c55fcbb2a793f49551e3314\appcompat-v7-26.1.0\AndroidManifest.xml:21:5-23:78
MERGED from [com.google.android.gms:play-services-appindexing:8.1.0] C:\Users\utente\.gradle\caches\transforms-2\files-2.1\4ddb9897314c401df348fa1dea5fb17d\play-services-appindexing-8.1.0\AndroidManifest.xml:18:5-42
MERGED from [com.google.android.gms:play-services-appindexing:8.1.0] C:\Users\utente\.gradle\caches\transforms-2\files-2.1\4ddb9897314c401df348fa1dea5fb17d\play-services-appindexing-8.1.0\AndroidManifest.xml:18:5-42
MERGED from [com.android.support:animated-vector-drawable:26.1.0] C:\Users\utente\.gradle\caches\transforms-2\files-2.1\35758ef179b8f2001422bd8e733be5a5\animated-vector-drawable-26.1.0\AndroidManifest.xml:20:5-44
MERGED from [com.android.support:animated-vector-drawable:26.1.0] C:\Users\utente\.gradle\caches\transforms-2\files-2.1\35758ef179b8f2001422bd8e733be5a5\animated-vector-drawable-26.1.0\AndroidManifest.xml:20:5-44
MERGED from [com.android.support:support-vector-drawable:26.1.0] C:\Users\utente\.gradle\caches\transforms-2\files-2.1\1d3b376abf27db29af42117432f21daf\support-vector-drawable-26.1.0\AndroidManifest.xml:20:5-44
MERGED from [com.android.support:support-vector-drawable:26.1.0] C:\Users\utente\.gradle\caches\transforms-2\files-2.1\1d3b376abf27db29af42117432f21daf\support-vector-drawable-26.1.0\AndroidManifest.xml:20:5-44
MERGED from [com.android.support:recyclerview-v7:26.1.0] C:\Users\utente\.gradle\caches\transforms-2\files-2.1\a02d6e1eb93a3a918810cfea32f2dddc\recyclerview-v7-26.1.0\AndroidManifest.xml:20:5-44
MERGED from [com.android.support:recyclerview-v7:26.1.0] C:\Users\utente\.gradle\caches\transforms-2\files-2.1\a02d6e1eb93a3a918810cfea32f2dddc\recyclerview-v7-26.1.0\AndroidManifest.xml:20:5-44
MERGED from [com.android.support:transition:26.1.0] C:\Users\utente\.gradle\caches\transforms-2\files-2.1\23f4dec2671b2e7ec052f5750e1eefeb\transition-26.1.0\AndroidManifest.xml:20:5-44
MERGED from [com.android.support:transition:26.1.0] C:\Users\utente\.gradle\caches\transforms-2\files-2.1\23f4dec2671b2e7ec052f5750e1eefeb\transition-26.1.0\AndroidManifest.xml:20:5-44
MERGED from [com.google.android.gms:play-services-basement:8.1.0] C:\Users\utente\.gradle\caches\transforms-2\files-2.1\04ba9b033d3dea4e46238bdee8668c6f\play-services-basement-8.1.0\AndroidManifest.xml:18:5-42
MERGED from [com.google.android.gms:play-services-basement:8.1.0] C:\Users\utente\.gradle\caches\transforms-2\files-2.1\04ba9b033d3dea4e46238bdee8668c6f\play-services-basement-8.1.0\AndroidManifest.xml:18:5-42
MERGED from [com.android.support:support-v4:26.1.0] C:\Users\utente\.gradle\caches\transforms-2\files-2.1\8a8b49ac6fefc2295cb94c8290c78d69\support-v4-26.1.0\AndroidManifest.xml:21:5-23:54
MERGED from [com.android.support:support-v4:26.1.0] C:\Users\utente\.gradle\caches\transforms-2\files-2.1\8a8b49ac6fefc2295cb94c8290c78d69\support-v4-26.1.0\AndroidManifest.xml:21:5-23:54
MERGED from [com.android.support:support-media-compat:26.1.0] C:\Users\utente\.gradle\caches\transforms-2\files-2.1\020e3e414aff10cce9f59250b3ba1e0d\support-media-compat-26.1.0\AndroidManifest.xml:21:5-23:63
MERGED from [com.android.support:support-media-compat:26.1.0] C:\Users\utente\.gradle\caches\transforms-2\files-2.1\020e3e414aff10cce9f59250b3ba1e0d\support-media-compat-26.1.0\AndroidManifest.xml:21:5-23:63
MERGED from [com.android.support:support-fragment:26.1.0] C:\Users\utente\.gradle\caches\transforms-2\files-2.1\05dbe5280d2b8061ac4fd3a4ac721daa\support-fragment-26.1.0\AndroidManifest.xml:21:5-23:60
MERGED from [com.android.support:support-fragment:26.1.0] C:\Users\utente\.gradle\caches\transforms-2\files-2.1\05dbe5280d2b8061ac4fd3a4ac721daa\support-fragment-26.1.0\AndroidManifest.xml:21:5-23:60
MERGED from [com.android.support:support-core-utils:26.1.0] C:\Users\utente\.gradle\caches\transforms-2\files-2.1\4a8dbf6c9999da4d0ded9ff32c231f70\support-core-utils-26.1.0\AndroidManifest.xml:21:5-23:61
MERGED from [com.android.support:support-core-utils:26.1.0] C:\Users\utente\.gradle\caches\transforms-2\files-2.1\4a8dbf6c9999da4d0ded9ff32c231f70\support-core-utils-26.1.0\AndroidManifest.xml:21:5-23:61
MERGED from [com.android.support:support-core-ui:26.1.0] C:\Users\utente\.gradle\caches\transforms-2\files-2.1\b256d14ebc7f87d3e5da9b302f3f3d5d\support-core-ui-26.1.0\AndroidManifest.xml:21:5-23:58
MERGED from [com.android.support:support-core-ui:26.1.0] C:\Users\utente\.gradle\caches\transforms-2\files-2.1\b256d14ebc7f87d3e5da9b302f3f3d5d\support-core-ui-26.1.0\AndroidManifest.xml:21:5-23:58
MERGED from [com.android.support:support-compat:26.1.0] C:\Users\utente\.gradle\caches\transforms-2\files-2.1\183340c01d99c4ed903c01a2dcd804a3\support-compat-26.1.0\AndroidManifest.xml:21:5-23:58
MERGED from [com.android.support:support-compat:26.1.0] C:\Users\utente\.gradle\caches\transforms-2\files-2.1\183340c01d99c4ed903c01a2dcd804a3\support-compat-26.1.0\AndroidManifest.xml:21:5-23:58
MERGED from [android.arch.lifecycle:runtime:1.0.0] C:\Users\utente\.gradle\caches\transforms-2\files-2.1\f27b791f42bc0a338f9d8bea31504c56\runtime-1.0.0\AndroidManifest.xml:20:5-22:41
MERGED from [android.arch.lifecycle:runtime:1.0.0] C:\Users\utente\.gradle\caches\transforms-2\files-2.1\f27b791f42bc0a338f9d8bea31504c56\runtime-1.0.0\AndroidManifest.xml:20:5-22:41
INJECTED from C:\Users\utente\Documents\diagnostica_test\diagnostica_test\app\src\main\AndroidManifest.xml
INJECTED from C:\Users\utente\Documents\diagnostica_test\diagnostica_test\app\src\main\AndroidManifest.xml
	tools:overrideLibrary
		ADDED from [com.android.support:design:26.1.0] C:\Users\utente\.gradle\caches\transforms-2\files-2.1\125d3ff0b027c78d90520e25bf5a5f2c\design-26.1.0\AndroidManifest.xml:23:9-59
	android:targetSdkVersion
		INJECTED from C:\Users\utente\Documents\diagnostica_test\diagnostica_test\app\src\main\AndroidManifest.xml
		ADDED from C:\Users\utente\Documents\diagnostica_test\diagnostica_test\app\src\main\AndroidManifest.xml
		INJECTED from C:\Users\utente\Documents\diagnostica_test\diagnostica_test\app\src\main\AndroidManifest.xml
	android:minSdkVersion
		INJECTED from C:\Users\utente\Documents\diagnostica_test\diagnostica_test\app\src\main\AndroidManifest.xml
		ADDED from C:\Users\utente\Documents\diagnostica_test\diagnostica_test\app\src\main\AndroidManifest.xml
		INJECTED from C:\Users\utente\Documents\diagnostica_test\diagnostica_test\app\src\main\AndroidManifest.xml
meta-data#android.support.VERSION
ADDED from [com.android.support:design:26.1.0] C:\Users\utente\.gradle\caches\transforms-2\files-2.1\125d3ff0b027c78d90520e25bf5a5f2c\design-26.1.0\AndroidManifest.xml:26:9-28:38
MERGED from [com.android.support:appcompat-v7:26.1.0] C:\Users\utente\.gradle\caches\transforms-2\files-2.1\d5a7471d3c55fcbb2a793f49551e3314\appcompat-v7-26.1.0\AndroidManifest.xml:26:9-28:38
MERGED from [com.android.support:appcompat-v7:26.1.0] C:\Users\utente\.gradle\caches\transforms-2\files-2.1\d5a7471d3c55fcbb2a793f49551e3314\appcompat-v7-26.1.0\AndroidManifest.xml:26:9-28:38
MERGED from [com.android.support:animated-vector-drawable:26.1.0] C:\Users\utente\.gradle\caches\transforms-2\files-2.1\35758ef179b8f2001422bd8e733be5a5\animated-vector-drawable-26.1.0\AndroidManifest.xml:23:9-25:38
MERGED from [com.android.support:animated-vector-drawable:26.1.0] C:\Users\utente\.gradle\caches\transforms-2\files-2.1\35758ef179b8f2001422bd8e733be5a5\animated-vector-drawable-26.1.0\AndroidManifest.xml:23:9-25:38
MERGED from [com.android.support:support-vector-drawable:26.1.0] C:\Users\utente\.gradle\caches\transforms-2\files-2.1\1d3b376abf27db29af42117432f21daf\support-vector-drawable-26.1.0\AndroidManifest.xml:23:9-25:38
MERGED from [com.android.support:support-vector-drawable:26.1.0] C:\Users\utente\.gradle\caches\transforms-2\files-2.1\1d3b376abf27db29af42117432f21daf\support-vector-drawable-26.1.0\AndroidManifest.xml:23:9-25:38
MERGED from [com.android.support:recyclerview-v7:26.1.0] C:\Users\utente\.gradle\caches\transforms-2\files-2.1\a02d6e1eb93a3a918810cfea32f2dddc\recyclerview-v7-26.1.0\AndroidManifest.xml:23:9-25:38
MERGED from [com.android.support:recyclerview-v7:26.1.0] C:\Users\utente\.gradle\caches\transforms-2\files-2.1\a02d6e1eb93a3a918810cfea32f2dddc\recyclerview-v7-26.1.0\AndroidManifest.xml:23:9-25:38
MERGED from [com.android.support:transition:26.1.0] C:\Users\utente\.gradle\caches\transforms-2\files-2.1\23f4dec2671b2e7ec052f5750e1eefeb\transition-26.1.0\AndroidManifest.xml:23:9-25:38
MERGED from [com.android.support:transition:26.1.0] C:\Users\utente\.gradle\caches\transforms-2\files-2.1\23f4dec2671b2e7ec052f5750e1eefeb\transition-26.1.0\AndroidManifest.xml:23:9-25:38
MERGED from [com.android.support:support-v4:26.1.0] C:\Users\utente\.gradle\caches\transforms-2\files-2.1\8a8b49ac6fefc2295cb94c8290c78d69\support-v4-26.1.0\AndroidManifest.xml:26:9-28:38
MERGED from [com.android.support:support-v4:26.1.0] C:\Users\utente\.gradle\caches\transforms-2\files-2.1\8a8b49ac6fefc2295cb94c8290c78d69\support-v4-26.1.0\AndroidManifest.xml:26:9-28:38
MERGED from [com.android.support:support-media-compat:26.1.0] C:\Users\utente\.gradle\caches\transforms-2\files-2.1\020e3e414aff10cce9f59250b3ba1e0d\support-media-compat-26.1.0\AndroidManifest.xml:26:9-28:38
MERGED from [com.android.support:support-media-compat:26.1.0] C:\Users\utente\.gradle\caches\transforms-2\files-2.1\020e3e414aff10cce9f59250b3ba1e0d\support-media-compat-26.1.0\AndroidManifest.xml:26:9-28:38
MERGED from [com.android.support:support-fragment:26.1.0] C:\Users\utente\.gradle\caches\transforms-2\files-2.1\05dbe5280d2b8061ac4fd3a4ac721daa\support-fragment-26.1.0\AndroidManifest.xml:26:9-28:38
MERGED from [com.android.support:support-fragment:26.1.0] C:\Users\utente\.gradle\caches\transforms-2\files-2.1\05dbe5280d2b8061ac4fd3a4ac721daa\support-fragment-26.1.0\AndroidManifest.xml:26:9-28:38
MERGED from [com.android.support:support-core-utils:26.1.0] C:\Users\utente\.gradle\caches\transforms-2\files-2.1\4a8dbf6c9999da4d0ded9ff32c231f70\support-core-utils-26.1.0\AndroidManifest.xml:26:9-28:38
MERGED from [com.android.support:support-core-utils:26.1.0] C:\Users\utente\.gradle\caches\transforms-2\files-2.1\4a8dbf6c9999da4d0ded9ff32c231f70\support-core-utils-26.1.0\AndroidManifest.xml:26:9-28:38
MERGED from [com.android.support:support-core-ui:26.1.0] C:\Users\utente\.gradle\caches\transforms-2\files-2.1\b256d14ebc7f87d3e5da9b302f3f3d5d\support-core-ui-26.1.0\AndroidManifest.xml:26:9-28:38
MERGED from [com.android.support:support-core-ui:26.1.0] C:\Users\utente\.gradle\caches\transforms-2\files-2.1\b256d14ebc7f87d3e5da9b302f3f3d5d\support-core-ui-26.1.0\AndroidManifest.xml:26:9-28:38
MERGED from [com.android.support:support-compat:26.1.0] C:\Users\utente\.gradle\caches\transforms-2\files-2.1\183340c01d99c4ed903c01a2dcd804a3\support-compat-26.1.0\AndroidManifest.xml:26:9-28:38
MERGED from [com.android.support:support-compat:26.1.0] C:\Users\utente\.gradle\caches\transforms-2\files-2.1\183340c01d99c4ed903c01a2dcd804a3\support-compat-26.1.0\AndroidManifest.xml:26:9-28:38
	android:value
		ADDED from [com.android.support:design:26.1.0] C:\Users\utente\.gradle\caches\transforms-2\files-2.1\125d3ff0b027c78d90520e25bf5a5f2c\design-26.1.0\AndroidManifest.xml:28:13-35
	android:name
		ADDED from [com.android.support:design:26.1.0] C:\Users\utente\.gradle\caches\transforms-2\files-2.1\125d3ff0b027c78d90520e25bf5a5f2c\design-26.1.0\AndroidManifest.xml:27:13-51
meta-data#android.arch.lifecycle.VERSION
ADDED from [android.arch.lifecycle:runtime:1.0.0] C:\Users\utente\.gradle\caches\transforms-2\files-2.1\f27b791f42bc0a338f9d8bea31504c56\runtime-1.0.0\AndroidManifest.xml:25:9-27:47
	android:value
		ADDED from [android.arch.lifecycle:runtime:1.0.0] C:\Users\utente\.gradle\caches\transforms-2\files-2.1\f27b791f42bc0a338f9d8bea31504c56\runtime-1.0.0\AndroidManifest.xml:27:13-44
	android:name
		ADDED from [android.arch.lifecycle:runtime:1.0.0] C:\Users\utente\.gradle\caches\transforms-2\files-2.1\f27b791f42bc0a338f9d8bea31504c56\runtime-1.0.0\AndroidManifest.xml:26:13-58
