%YAML 1.1
%TAG !u! tag:unity3d.com,2011:
--- !u!114 &-7218990800413783576
MonoBehaviour:
  m_ObjectHideFlags: 0
  m_CorrespondingSourceObject: {fileID: 0}
  m_PrefabInstance: {fileID: 0}
  m_PrefabAsset: {fileID: 0}
  m_GameObject: {fileID: 0}
  m_Enabled: 1
  m_EditorHideFlags: 0
  m_Script: {fileID: 11500000, guid: 702666c7c7a0c534aa052d8c92f47e33, type: 3}
  m_Name: Heal
  m_EditorClassIdentifier: 
  DescriptionOverride: 
  m_HealthAmount: 20
--- !u!114 &11400000
MonoBehaviour:
  m_ObjectHideFlags: 0
  m_CorrespondingSourceObject: {fileID: 0}
  m_PrefabInstance: {fileID: 0}
  m_PrefabAsset: {fileID: 0}
  m_GameObject: {fileID: 0}
  m_Enabled: 1
  m_EditorHideFlags: 0
  m_Script: {fileID: 11500000, guid: 0eb0f26269bf3f74295367bcfe1ab170, type: 3}
  m_Name: Item_FirstAidKit
  m_EditorClassIdentifier: 
  DisplayName: First Aid Kit
  Icon: {fileID: 21300000, guid: 07afb800123cf5a4fbab02049ef77c4d, type: 3}
  Effects:
  - {fileID: -7218990800413783576}
