%YAML 1.1
%TAG !u! tag:unity3d.com,2011:
--- !u!114 &11400000
MonoBehaviour:
  m_ObjectHideFlags: 0
  m_CorrespondingSourceObject: {fileID: 0}
  m_PrefabInstance: {fileID: 0}
  m_PrefabAsset: {fileID: 0}
  m_GameObject: {fileID: 0}
  m_Enabled: 1
  m_EditorHideFlags: 0
  m_Script: {fileID: 11500000, guid: b942efa71fc1b7b46a85061b2403d236, type: 3}
  m_Name: RapidFire
  m_EditorClassIdentifier: 
  DisplayName: Rapid Fire
  Icon: {fileID: 21300000, guid: 20865877cefe4e948a03a5efb9860e52, type: 3}
  PickupSfx: {fileID: 11400000, guid: bf5811f33b68c3b4fb0b267d6e78e5a4, type: 2}
