%YAML 1.1
%TAG !u! tag:unity3d.com,2011:
--- !u!114 &-8625400579739579790
MonoBehaviour:
  m_ObjectHideFlags: 0
  m_CorrespondingSourceObject: {fileID: 0}
  m_PrefabInstance: {fileID: 0}
  m_PrefabAsset: {fileID: 0}
  m_GameObject: {fileID: 0}
  m_Enabled: 1
  m_EditorHideFlags: 0
  m_Script: {fileID: 11500000, guid: 8e624f3882444604dafbb2f4adcc6b13, type: 3}
  m_Name: Power Up
  m_EditorClassIdentifier: 
  DescriptionOverride: 
  m_PowerUpTime: 5
--- !u!114 &11400000
MonoBehaviour:
  m_ObjectHideFlags: 0
  m_CorrespondingSourceObject: {fileID: 0}
  m_PrefabInstance: {fileID: 0}
  m_PrefabAsset: {fileID: 0}
  m_GameObject: {fileID: 0}
  m_Enabled: 1
  m_EditorHideFlags: 0
  m_Script: {fileID: 11500000, guid: 0eb0f26269bf3f74295367bcfe1ab170, type: 3}
  m_Name: Item_Adrenaline
  m_EditorClassIdentifier: 
  DisplayName: Adrenaline
  Icon: {fileID: 21300000, guid: 274a30738fd18ea4b9f890fa11a20455, type: 3}
  Effects:
  - {fileID: -8625400579739579790}
