<svg width="52" height="53" viewBox="0 0 52 53" fill="none" xmlns="http://www.w3.org/2000/svg">
<g clip-path="url(#clip0_14_1631)">
<path d="M26 5.0193C32.9464 5.0193 33.7618 5.05027 36.5074 5.17413C39.0465 5.28766 40.4193 5.71085 41.3379 6.0721C42.5558 6.54689 43.4228 7.10426 44.3311 8.01255C45.2394 8.92085 45.8071 9.78786 46.2716 11.0058C46.6225 11.9244 47.056 13.2972 47.1696 15.8363C47.2934 18.5818 47.3244 19.3972 47.3244 26.3436C47.3244 33.2901 47.2934 34.1055 47.1696 36.851C47.056 39.3901 46.6328 40.7629 46.2716 41.6815C45.7968 42.8994 45.2394 43.7664 44.3311 44.6747C43.4228 45.583 42.5558 46.1507 41.3379 46.6152C40.4193 46.9661 39.0465 47.3996 36.5074 47.5132C33.7618 47.637 32.9464 47.668 26 47.668C19.0536 47.668 18.2382 47.637 15.4927 47.5132C12.9536 47.3996 11.5808 46.9764 10.6622 46.6152C9.44423 46.1404 8.57722 45.583 7.66893 44.6747C6.76063 43.7664 6.19294 42.8994 5.72847 41.6815C5.37754 40.7629 4.94403 39.3901 4.83049 36.851C4.70663 34.1055 4.67567 33.2901 4.67567 26.3436C4.67567 19.3972 4.70663 18.5818 4.83049 15.8363C4.94403 13.2972 5.36722 11.9244 5.72847 11.0058C6.20326 9.78786 6.76063 8.92085 7.66893 8.01255C8.57722 7.10426 9.44423 6.53657 10.6622 6.0721C11.5808 5.72117 12.9536 5.28766 15.4927 5.17413C18.2382 5.03994 19.0639 5.0193 26 5.0193ZM26 0.333313C18.9401 0.333313 18.0524 0.364278 15.2759 0.488136C12.5097 0.611995 10.6209 1.05582 8.96944 1.69576C7.25606 2.35634 5.81104 3.25431 4.36602 4.69933C2.921 6.14435 2.03335 7.59969 1.36245 9.30275C0.72251 10.9542 0.278682 12.843 0.154824 15.6195C0.0309647 18.3857 0 19.2734 0 26.3333C0 33.3933 0.0309647 34.2809 0.154824 37.0574C0.278682 39.8236 0.72251 41.7124 1.36245 43.3742C2.02303 45.0876 2.921 46.5326 4.36602 47.9776C5.81104 49.4227 7.26638 50.3103 8.96944 50.9812C10.6209 51.6211 12.5097 52.065 15.2862 52.1888C18.0627 52.3127 18.9401 52.3437 26.0104 52.3437C33.0806 52.3437 33.958 52.3127 36.7345 52.1888C39.5006 52.065 41.3895 51.6211 43.0513 50.9812C44.7646 50.3206 46.2097 49.4227 47.6547 47.9776C49.0997 46.5326 49.9874 45.0773 50.6583 43.3742C51.2982 41.7228 51.742 39.8339 51.8659 37.0574C51.9897 34.2809 52.0207 33.4036 52.0207 26.3333C52.0207 19.2631 51.9897 18.3857 51.8659 15.6092C51.742 12.843 51.2982 10.9542 50.6583 9.29243C49.9977 7.57905 49.0997 6.13403 47.6547 4.68901C46.2097 3.24399 44.7543 2.35634 43.0513 1.68544C41.3998 1.0455 39.511 0.601674 36.7345 0.477815C33.9476 0.364278 33.06 0.333313 26 0.333313Z" fill="#FFFEFE"/>
<path d="M26 12.9875C18.6304 12.9875 12.6439 18.9637 12.6439 26.3436C12.6439 33.7236 18.6201 39.6997 26 39.6997C33.3799 39.6997 39.3561 33.7236 39.3561 26.3436C39.3561 18.9637 33.3799 12.9875 26 12.9875ZM26 35.0034C21.2108 35.0034 17.3299 31.1225 17.3299 26.3333C17.3299 21.5441 21.2108 17.6632 26 17.6632C30.7892 17.6632 34.6701 21.5441 34.6701 26.3333C34.6701 31.1225 30.7892 35.0034 26 35.0034Z" fill="#FFFEFE"/>
<path d="M39.8825 15.568C41.604 15.568 42.9996 14.1724 42.9996 12.4509C42.9996 10.7293 41.604 9.33374 39.8825 9.33374C38.161 9.33374 36.7654 10.7293 36.7654 12.4509C36.7654 14.1724 38.161 15.568 39.8825 15.568Z" fill="#FFFEFE"/>
</g>
<defs>
<clipPath id="clip0_14_1631">
<rect width="52" height="52" fill="white" transform="translate(0 0.333313)"/>
</clipPath>
</defs>
</svg>
