{
    "id": "SPR-16692",
    "explain": "PathPatternPredicate leaves path variables in request even if predicate doesn't match",
    "project": "spring-framework",
    "base_commit": "51325afbcc021ede4fe9cb020f72aa5edcee936d",
    "build": "../buildSpring.sh",
    "folder":  "spring-webflux/src/test/java/org/springframework/web/reactive/function/server/",
    "file": "NestedRouteIntegrationTests.java",
    "test_command": "./gradlew -a :spring-webflux:test --tests 'org.springframework.web.reactive.function.server.NestedRouteIntegrationTests.removeFailedPathVariables*'",
    "test_report" : "spring-webflux/build/test-results/TEST-org.springframework.web.reactive.function.server.NestedRouteIntegrationTests.xml",
    "limit": 20,
    "jump": 100
}