{
    "students": [
        {
            "id": 1,
            "first_name": "Maria",
            "last_name": "Koulouri",
            "DoB": "10 Jan 1992",
            "image": "https://placeimg.com/200/200/people",
            "studies": [
                "National and Kapodistrian University of Athens",
                "Agile Actors Academy"
            ],
            "academy_period": "October 2019",
            "comments": []
        },
        {
            "id": 2,
            "first_name": "Ioannis",
            "last_name": "Argyriou",
            "DoB": "20 Jul 1990",
            "image": "https://placeimg.com/200/200/people",
            "studies": [
                "University of Patras",
                "Agile Actors Academy"
            ],
            "academy_period": "October 2019",
            "comments": []
        },
        {
            "id": 3,
            "first_name": "Kostas",
            "last_name": "Papadopoulos",
            "DoB": "14 Aug 1989",
            "image": "https://placeimg.com/200/200/people",
            "studies": [
                "University of Piraeus",
                "Agile Actors Academy"
            ],
            "academy_period": "October 2019",
            "comments": []
        },
        {
            "id": 4,
            "first_name": "Paulos",
            "last_name": "Kosmidis",
            "DoB": "20 Dec 1989",
            "image": "https://placeimg.com/200/200/people",
            "studies": [
                "University of Patras",
                "Agile Actors Academy"
            ],
            "academy_period": "October 2019",
            "comments": []
        },
        {
            "id": 5,
            "first_name": "Ioanna",
            "last_name": "Metaxa",
            "DoB": "10 Apr 1990",
            "image": "https://placeimg.com/200/200/people",
            "studies": [
                "University of Patras",
                "Agile Actors Academy"
            ],
            "academy_period": "February 2019",
            "comments": []
        }
    ]
}