{
  "kind": "collectionType",
  "connection": "default",
  "collectionName": "votes",
  "info": {
    "name": "vote"
  },
  "options": {
    "increments": true,
    "timestamps": true
  },
  "attributes": {
    "source": {
      "model": "source"
    }
  }
}
