{
  "kind": "collectionType",
  "connection": "default",
  "collectionName": "tags",
  "info": {
    "name": "Tag"
  },
  "options": {
    "increments": true,
    "timestamps": true
  },
  "attributes": {
    "text": {
      "type": "string",
      "required": true,
      "unique": true
    },
    "type": {
      "type": "enumeration",
      "enum": [
        "source",
        "role",
        "interest",
        "location",
        "system",
        "uncategorized"
      ],
      "required": true,
      "default": "uncategorized"
    }
  }
}
