{
  "type": "service_account",
  "project_id": "api-1234-1234",
  "private_key_id": "1234",
  "private_key": "-----BEGIN PRIVATE KEY-----\nvR81uQ==\n-----END PRIVATE KEY-----\n",
  "client_email": "google-play-api-tst@api-1234-1234.iam.gserviceaccount.com",
  "client_id": "1234",
  "auth_uri": "https://accounts.google.com/o/oauth2/auth",
  "token_uri": "https://oauth2.googleapis.com/token",
  "auth_provider_x509_cert_url": "https://www.googleapis.com/oauth2/v1/certs",
  "client_x509_cert_url": "https://www.googleapis.com/robot/v1/metadata/x509/google-play-api-tst%40api-1234-1234.iam.gserviceaccount.com"
}
