Elektronika;Artykuły elektroniczne
Moda;Artykuły odzieżowe, najnowsze trendy
Dom i ogród;Artykuły do domu i ogrodu
Supermarket;Artykuły codziennego użytku
Dziecko;Artykuły dla dzieci
Uroda;Makijaż i pielęgnacja
Zdrowie;Dbanie o zdrowie
Kultura i rozrywka;Artykuły kulturalne i rozrywkowe
Sport i turystyka;Artykuły do uprawiania sportu i rekreacji
Motoryzacja;Samochody, części do pojazdów
Kolekcje i sztuka;Kultura wyższa
Firma;Artykuły dla firm