{
    "swagger": "2.0",
    "info": {
        "description": "A book management service API in Go using Gin framework.",
        "title": "Golang Bookstore API",
        "contact": {
            "name": "Viliam L",
            "url": "https://twitter.com/"
        },
        "version": "1.0.0"
    },
    "host": "localhost:8080",
    "basePath": "/api/v1",
    "paths": {
        "/authors": {
            "get": {
                "description": "Returns the authors of specified book.",
                "produces": [
                    "application/json"
                ],
                "tags": [
                    "book"
                ],
                "summary": "Get authors of book",
                "parameters": [
                    {
                        "type": "string",
                        "description": "ISBN Book",
                        "name": "book",
                        "in": "query"
                    }
                ],
                "responses": {
                    "200": {
                        "description": "OK",
                        "schema": {
                            "type": "array",
                            "items": {
                                "$ref": "#/definitions/main.RespBooks"
                            }
                        }
                    },
                    "400": {
                        "description": "Bad Request",
                        "schema": {
                            "$ref": "#/definitions/main.ErrorResponse"
                        }
                    },
                    "500": {
                        "description": "Internal Server Error",
                        "schema": {
                            "$ref": "#/definitions/main.ErrorResponse"
                        }
                    }
                }
            }
        },
        "/version": {
            "get": {
                "description": "Returns the version, commit hash and build time.",
                "produces": [
                    "application/json"
                ],
                "tags": [
                    "version"
                ],
                "summary": "Get app version",
                "responses": {
                    "200": {
                        "description": "OK",
                        "schema": {
                            "type": "array",
                            "items": {
                                "$ref": "#/definitions/main.Versions"
                            }
                        }
                    }
                }
            }
        }
    },
    "definitions": {
        "main.ErrorResponse": {
            "type": "object",
            "properties": {
                "error": {
                    "type": "string"
                }
            }
        },
        "main.RespBooks": {
            "type": "object",
            "properties": {
                "key": {
                    "type": "string"
                },
                "name": {
                    "type": "string"
                },
                "publishDate": {
                    "type": "string"
                },
                "revision": {
                    "type": "integer"
                }
            }
        },
        "main.Versions": {
            "type": "object",
            "properties": {
                "buildTime": {
                    "type": "string"
                },
                "commit": {
                    "type": "string"
                },
                "version": {
                    "type": "string"
                }
            }
        }
    }
}