       6
na=10 nb=3 sa=0 sb=1 A=4 MB
 N  0.000000000  0.000000000 -1.994044328
 H  0.937314431  0.000000000 -1.612487239
 H -0.468657216 -0.811738109 -1.612487239
 H -0.468657216  0.811738109 -1.612487239
Li  0.000000000  0.000000000  1.926297720
 H  0.000000000  0.000000000  0.000000000
