       6
na=10 nb=16 sa=0 sb=2 A=3 MB
 O -1.771586854 -0.146687705  0.000000000
 H -1.081217471  0.468504269  0.000000000
 H -1.045208631 -0.839028947  0.000000000
 O  1.617211836  0.714699987  0.000000000
 O  1.767430161 -0.412691700  0.000000000
 H  0.000000000  0.000000000  0.000000000
