       4
na=16 nb=2 sa=2 sb=0 A=2
 O -0.150212500  0.000000000 -2.459325000
 O  1.051487500  0.000000000 -2.459325000
 H -0.450637500 -0.371400000  2.459325000
 H -0.450637500  0.371400000  2.459325000
