      12
na=15 nb=16 sa=1 sb=0 A=5 MB
 H  0.915351305  1.243438385 -3.300000000
 H  0.915351305 -1.220481615 -3.300000000
 H -0.932568695 -1.220481615 -3.300000000
 C -0.008608695  0.678658385 -3.300000000
 C -0.008608695 -0.655701615 -3.300000000
 H -0.949786086  1.266395154  3.300000000
 H  0.898133914  1.266395154  3.300000000
 H  0.898133914 -1.197524846  3.300000000
 H -0.949786086 -1.197524846  3.300000000
 C -0.025826086  0.701615154  3.300000000
 C -0.025826086 -0.632744846  3.300000000
 H  0.000000000  0.000000000  0.000000000
