       4
na=13 nb=2 sa=1 sb=0 A=2
 C -2.127000000 -0.603261192  0.000000000
 N -2.127000000  0.567338808  0.000000000
 H  2.127000000 -0.026941788  0.371400000
 H  2.127000000 -0.026941788 -0.371400000
