       4
na=13 nb=2 sa=1 sb=0 A=2 MB
 C -0.713766661  0.000000000  1.799871020
 N  0.242870401  0.000000000  2.468602187
He  0.198752542  0.000000000 -2.159888425
 H  0.000000000  0.000000000  0.000000000
