       5
na=10 nb=3 sa=0 sb=1 A=4
 N  0.000000000  0.000000000 -3.278242808
 H  0.937314431  0.000000000 -2.896685719
 H -0.468657216 -0.811738109 -2.896685719
 H -0.468657216  0.811738109 -2.896685719
Li  0.000000000  0.000000000  3.210496200
