       4
na=13 nb=2 sa=1 sb=0 A=2
 C -1.772500000 -0.607751490  0.000000000
 N -1.772500000  0.562848510  0.000000000
 H  1.772500000 -0.022451490  0.371400000
 H  1.772500000 -0.022451490 -0.371400000
