       5
na=13 nb=10 sa=1 sb=0 A=2 MB
 C  0.000000000 -0.436434806  0.497570949
 O  0.000000000  0.196238679  1.420138459
 F  0.000000000  0.109938945 -0.992070159
 H  0.000000000 -0.582542676 -1.636605903
 H  0.000000000  0.000000000  0.000000000
