       4
na=8 nb=18 sa=2 sb=0 A=2 MB
 N -0.053383811  0.000000000  2.852785087
 H  0.857533122  0.000000000  2.356786921
Ar -0.007766480  0.000000000 -2.819488491
 H  0.000000000  0.000000000  0.000000000
