       5
na=10 nb=16 sa=0 sb=2 A=3
 H -2.817761909  0.060638264  0.000000000
 O -1.871081665 -0.092282694  0.000000000
 H -1.485987099  0.786206700  0.000000000
 O  1.779105929  0.625583641  0.000000000
 O  2.025897910 -0.556431362  0.000000000
