       4
na=13 nb=2 sa=1 sb=0 A=2
 C -2.658750000 -0.596525745  0.000000000
 N -2.658750000  0.574074255  0.000000000
 H  2.658750000 -0.033677235  0.371400000
 H  2.658750000 -0.033677235 -0.371400000
