       6
na=10 nb=16 sa=0 sb=2 A=3 MB
 O -2.110051054 -0.176888534  0.000000000
 H -1.419681671  0.438303440  0.000000000
 H -1.383672831 -0.869229776  0.000000000
 O  1.955676036  0.744900815  0.000000000
 O  2.105894361 -0.382490872  0.000000000
 H  0.000000000  0.000000000  0.000000000
