       5
na=10 nb=16 sa=0 sb=2 A=3
 O -3.463907853 -0.297691848  0.000000000
 H -2.773538470  0.317500126  0.000000000
 H -2.737529630 -0.990033090  0.000000000
 O  3.309532834  0.865704130  0.000000000
 O  3.459751159 -0.261687557  0.000000000
