       5
na=13 nb=2 sa=1 sb=0 A=2 MB
 C -3.545000000 -0.585300000  0.000000000
 N -3.545000000  0.585300000  0.000000000
 H  3.545000000 -0.044902980  0.371400000
 H  3.545000000 -0.044902980 -0.371400000
 H  0.000000000  0.000000000  0.000000000
