       5
na=10 nb=9 sa=0 sb=1 A=3
 O  0.000000000  0.044068902  2.120372169
 H  0.758711083 -0.278208395  2.615518002
 H -0.758711083 -0.278208395  2.615518002
 O  0.000000000 -0.008953881 -2.233453013
 H  0.000000000  0.007029825 -1.260284266
