       4
 na=11 nb=10 sa=1 sb=0 A=1
Na  0.000009456  0.000000000 -1.221478021
 O -0.000061456  0.000000000  1.158714739
 H  0.000403251  0.758137925  1.719610276
 H  0.000403251 -0.758137925  1.719610276
