      11
na=15 nb=16 sa=1 sb=0 A=5
 H  0.905020870  1.257212446 -1.980000000
 H  0.905020870 -1.206707554 -1.980000000
 H -0.942899130 -1.206707554 -1.980000000
 C -0.018939130  0.692432446 -1.980000000
 C -0.018939130 -0.641927554 -1.980000000
 H -0.939455652  1.252621093  1.980000000
 H  0.908464348  1.252621093  1.980000000
 H  0.908464348 -1.211298907  1.980000000
 H -0.939455652 -1.211298907  1.980000000
 C -0.015495652  0.687841093  1.980000000
 C -0.015495652 -0.646518907  1.980000000
