       4
na=13 nb=2 sa=1 sb=0 A=2 MB
 C -0.846268356  0.000000000  3.239796637
 N  0.110368706  0.000000000  3.908527804
He  0.331254237  0.000000000 -3.599814042
 H  0.000000000  0.000000000  0.000000000
