       9
na=15  nb=22  sa=1  sb=0  A=5  MB
 C -2.211871902 -0.757397162 -0.388075516
 C -2.674800852  0.402842478  0.013614404
 H -2.471335252 -1.798984992 -0.276274436
 H -3.564674422  0.467725078  0.640810514
 H -2.195072472  1.337567998 -0.257252816
 C  2.471514302  0.155655124  0.161635870
 O  2.267126682  1.244536604 -0.195935860
 O  2.690766382 -0.928917556  0.521030940
 H  0.000000000  0.000000000  0.000000000
