       8
na=15  nb=22  sa=1  sb=0  A=5 
 C -1.716488264 -0.725952849 -0.355615769
 C -2.179417214  0.434286791  0.046074151
 H -1.975951614 -1.767540679 -0.243814689
 H -3.069290784  0.499169391  0.673270261
 H -1.699688834  1.369012311 -0.224793069
 C  1.976130664  0.124210811  0.129176123
 O  1.771743044  1.213092291 -0.228395607
 O  2.195382744 -0.960361869  0.488571193
