       5
na=16 nb=2 sa=2 sb=0 A=2 MB
 O -0.330467500  0.000000000 -1.475595000
 O  0.871232500  0.000000000 -1.475595000
 H -0.270382500 -0.371400000  1.475595000
 H -0.270382500  0.371400000  1.475595000
 H  0.000000000  0.000000000  0.000000000
