       7
na=16 nb=9  sa=0 sb=1 A=4
 C -0.101334404  1.309903834  0.000000000
 H  0.475160596  1.401144834  0.932814000
 H  0.475160596  1.401144834 -0.932814000
 O -1.294782404  1.126008834  0.000000000
 N  0.727791868 -1.144301441  0.000000000
 H -0.255227132 -1.433449441  0.000000000
 H  1.246142868 -2.027340441  0.000000000
