<?xml version="1.0" encoding="UTF-8" standalone="no" ?>
<!DOCTYPE svg PUBLIC "-//W3C//DTD SVG 1.1//EN" "http://www.w3.org/Graphics/SVG/1.1/DTD/svg11.dtd">
<svg xmlns="http://www.w3.org/2000/svg" xmlns:xlink="http://www.w3.org/1999/xlink" version="1.1" width="48" height="48" viewBox="0 0 48 48" xml:space="preserve">
<desc>Created with Fabric.js 4.6.0</desc>
<defs>
</defs>
<g transform="matrix(1 0 0 1 23.85 7.1)" id="avyf-JZb-pvglSxz7ZiCZ"  >
<path style="stroke: none; stroke-width: 1; stroke-dasharray: none; stroke-linecap: butt; stroke-dashoffset: 0; stroke-linejoin: miter; stroke-miterlimit: 4; fill: rgb(180,188,195); fill-rule: nonzero; opacity: 1;" vector-effect="non-scaling-stroke"  transform=" translate(-17, -2)" d="M 0 4 L 0 0 L 34 0 L 34 4 z" stroke-linecap="round" />
</g>
<g transform="matrix(1 0 0 1 23.85 26.1)" id="ROVJm9T5ufM7Tysc1AF8W"  >
<path style="stroke: none; stroke-width: 1; stroke-dasharray: none; stroke-linecap: butt; stroke-dashoffset: 0; stroke-linejoin: miter; stroke-miterlimit: 4; fill: rgb(240,248,255); fill-rule: nonzero; opacity: 1;" vector-effect="non-scaling-stroke"  transform=" translate(-24, -26)" d="M 9 9 L 10.779 39.235 C 10.903422329297513 41.34916882582399 12.654173109577384 42.99995186808638 14.772 43 L 33.228 43 C 35.345826890422614 42.99995186808638 37.09657767070249 41.349168825823995 37.221000000000004 39.235 L 39 9 Z" stroke-linecap="round" />
</g>
<g transform="matrix(1 0 0 1 23.85 26.1)" id="pOxcge0osOv1PWYrHhJcn"  >
<path style="stroke: none; stroke-width: 1; stroke-dasharray: none; stroke-linecap: butt; stroke-dashoffset: 0; stroke-linejoin: miter; stroke-miterlimit: 4; fill: rgb(234,239,240); fill-rule: nonzero; opacity: 1;" vector-effect="non-scaling-stroke"  transform=" translate(-4, -2)" d="M 0 4 L 0 0 L 8 0 L 8 4 z" stroke-linecap="round" />
</g>
<g transform="matrix(1 0 0 1 23.85 24.1)" id="-mT4MK2tHCyzzPwdbwn0B"  >
<path style="stroke: none; stroke-width: 1; stroke-dasharray: none; stroke-linecap: butt; stroke-dashoffset: 0; stroke-linejoin: miter; stroke-miterlimit: 4; fill: rgb(0,0,0); fill-rule: nonzero; opacity: 1;" vector-effect="non-scaling-stroke"  transform=" translate(0, 0)" d="M 19.969 -15.917 C 19.994690000000002 -16.45501 19.79964 -16.98019 19.429000000000002 -17.371 C 19.056160000000002 -17.76362 18.54136 -17.990219999999997 18.000000000000004 -18 L 18.000000000000004 -18 C 18.000000000000004 -19.10457 17.104570000000002 -20 16.000000000000004 -20 L 7.608700000000004 -20 L -15.999999999999995 -20 C -17.104569999999995 -20 -17.999999999999993 -19.10457 -17.999999999999993 -18 L -17.999999999999993 -18 C -18.540919999999993 -17.99101 -19.055649999999993 -17.76552 -19.42899999999999 -17.374 C -19.799639999999993 -16.98319 -19.99468999999999 -16.458009999999998 -19.96899999999999 -15.919999999999998 C -19.73872999999999 -11.625719999999998 -18.12500999999999 -7.521249999999998 -15.368999999999991 -4.219999999999999 L -14.219999999999992 15.294 C -14.061919999999992 17.935380000000002 -11.875109999999992 19.997320000000002 -9.228999999999992 20 L 9.229000000000006 20 C 11.875110000000006 19.99732 14.061920000000006 17.93538 14.220000000000006 15.294 L 15.367000000000006 -4.216000000000001 C 18.123930000000005 -7.517260000000001 19.738380000000006 -11.622140000000002 19.96900000000001 -15.917000000000002 z M 4.53 0.4 C 3.9828400000000004 -0.46995999999999993 3.0277200000000004 -0.99849 2.0000000000000004 -0.9999999999999999 L -1.9999999999999996 -0.9999999999999999 C -3.0277199999999995 -0.9984899999999999 -3.9828399999999995 -0.46995999999999993 -4.529999999999999 0.4 C -7.959999999999999 -0.48697 -11.05037 -2.37021 -13.411 -5.012 L -13.94 -14 L 3.260869999999999 -14 L 13.94 -14 L 13.411 -5.0120000000000005 C 11.050989999999999 -2.3694600000000006 7.96038 -0.4860800000000003 4.529999999999999 0.39999999999999947 z M -2 1 L 2 1 C 2.55228 1 3 1.44772 3 2 C 3 2.55228 2.55228 3 2 3 L -2 3 C -2.55228 3 -3 2.55228 -3 2 C -3 1.44772 -2.55228 1 -2 1 z M 15.943 -14 L 16 -14 C 16.89608 -14.00389 17.6802 -14.60332 17.919 -15.467 C 17.69954 -12.84661 16.90465 -10.306920000000002 15.591000000000001 -8.029 z M -16 -18 L 16 -18 L 16 -16 L -16 -16 z M -17.92 -15.47 C -17.68222 -14.60477 -16.8973 -14.003810000000001 -16 -14 L -15.943 -14 L -15.591 -8.023 C -16.90754 -10.30298 -17.70291 -12.84618 -17.919999999999998 -15.469999999999999 z M 12.224 15.177 C 12.1303 16.76243 10.81719 18.00012 9.229 18 L -9.229 18 C -10.81912 18.00277 -12.13519 16.76436 -12.229 15.177 L -13.239999999999998 -2.0229999999999997 C -10.870929999999998 0.07388000000000039 -8.035239999999998 1.5745200000000001 -4.968999999999998 2.354 C -4.792659999999998 3.86084 -3.5171199999999976 4.99761 -1.9999999999999978 5 L 2.000000000000002 5 C 3.5152100000000024 4.99509 4.787890000000003 3.85895 4.964000000000002 2.354 C 8.030240000000003 1.5745200000000001 10.865930000000002 0.07387999999999995 13.235000000000003 -2.0229999999999997 z" stroke-linecap="round" />
</g>
</svg>