{
    "schemaVersion": "v1",
    "tracks": [
        {
            "id": 1,
            "title": "Amazing Grace",
            "artist": "Kevin MacLeod",
            "year": 2005,
            "url": "https://freepd.com/music/Amazing%20Grace.mp3",
            "cover": "https://ooo.0x0.ooo/2023/10/13/O1ul7s.jpg"
        },
        {
            "id": 2,
            "title": "A Very Brady Special",
            "artist": "Kevin MacLeod",
            "year": 2019,
            "url": "https://freepd.com/music/A%20Very%20Brady%20Special.mp3",
            "cover": "https://ooo.0x0.ooo/2023/10/16/O7b9ES.jpg"
        },
        {
            "id": 3,
            "title": "Brothers Unite",
            "artist": "Alexander Nakarada",
            "year": 2017,
            "url": "https://freepd.com/music/Brothers%20Unite.mp3",
            "cover": "https://ooo.0x0.ooo/2023/10/16/O7bfaK.jpg"
        },
        {
            "id": 4,
            "title": "Burt's Requiem",
            "artist": "Alexander Nakarada",
            "year": 2017,
            "url": "https://freepd.com/music/Burt's%20Requiem.mp3",
            "cover": "https://ooo.0x0.ooo/2023/10/16/O7blea.jpg"
        },
        {
            "id": 5,
            "title": "Champ de tournesol",
            "artist": "Komiku",
            "year": 2016,
            "url": "https://freepd.com/music/Champ%20de%20tournesol.mp3",
            "cover": "https://ooo.0x0.ooo/2023/10/16/O7bjIN.jpg"
        },
        {
            "id": 6,
            "title": "Horizon Flare",
            "artist": "Alexander Nakarada",
            "year": 2017,
            "url": "https://freepd.com/music/Horizon%20Flare.mp3",
            "cover": "https://ooo.0x0.ooo/2023/10/16/O7bVds.jpg"
        },
        {
            "id": 7,
            "title": "Isolation Waltz",
            "artist": "Bryan Teoh",
            "year": 2020,
            "url": "https://freepd.com/music/Isolation%20Waltz.mp3",
            "cover": "https://ooo.0x0.ooo/2023/10/16/O7bIUX.jpg"
        },
        {
            "id": 8,
            "title": "La Citadelle",
            "artist": "Komiku",
            "year": 2016,
            "url": "https://freepd.com/music/La%20Citadelle.mp3",
            "cover": "https://ooo.0x0.ooo/2023/10/16/O7bCsx.jpg"
        },
        {
            "id": 9,
            "title": "Landra's Dream",
            "artist": "Jason Shaw",
            "year": 2013,
            "url": "https://freepd.com/music/Landra's%20Dream.mp3",
            "cover": "https://ooo.0x0.ooo/2023/10/16/O7b3yt.jpg"
        },
        {
            "id": 10,
            "title": "Lovely Piano Song",
            "artist": "Rafael Krux",
            "year": 2022,
            "url": "https://freepd.com/music/Lovely%20Piano%20Song.mp3",
            "cover": "https://ooo.0x0.ooo/2023/10/16/O7bXji.jpg"
        },
        {
            "id": 11,
            "title": "Nostalgic Piano",
            "artist": "Rafael Krux",
            "year": 2020,
            "url": "https://freepd.com/music/Nostalgic%20Piano.mp3",
            "cover": "https://ooo.0x0.ooo/2023/10/16/O7b8RL.jpg"
        },
        {
            "id": 12,
            "title": "Parhelion",
            "artist": "Alexander Nakarada",
            "year": 2017,
            "url": "https://freepd.com/music/Parhelion.mp3",
            "cover": "https://ooo.0x0.ooo/2023/10/16/O7kaGU.jpg"
        },
        {
            "id": 13,
            "title": "Patience Party",
            "artist": "Kevin MacLeod",
            "year": 2016,
            "url": "https://freepd.com/music/Patience%20Party.mp3",
            "cover": "https://ooo.0x0.ooo/2023/10/16/O7koIY.jpg"
        },
        {
            "id": 14,
            "title": "Piano Magic Motive",
            "artist": "Kevin MacLeod",
            "year": 2019,
            "url": "https://freepd.com/music/Piano%20Magic%20Motive.mp3",
            "cover": "https://ooo.0x0.ooo/2023/10/16/O7kMaj.jpg"
        },
        {
            "id": 15,
            "title": "Pina Colada",
            "artist": "Alexander Nakarada",
            "year": 2017,
            "url": "https://freepd.com/music/Pina%20Colada.mp3",
            "cover": "https://ooo.0x0.ooo/2023/10/16/O7kOep.jpg"
        },
        {
            "id": 16,
            "title": "Pond",
            "artist": "Rafael Krux",
            "year": 2020,
            "url": "https://freepd.com/music/Pond.mp3",
            "cover": "https://ooo.0x0.ooo/2023/10/16/O7k5hv.jpg"
        },
        {
            "id": 17,
            "title": "Romantic Inspiration",
            "artist": "Rafael Krux",
            "year": 2020,
            "url": "https://freepd.com/music/Romantic%20Inspiration.mp3",
            "cover": "https://ooo.0x0.ooo/2023/10/16/O7kBtq.jpg"
        },
        {
            "id": 18,
            "title": "Shining Stars",
            "artist": "Rafael Krux",
            "year": 2020,
            "url": "https://freepd.com/music/Shining%20Stars.mp3",
            "cover": "https://ooo.0x0.ooo/2023/10/16/O7kWWr.jpg"
        },
        {
            "id": 19,
            "title": "Winter",
            "artist": "Alexander Nakarada",
            "year": 2017,
            "url": "https://freepd.com/music/Winter.mp3",
            "cover": "https://ooo.0x0.ooo/2023/10/16/O7kTjc.jpg"
        },
        {
            "id": 20,
            "title": "Night in Venice",
            "artist": "Kevin MacLeod",
            "year": 2019,
            "url": "https://freepd.com/music/Night%20in%20Venice.mp3",
            "cover": "https://ooo.0x0.ooo/2023/10/16/O7kbgM.jpg"
        }
    ]
}