file: <<anmelden>><<name>>file<</name>><<passwort>>./Hochzeit/Partner.dokolounge<</passwort>><<WebClientInfo>>web-version egal<</WebClientInfo>><</anmelden>>
FreeDoko 3-4: <<TischBeitreten>><<name>>FreeDoko 3-4<</name>><<tisch>>0<</tisch>><</TischBeitreten>>
party open
FreeDoko 3-4: clear write buffer
FreeDoko 3-4: <<Refresh>>FreeDoko 3-4<</Refresh>>
FreeDoko 3-4: clear write buffer
FreeDoko 3-4: <<Refresh>>FreeDoko 3-4<</Refresh>>
FreeDoko 3-4: <<Refresh>>FreeDoko 3-4<</Refresh>>
FreeDoko 3-4: Hand:
0  heart queen
1  diamond jack
2  diamond jack
3  diamond ace
4  diamond ace
5  club ace
6  club ten
7  spade ace
8  spade king
9  heart king
a  heart king
b  heart nine
FreeDoko 3-4: <<Meldung>>FreeDoko 3-4:Gesund<</Meldung>>
FreeDoko 3-4: Spieltyp: marriage
FreeDoko 3-4: Solospieler: 2
FreeDoko 3-4: swines = 3
FreeDoko 3-4: card played = 0, club nine
FreeDoko 3-4: card played = 1, club nine
FreeDoko 3-4: card played = 2, club king
FreeDoko 3-4: <<kartenlegen>><<tisch>>3<</tisch>><<name>>FreeDoko 3-4<</name>><<karte>>13<</karte>><</kartenlegen>>
FreeDoko 3-4: card played = 3, club ace
FreeDoko 3-4: trick full = 0, club nine, club nine, club king, club ace, 3
FreeDoko 3-4: <<kartenlegen>><<tisch>>3<</tisch>><<name>>FreeDoko 3-4<</name>><<karte>>19<</karte>><</kartenlegen>>
FreeDoko 3-4: card played = 3, diamond ace
FreeDoko 3-4: card played = 0, diamond king
FreeDoko 3-4: card played = 1, diamond nine
FreeDoko 3-4: card played = 2, diamond ten
FreeDoko 3-4: trick full = 3, diamond ace, diamond king, diamond nine, diamond ten, 3
FreeDoko 3-4: <<kartenlegen>><<tisch>>3<</tisch>><<name>>FreeDoko 3-4<</name>><<karte>>19<</karte>><</kartenlegen>>
FreeDoko 3-4: card played = 3, diamond ace
FreeDoko 3-4: card played = 0, diamond king
FreeDoko 3-4: card played = 1, heart jack
FreeDoko 3-4: card played = 2, spade jack
FreeDoko 3-4: trick full = 3, diamond ace, diamond king, heart jack, spade jack, 3
FreeDoko 3-4: <<kartenlegen>><<tisch>>3<</tisch>><<name>>FreeDoko 3-4<</name>><<karte>>19<</karte>><</kartenlegen>>
FreeDoko 3-4: card played = 3, spade ace
FreeDoko 3-4: card played = 0, spade king
FreeDoko 3-4: card played = 1, spade nine
FreeDoko 3-4: card played = 2, spade ten
FreeDoko 3-4: trick full = 3, spade ace, spade king, spade nine, spade ten, 3
FreeDoko 3-4: <<kartenlegen>><<tisch>>3<</tisch>><<name>>FreeDoko 3-4<</name>><<karte>>20<</karte>><</kartenlegen>>
FreeDoko 3-4: card played = 3, heart nine
FreeDoko 3-4: card played = 0, spade ten
FreeDoko 3-4: card played = 1, heart ace
FreeDoko 3-4: card played = 2, heart ace
FreeDoko 3-4: trick full = 3, heart nine, spade ten, heart ace, heart ace, 1
FreeDoko 3-4: card played = 1, heart nine
FreeDoko 3-4: card played = 2, diamond nine
FreeDoko 3-4: <<kartenlegen>><<tisch>>3<</tisch>><<name>>FreeDoko 3-4<</name>><<karte>>2<</karte>><</kartenlegen>>
Ende der Datei erreicht
