file: <<anmelden>><<name>>file<</name>><<passwort>>./ins_Spiel/zweiter_Stich.dokolounge<</passwort>><<WebClientInfo>>web-version egal<</WebClientInfo>><</anmelden>>
FreeDoko 11: <<TischBeitreten>><<name>>FreeDoko 11<</name>><<tisch>>0<</tisch>><</TischBeitreten>>
party open
FreeDoko 11: clear write buffer
FreeDoko 11: <<Refresh>>FreeDoko 11<</Refresh>>
FreeDoko 11: <<Refresh>>FreeDoko 11<</Refresh>>
FreeDoko 11: <<Refresh>>FreeDoko 11<</Refresh>>
FreeDoko 11: <<Refresh>>FreeDoko 11<</Refresh>>
FreeDoko 11: <<Refresh>>FreeDoko 11<</Refresh>>
FreeDoko 11: Hand:
0  heart ten
1  club queen
2  spade queen
3  diamond queen
4  diamond queen
5  club jack
6  spade jack
7  spade jack
8  diamond ace
9  club king
a  spade nine
b  unknown
FreeDoko 11: Spieltyp: normal
FreeDoko 11: card played = 1, club ace
FreeDoko 11: card played = 2, club ten
FreeDoko 11: card played = 3, club nine
FreeDoko 11: card played = 0, club nine
FreeDoko 11: announcement = 1, no 120
FreeDoko 11: <<Ansage>><<Spieler>>FreeDoko 11<</Spieler>><<Ans>>Re keine 120<</Ans>><</Ansage>>
FreeDoko 11: <<kartenlegen>><<tisch>>2<</tisch>><<name>>FreeDoko 11<</name>><<karte>>46<</karte>><</kartenlegen>>
FreeDoko 11: announcement = 1, no 120
FreeDoko 11: card played = 1, club king
FreeDoko 11: card played = 2, club king
FreeDoko 11: card played = 3, club ten
FreeDoko 11: card played = 0, club ace
FreeDoko 11: trick full = 1, club king, club king, club ten, club ace, 0
FreeDoko 11: card played = 0, spade ace
FreeDoko 11: <<kartenlegen>><<tisch>>2<</tisch>><<name>>FreeDoko 11<</name>><<karte>>24<</karte>><</kartenlegen>>
FreeDoko 11: card played = 1, spade nine
FreeDoko 11: card played = 2, spade nine
FreeDoko 11: card played = 3, spade king
FreeDoko 11: trick full = 0, spade ace, spade nine, spade nine, spade king, 0
FreeDoko 11: card played = 0, heart ace
FreeDoko 11: <<kartenlegen>><<tisch>>2<</tisch>><<name>>FreeDoko 11<</name>><<karte>>7<</karte>><</kartenlegen>>
FreeDoko 11: card played = 1, diamond ace
FreeDoko 11: card played = 2, heart king
FreeDoko 11: card played = 3, heart nine
FreeDoko 11: trick full = 0, heart ace, diamond ace, heart king, heart nine, 1
FreeDoko 11: <<kartenlegen>><<tisch>>2<</tisch>><<name>>FreeDoko 11<</name>><<karte>>46<</karte>><</kartenlegen>>
FreeDoko 11: card played = 1, spade jack
FreeDoko 11: card played = 2, spade queen
FreeDoko 11: card played = 3, diamond king
FreeDoko 11: card played = 0, diamond king
FreeDoko 11: trick full = 1, spade jack, spade queen, diamond king, diamond king, 2
FreeDoko 11: card played = 2, heart nine
FreeDoko 11: card played = 3, heart ace
FreeDoko 11: card played = 0, heart king
FreeDoko 11: <<kartenlegen>><<tisch>>2<</tisch>><<name>>FreeDoko 11<</name>><<karte>>22<</karte>><</kartenlegen>>
FreeDoko 11: card played = 1, spade jack
FreeDoko 11: trick full = 2, heart nine, heart ace, heart king, spade jack, 1
FreeDoko 11: <<kartenlegen>><<tisch>>2<</tisch>><<name>>FreeDoko 11<</name>><<karte>>40<</karte>><</kartenlegen>>
FreeDoko 11: card played = 1, club jack
FreeDoko 11: card played = 2, club queen
FreeDoko 11: card played = 3, heart ten
FreeDoko 11: card played = 0, diamond ten
FreeDoko 11: trick full = 1, club jack, club queen, heart ten, diamond ten, 3
FreeDoko 11: card played = 3, diamond nine
FreeDoko 11: card played = 0, diamond jack
FreeDoko 11: <<kartenlegen>><<tisch>>2<</tisch>><<name>>FreeDoko 11<</name>><<karte>>33<</karte>><</kartenlegen>>
FreeDoko 11: card played = 1, diamond queen
FreeDoko 11: card played = 2, diamond jack
FreeDoko 11: trick full = 3, diamond nine, diamond jack, diamond queen, diamond jack, 1
FreeDoko 11: <<kartenlegen>><<tisch>>2<</tisch>><<name>>FreeDoko 11<</name>><<karte>>9<</karte>><</kartenlegen>>
FreeDoko 11: card played = 1, diamond queen
FreeDoko 11: card played = 2, heart queen
FreeDoko 11: card played = 3, diamond ace
FreeDoko 11: card played = 0, heart jack
FreeDoko 11: trick full = 1, diamond queen, heart queen, diamond ace, heart jack, 2
FreeDoko 11: card played = 2, diamond nine
FreeDoko 11: card played = 3, heart queen
FreeDoko 11: card played = 0, heart jack
FreeDoko 11: <<kartenlegen>><<tisch>>2<</tisch>><<name>>FreeDoko 11<</name>><<karte>>45<</karte>><</kartenlegen>>
FreeDoko 11: card played = 1, spade queen
FreeDoko 11: trick full = 2, diamond nine, heart queen, heart jack, spade queen, 1
FreeDoko 11: <<kartenlegen>><<tisch>>2<</tisch>><<name>>FreeDoko 11<</name>><<karte>>39<</karte>><</kartenlegen>>
FreeDoko 11: card played = 1, club queen
FreeDoko 11: card played = 2, spade ten
FreeDoko 11: card played = 3, club jack
FreeDoko 11: card played = 0, spade king
FreeDoko 11: trick full = 1, club queen, spade ten, club jack, spade king, 1
FreeDoko 11: <<kartenlegen>><<tisch>>2<</tisch>><<name>>FreeDoko 11<</name>><<karte>>5<</karte>><</kartenlegen>>
FreeDoko 11: card played = 1, heart ten
FreeDoko 11: card played = 2, spade ace
Ende der Datei erreicht
