Depth his:891.000

Depth 15c:842.000
Depth 15c-his(*2):-10.999%

Depth 20c:833.000
Depth 20c-his(*2):-13.019%

Depth 30c:797.000
Depth 30c-his(*2):-21.100%

Depth 20c-15c(*2):-2.138%
Depth 30c-15c(*2):-10.689%
