{
    "required": true,
    "minVersion": "0.8",
    "package": "net.zombiemod.mixin",
    "compatibilityLevel": "JAVA_8",
    "mixins": [
        "ZombieModSpawnMixin",
        "SpawnRestrictionMixin"
    ],
    "client": [
    ],
    "injectors": {
        "defaultRequire": 1
    }
}
