{
  "required": true,
  "minVersion": "0.8",
  "package": "net.spidermod.mixin",
  "compatibilityLevel": "JAVA_8",
  "mixins": [
  ],
  "client": [
    "SpiderSpawnMixin",
    "SpawnRestrictionMixin"
  ],
  "injectors": {
    "defaultRequire": 1
  }
}
