{
    "_comment": [
        "Parachute mod crafting recipe"
    ],
    "type": "minecraft:crafting_shaped",
    "group": "transportation",
    "pattern": [
        "###",
        "X$X",
        " L "
    ],
    "key": {
        "#": {
            "item": "minecraft:yellow_wool"
        },
        "X": {
            "item": "minecraft:string"
        },
        "$": {
            "item": "minecraft:redstone"
        },
        "L": {
            "tag": "parachutemod:hide"
        }
    },
    "result": {
        "item": "parachutemod:yellow_powered_paraglider"
    }
}