{
    "type": "minecraft:crafting_shapeless",
    "group": "transportation",
    "ingredients": [
        {
            "item": "parachutemod:white_powered_paraglider"
        },
        {
            "item": "minecraft:brown_dye"
        }
    ],
    "result": {
        "item": "parachutemod:brown_powered_paraglider"
    }
}