{
    "chuteopen": {
        "category": "neutral",
        "sounds": [
            "parachutemod:chuteopen1",
            "parachutemod:chuteopen2",
            "parachutemod:chuteopen3",
            "parachutemod:chuteopen4"
        ]
    },
    "lift": {
        "category": "neutral",
        "sounds": [
            "parachutemod:lift1"
        ]
    }
}
