{
    "type": "minecraft:crafting_shapeless",
    "group": "transportation",
    "ingredients": [
        {
            "item": "parachutemod:white_parachute"
        },
        {
            "item": "minecraft:green_dye"
        }
    ],
    "result": {
        "item": "parachutemod:green_parachute"
    }
}