{
    "_comment": [
        "Parachute mod crafting recipe"
    ],
    "type": "minecraft:crafting_shaped",
    "group": "transportation",
    "pattern": [
        "###",
        "X X",
        " L "
    ],
    "key": {
        "#": {
            "item": "minecraft:cyan_wool"
        },
        "X": {
            "item": "minecraft:string"
        },
        "L": {
            "tag": "parachutemod:hide"
        }
    },
    "result": {
        "item": "parachutemod:cyan_parachute"
    }
}