{
    "type": "minecraft:crafting_shaped",
    "pattern": [
        "X X",
        "XXX",
        "XXX"
    ],
    "key": {
        "X": {
            "item": "crocmod:croc_hide"
        }
    },
    "result": {
        "item": "minecraft:chainmail_chestplate"
    }
}