{
  "schemaVersion": 1,
  "id": "chameleoncreepermod",
  "version": "${version}",
  "name": "Chameleoncreepermod",
  "description": "Creepers change color with the biome they are in",
  "authors": [
    "MichaelSheppard"
  ],
  "contact": {},
  "license": "LGPL-3.0",
  "environment": "*",
  "entrypoints": {
    "client": [
      "net.chameleoncreepermod.client.ChameleonCreeperModClient"
    ],
    "main": [
      "net.chameleoncreepermod.common.ChameleonCreeperMod"
    ]
  },
  "mixins": [
    "chameleoncreepermod.mixins.json"
  ],
  "depends": {
    "fabricloader": ">=0.13.3",
    "fabric": "*",
    "minecraft": "1.18.2"
  }
}
