{
    "schemaVersion": 1,
    "id": "animalcontrolmod",
    "version": "${version}",
    "name": "Animalcontrolmod",
    "description": "controls mob spawning",
    "authors": [],
    "contact": {},
    "license": "GPL-3.0",
    "icon": "assets/animalcontrolmod/icon.png",
    "environment": "*",
    "entrypoints": {
        "client": [
            "net.animalcontrolmod.client.AnimalControlModClient"
        ],
        "main": [
            "net.animalcontrolmod.common.AnimalControlMod"
        ]
    },
    "mixins": [
        "animalcontrolmod.mixins.json"
    ],
    "depends": {
        "fabricloader": ">=0.11.2",
        "fabric": "*",
        "minecraft": ">=1.17"
    }
}
