{
    "required": true,
    "minVersion": "0.8",
    "package": "net.animalcontrolmod.mixins",
    "compatibilityLevel": "JAVA_17",
    "mixins": [
        "DefaultBiomeFeaturesMixin",
        "OverworldBiomeCreatorMixin"
    ],
    "client": [
    ],
    "injectors": {
        "defaultRequire": 1
    }
}
