Division,WeightClassKg,Place,Name,Team,BodyweightKg,Best3SquatKg,Best3BenchKg,Best3DeadliftKg,TotalKg,Equipment,Event,Sex,BirthDate
Boys,51.71,1,Manuel Padilla,Rice,50.98,113.4,79.38,113.4,306.17,Single-ply,SBD,M,
Boys,51.71,2,Weslee Duke,Groesbeck,51.17,102.06,68.04,136.08,306.17,Single-ply,SBD,M,
Boys,55.79,1,Christian Charles,Ennis,55.79,124.74,92.99,176.9,394.63,Single-ply,SBD,M,
Boys,55.79,2,Ruben Salazar,West,54.7,154.22,86.18,147.42,387.82,Single-ply,SBD,M,
Boys,55.79,3,Eli Norcross,Wortham,52.25,111.13,68.04,136.08,315.25,Single-ply,SBD,M,
Boys,55.79,4,Wesley Romero,Palmer,55.52,102.06,65.77,142.88,310.71,Single-ply,SBD,M,
Boys,55.79,5,Francisco Saldania,Buffalo,54.52,102.06,61.23,136.08,299.37,Single-ply,SBD,M,
Boys,55.79,6,Ryan Williams #7,West,52.44,113.4,58.97,122.47,294.84,Single-ply,SBD,M,
Boys,55.79,7,Austin Michael,Palmer,53.25,77.11,52.16,104.33,233.6,Single-ply,SBD,M,
Boys,55.79,8,Landon Ledbetter,Palmer,55.79,90.72,45.36,97.52,233.6,Single-ply,SBD,M,
Boys,59.87,1,Trevor Uptmor,West,58.15,181.44,106.59,190.51,478.54,Single-ply,SBD,M,
Boys,59.87,2,Caiden Kocian,West,56.97,167.83,83.91,172.37,424.11,Single-ply,SBD,M,
Boys,59.87,3,Dalton Wootan,Whitney,59.87,140.61,90.72,147.42,378.75,Single-ply,SBD,M,
Boys,59.87,4,Victor Garcia,Itasca,59.15,131.54,68.04,136.08,335.66,Single-ply,SBD,M,
Boys,59.87,5,Christian Henderson,Waxahachie Life,57.88,117.93,81.65,120.2,319.78,Single-ply,SBD,M,
Boys,59.87,6,Preston Batts,Wortham,59.87,111.13,68.04,138.35,317.51,Single-ply,SBD,M,
Boys,59.87,7,Hayden Jenson,Whitney,59.87,122.47,52.16,136.08,310.71,Single-ply,SBD,M,
Boys,59.87,8,Manny Gomez,Maypearl,59.24,99.79,72.57,124.74,297.1,Single-ply,SBD,M,
Boys,59.87,9,Hunter Jenson,Whitney,57.79,106.59,63.5,122.47,292.57,Single-ply,SBD,M,
Boys,59.87,10,Omar Hernandez #4,Ferris,59.87,108.86,56.7,124.74,290.3,Single-ply,SBD,M,
Boys,59.87,11,Adam Berrnal,Rice,59.6,124.74,70.31,90.72,285.76,Single-ply,SBD,M,
Boys,59.87,12,Xander Cheek,Buffalo,59.33,90.72,54.43,108.86,254.01,Single-ply,SBD,M,
Boys,67.13,1,Michael Martinez,Ennis,66.95,183.7,102.06,170.1,455.86,Single-ply,SBD,M,
Boys,67.13,2,Bernardo Garcia,Itasca,61.05,165.56,90.72,170.1,426.38,Single-ply,SBD,M,
Boys,67.13,3,Noah Lopez,Scurry-Rosser,63.68,151.95,86.18,151.95,390.09,Single-ply,SBD,M,
Boys,67.13,4,Brandon Renteria,Buffalo,60.6,127.01,83.91,170.1,381.02,Single-ply,SBD,M,
Boys,67.13,5,Xavier Garza,Itasca,63.59,149.69,72.57,151.95,374.21,Single-ply,SBD,M,
Boys,67.13,6,Jacob Divin,West,66.32,133.81,79.38,158.76,371.95,Single-ply,SBD,M,
Boys,67.13,7,Connor Mayfield,Whitney,64.95,131.54,79.38,147.42,358.34,Single-ply,SBD,M,
Boys,67.13,8,Juan Galindo,Rice,64.59,129.27,74.84,129.27,333.39,Single-ply,SBD,M,
Boys,67.13,9,Andrew Silva,Rice,64.41,113.4,56.7,124.74,294.84,Single-ply,SBD,M,
Boys,67.13,10,Nick Lopez,Palmer,65.5,102.06,65.77,124.74,292.57,Single-ply,SBD,M,
Boys,67.13,11,Tanner Marak,West,64.86,111.13,61.23,97.52,269.89,Single-ply,SBD,M,
Boys,67.13,12,Abraham Saldana,Wortham,64.68,102.06,49.9,113.4,265.35,Single-ply,SBD,M,
Boys,67.13,DQ,Dawson Norcross,Wortham,66.32,,,,,Single-ply,SBD,M,
Boys,67.13,DQ,Braydon Dickey,Trinidad,65.41,,,,,Single-ply,SBD,M,
Boys,67.13,DQ,William Lyendecker,Hubbard,67.13,,,,,Single-ply,SBD,M,
Boys,67.13,DQ,Coker Holloway,Groesbeck,67.13,,,,,Single-ply,SBD,M,
Boys,74.84,1,Jacob Lynch,Rice,74.39,197.31,113.4,192.78,503.49,Single-ply,SBD,M,
Boys,74.84,2,Davonte Grisham,Itasca,73.57,165.56,104.33,172.37,442.25,Single-ply,SBD,M,
Boys,74.84,3,Catch Thompson,Buffalo,73.48,161.03,106.59,165.56,433.18,Single-ply,SBD,M,
Boys,74.84,4,Christopher Neal,Itasca,74.66,172.37,83.91,170.1,426.38,Single-ply,SBD,M,
Boys,74.84,5,Tommy Bernal,Rice,74.84,165.56,102.06,142.88,410.5,Single-ply,SBD,M,
Boys,74.84,6,Collin Graves,Palmer,72.39,142.88,106.59,158.76,408.23,Single-ply,SBD,M,
Boys,74.84,7,Baylor Burkett,Rice,72.48,147.42,97.52,158.76,403.7,Single-ply,SBD,M,
Boys,74.84,8,Preston Shields,Groesbeck,72.76,142.88,102.06,154.22,399.16,Single-ply,SBD,M,
Boys,74.84,9,Jaxson Emerton,Maypearl,69.04,142.88,83.91,158.76,385.55,Single-ply,SBD,M,
Boys,74.84,10,Dylan Tyree,Palmer,70.67,136.08,95.25,154.22,385.55,Single-ply,SBD,M,
Boys,74.84,11,Preston Johnson,Scurry-Rosser,71.67,142.88,81.65,138.35,362.87,Single-ply,SBD,M,
Boys,74.84,12,Ferris Rosenthol,Ferris,73.12,136.08,77.11,140.61,353.8,Single-ply,SBD,M,
Boys,74.84,13,Tyler Jaster,West,68.04,124.74,77.11,145.15,347,Single-ply,SBD,M,
Boys,74.84,14,Marshall Eberlee,Mexia,68.58,111.13,65.77,142.88,319.78,Single-ply,SBD,M,
Boys,74.84,15,Brian Fisher,Maypearl,74.75,108.86,68.04,136.08,312.98,Single-ply,SBD,M,
Boys,74.84,16,Blake Martinez,Mexia,68.4,113.4,83.91,111.13,308.44,Single-ply,SBD,M,
Boys,74.84,17,Matthew Ray,Maypearl,74.03,99.79,70.31,99.79,269.89,Single-ply,SBD,M,
Boys,82.1,1,Mason Wootan,Whitney,81.28,192.78,122.47,219.99,535.24,Single-ply,SBD,M,
Boys,82.1,2,Gavin Wright,Mexia,78.11,195.04,113.4,213.19,521.63,Single-ply,SBD,M,
Boys,82.1,3,Sam Meeker,Ennis,81.19,176.9,108.86,192.78,478.54,Single-ply,SBD,M,
Boys,82.1,4,Brycen Clark,Rice,81.47,165.56,115.67,165.56,446.79,Single-ply,SBD,M,
Boys,82.1,5,Alan Mata,Palmer,80.2,151.95,104.33,165.56,421.84,Single-ply,SBD,M,
Boys,82.1,6,Moses Vasquez,Mexia,79.47,151.95,83.91,165.56,401.43,Single-ply,SBD,M,
Boys,82.1,7,Daniel Cleveland,Rice,77.02,124.74,79.38,165.56,369.68,Single-ply,SBD,M,
Boys,82.1,8,Jackson Evans,Scurry-Rosser,78.47,129.27,79.38,129.27,337.93,Single-ply,SBD,M,
Boys,82.1,9,Coleman LaCour,Scurry-Rosser,79.2,113.4,74.84,149.69,337.93,Single-ply,SBD,M,
Boys,82.1,DQ,Dylan Peek,Maypearl,82.01,133.81,,,,Single-ply,SBD,M,
Boys,82.1,DQ,Javier Pedroza,Rice,77.66,113.4,,,,Single-ply,SBD,M,
Boys,82.1,DQ,Brooks Booth,Whitney,78.56,,,,,Single-ply,SBD,M,
Boys,82.1,DQ,Silas Prickett,West,82.01,199.58,,,,Single-ply,SBD,M,
Boys,82.1,DQ,Kaleb Bannister,Trinidad,77.56,,,,,Single-ply,SBD,M,
Boys,89.81,1,Isaiah Nies,Ennis,83.64,319.78,183.7,249.48,752.96,Single-ply,SBD,M,
Boys,89.81,2,Bryan Harwell,Waxahachie Life,89.45,260.82,142.88,263.08,666.78,Single-ply,SBD,M,
Boys,89.81,3,Lawson Kendrick,West,83.82,217.72,136.08,213.19,566.99,Single-ply,SBD,M,
Boys,89.81,4,Terrell Conn,Groesbeck,85.18,192.78,117.93,176.9,487.61,Single-ply,SBD,M,
Boys,89.81,5,Adrian Gongora,Buffalo,88.18,165.56,95.25,185.97,446.79,Single-ply,SBD,M,
Boys,89.81,6,Timmy Gracey,Maypearl,89.81,167.83,97.52,181.44,446.79,Single-ply,SBD,M,
Boys,89.81,7,John Luna,Mexia,86.64,151.95,113.4,142.88,408.23,Single-ply,SBD,M,
Boys,89.81,8,Eddy Vargas,Palmer,89.63,151.95,92.99,161.03,405.97,Single-ply,SBD,M,
Boys,89.81,9,Kelly Macyntire,Whitney,89.72,142.88,74.84,170.1,387.82,Single-ply,SBD,M,
Boys,89.81,10,Bj Latham,Buffalo,86.55,117.93,81.65,156.49,356.07,Single-ply,SBD,M,
Boys,89.81,DQ,Koleton Latham,Buffalo,88,,,,,Single-ply,SBD,M,
Boys,89.81,DQ,Jackie Childers,Rice,85.28,127.01,,,,Single-ply,SBD,M,
Boys,89.81,DQ,Montez Shofner,Trinidad,88.65,,,,,Single-ply,SBD,M,
Boys,99.79,1,Cam Castillo,Ennis,99.79,204.12,183.7,190.51,578.33,Single-ply,SBD,M,
Boys,99.79,2,Jerry Montgomery,Rice,92.35,213.19,149.69,192.78,555.65,Single-ply,SBD,M,
Boys,99.79,3,Abel Salazar,Buffalo,98.43,199.58,108.86,181.44,489.88,Single-ply,SBD,M,
Boys,99.79,4,Aj Molina,Wortham,96.16,195.04,90.72,172.37,458.13,Single-ply,SBD,M,
Boys,99.79,5,Robert Gomez,Maypearl,91.72,147.42,102.06,163.29,412.77,Single-ply,SBD,M,
Boys,99.79,6,Jesse Taylor,Maypearl,99.79,147.42,92.99,151.95,392.36,Single-ply,SBD,M,
Boys,99.79,7,Juan Hernandez #19,Itasca,92.99,145.15,81.65,158.76,385.55,Single-ply,SBD,M,
Boys,99.79,8,Michael Chasteen,Wortham,92.08,156.49,74.84,142.88,374.21,Single-ply,SBD,M,
Boys,99.79,DQ,Jonah LaCross,Waxahachie Life,95.89,158.76,,,,Single-ply,SBD,M,
Boys,99.79,DQ,Tyler Burrell,Whitney,99.52,204.12,,,,Single-ply,SBD,M,
Boys,99.79,DQ,Tanner Nelson,Maypearl,98.52,142.88,,,,Single-ply,SBD,M,
Boys,99.79,DQ,John McLean,Scurry-Rosser,98.97,161.03,102.06,,,Single-ply,SBD,M,
Boys,109.77,1,Ben Lancone,Palmer,107.68,188.24,136.08,217.72,542.04,Single-ply,SBD,M,
Boys,109.77,2,Reid White,Ennis,109.13,197.31,138.35,195.04,530.7,Single-ply,SBD,M,
Boys,109.77,3,Jhonny Arreola,Palmer,106.23,170.1,90.72,185.97,446.79,Single-ply,SBD,M,
Boys,109.77,4,Josh Lockhart,Groesbeck,109.77,138.35,104.33,124.74,367.41,Single-ply,SBD,M,
Boys,109.77,DQ,Isaac Mendoza,Ferris,102.97,158.76,,,,Single-ply,SBD,M,
Boys,109.77,DQ,Brayan Luna,Mexia,102.42,229.06,127.01,,,Single-ply,SBD,M,
Boys,124.74,1,Shawntay Owens,Whitney,122.11,251.74,156.49,251.74,659.98,Single-ply,SBD,M,
Boys,124.74,2,Angel Banda,Rice,117.57,238.14,161.03,226.8,625.96,Single-ply,SBD,M,
Boys,124.74,3,Matthew Quiroz,Ferris,112.31,226.8,113.4,172.37,512.56,Single-ply,SBD,M,
Boys,124.74,4,Zion Barnes,Hubbard,114.12,188.24,124.74,188.24,501.22,Single-ply,SBD,M,
Boys,124.74,5,Brock Klander,West,116.75,165.56,115.67,140.61,421.84,Single-ply,SBD,M,
Boys,124.74,6,Nathan Mikeska,Whitney,123.56,129.27,45.36,136.08,310.71,Single-ply,SBD,M,
Boys,124.74,DQ,Tamarius Green,Whitney,124.74,102.06,,,,Single-ply,SBD,M,
Boys,124.74,DQ,Asa Henson,Buffalo,120.02,217.72,,,,Single-ply,SBD,M,
Boys,124.74,DQ,Tyler Solis,Waxahachie Life,124.74,,,,,Single-ply,SBD,M,
Boys,124.74+,1,Quinton Wright,Maypearl,127.64,260.82,142.88,249.48,653.17,Single-ply,SBD,M,
Boys,124.74+,2,Clayton Johnson #3,Scurry-Rosser,135.99,256.28,142.88,226.8,625.96,Single-ply,SBD,M,
Boys,124.74+,3,Miguel Delgado,Ferris,155.31,283.5,147.42,188.24,619.15,Single-ply,SBD,M,
Boys,124.74+,4,Anthony Barnes,Waxahachie Life,148.23,247.21,122.47,217.72,587.4,Single-ply,SBD,M,
Boys,124.74+,5,Xavier Gipson,Waxahachie Life,131.27,215.46,124.74,192.78,532.97,Single-ply,SBD,M,
Boys,124.74+,6,Luke Wines,West,126.55,190.51,117.93,183.7,492.15,Single-ply,SBD,M,
