91,0
90,1
89,3
87,4
86,5
85,6
83,8
82,9
81,11
80,12
79,14
79,16
79,18
79,20
79,22
80,23
80,25
81,27
82,29
83,30
84,32
85,33
86,35
87,37
88,38
88,40
89,42
90,43
91,45
92,47
93,48
94,50
95,52
95,53
96,55
97,57
97,59
98,60
99,62
99,64
100,66
100,68
101,70
101,71
101,73
102,75
102,77
102,79
102,81
102,83
102,84
102,86
101,88
101,90
100,92
99,94
99,95
98,97
96,98
95,100
94,101
92,102
91,103
89,104
87,105
85,105
84,105
82,106
80,106
78,106
76,106
74,106
72,105
70,105
69,105
67,104
65,103
63,103
62,102
60,101
58,101
56,100
55,99
53,98
51,97
50,96
48,95
47,94
45,93
44,92
42,91
41,89
39,88
38,87
36,86
35,84
34,83
32,82
31,81
30,79
28,78
27,77
26,75
24,74
23,72
22,71
21,69
20,68
18,67
17,65
16,64
15,62
14,61
12,59
11,58
10,56
9,55
7,54
6,53
4,53
2,53
1,55
-1,56
-2,58
-3,59
-4,61
-5,62
-6,64
-6,66
-7,67
-8,69
-9,71
-10,72
-11,74
-12,75
-13,77
-14,79
-15,80
-17,82
-18,83
-19,85
-20,86
-21,88
-22,89
-23,91
-25,92
-26,93
-27,95
-28,96
-30,97
-31,99
-33,100
-34,101
-35,103
-37,104
-38,105
-40,106
-41,107
-43,108
-44,109
-46,110
-48,111
-49,112
-51,113
-53,114
-55,114
-56,115
-58,115
-60,116
-62,116
-64,116
-66,116
-67,116
-69,116
-71,116
-73,115
-75,115
-76,114
-78,113
-80,112
-81,110
-82,109
-83,107
-84,106
-85,104
-86,103
-87,101
-87,99
-88,97
-88,95
-88,93
-89,92
-89,90
-89,88
-89,86
-89,84
-88,82
-88,80
-88,78
-88,77
-87,75
-87,73
-87,71
-86,69
-86,67
-85,65
-85,64
-84,62
-84,60
-83,58
-83,57
-82,55
-81,53
-81,51
-80,49
-79,48
-79,46
-78,44
-77,42
-77,41
-76,39
-76,37
-76,35
-75,33
-75,31
-76,29
-76,28
-77,26
-78,24
-79,23
-81,22
-82,20
-84,19
-85,18
-87,17
-88,16
-90,15
-91,14
-93,13
-94,12
-96,11
-97,10
-99,9
-100,7
-102,6
-103,5
-105,4
-106,2
-107,1
-109,-0
-110,-2
-111,-3
-112,-5
-113,-6
-114,-8
-115,-9
-116,-11
-117,-13
-117,-15
-117,-17
-118,-19
-118,-20
-117,-22
-117,-24
-117,-26
-116,-28
-115,-29
-114,-31
-113,-32
-111,-34
-110,-35
-108,-36
-107,-37
-105,-38
-104,-39
-102,-40
-100,-40
-98,-41
-97,-42
-95,-42
-93,-43
-91,-43
-89,-43
-87,-44
-85,-44
-84,-44
-82,-44
-80,-44
-78,-44
-76,-44
-74,-45
-72,-44
-70,-44
-69,-44
-67,-44
-65,-44
-63,-44
-61,-44
-59,-44
-57,-44
-55,-43
-54,-43
-52,-43
-50,-43
-48,-43
-46,-43
-44,-44
-43,-45
-42,-47
-41,-48
-41,-50
-41,-52
-41,-54
-41,-56
-41,-58
-41,-60
-41,-62
-41,-63
-41,-65
-42,-67
-42,-69
-42,-71
-42,-73
-42,-75
-42,-77
-42,-78
-42,-80
-42,-82
-42,-84
-42,-86
-42,-88
-42,-90
-42,-92
-42,-93
-42,-95
-42,-97
-42,-99
-41,-101
-41,-103
-41,-105
-41,-107
-40,-108
-40,-110
-40,-112
-39,-114
-39,-116
-38,-118
-38,-119
-37,-121
-36,-123
-36,-125
-35,-126
-34,-128
-33,-130
-32,-131
-31,-133
-30,-135
-29,-136
-28,-137
-26,-139
-25,-140
-24,-141
-22,-143
-21,-144
-19,-145
-17,-145
-16,-146
-14,-146
-12,-147
-10,-147
-8,-147
-6,-147
-4,-146
-3,-146
-1,-145
1,-144
3,-143
4,-142
6,-141
7,-140
8,-139
10,-137
11,-136
12,-134
13,-133
15,-131
16,-130
17,-128
18,-127
18,-125
19,-123
20,-122
21,-120
22,-118
22,-116
23,-115
24,-113
24,-111
25,-109
25,-107
26,-106
26,-104
27,-102
27,-100
28,-98
28,-97
28,-95
29,-93
29,-91
29,-89
30,-87
30,-85
30,-83
30,-82
31,-80
31,-78
31,-76
31,-74
31,-72
31,-70
31,-68
32,-67
32,-65
32,-63
32,-61
32,-59
33,-57
33,-55
34,-54
35,-52
37,-51
38,-51
40,-51
42,-51
44,-51
46,-51
48,-52
50,-52
51,-52
53,-53
55,-53
57,-54
59,-54
61,-54
62,-55
64,-55
66,-55
68,-56
70,-56
72,-56
74,-56
76,-56
77,-57
79,-57
81,-57
83,-56
85,-56
87,-56
89,-56
91,-56
92,-55
94,-55
96,-54
98,-54
100,-53
101,-52
103,-51
104,-50
106,-49
107,-48
109,-46
110,-45
111,-43
112,-42
112,-40
113,-38
113,-36
113,-34
113,-32
113,-30
112,-29
112,-27
111,-25
110,-23
110,-22
109,-20
108,-18
107,-17
106,-15
104,-14
103,-12
102,-11
101,-9
100,-8
98,-7
97,-5
96,-4
94,-3
93,-1
91,-0
