(
	{q0,q1,q2,q3,q4},
	{0,1},
	{0,1,x,y,B},
	{
		(q0,0)->(q1,x,D),
		(q1,0)->(q1,0,D),
		(q1,y)->(q1,y,D),
		(q1,1)->(q2,y,E),
		(q2,y)->(q2,y,E),
		(q2,0)->(q2,0,E),
		(q2,x)->(q2,x,D),
		(q0,y)->(q3,y,D),
		(q3,y)->(q3,y,D),
		(q3,B)->(q4,B,N)
	},
	q0,
	{q4}
)