%YAML 1.1
%TAG !u! tag:unity3d.com,2011:
--- !u!29 &1
OcclusionCullingSettings:
  m_ObjectHideFlags: 0
  serializedVersion: 2
  m_OcclusionBakeSettings:
    smallestOccluder: 5
    smallestHole: 0.25
    backfaceThreshold: 100
  m_SceneGUID: 00000000000000000000000000000000
  m_OcclusionCullingData: {fileID: 0}
--- !u!104 &2
RenderSettings:
  m_ObjectHideFlags: 0
  serializedVersion: 9
  m_Fog: 0
  m_FogColor: {r: 0.5, g: 0.5, b: 0.5, a: 1}
  m_FogMode: 3
  m_FogDensity: 0.01
  m_LinearFogStart: 0
  m_LinearFogEnd: 300
  m_AmbientSkyColor: {r: 0.212, g: 0.227, b: 0.259, a: 1}
  m_AmbientEquatorColor: {r: 0.114, g: 0.125, b: 0.133, a: 1}
  m_AmbientGroundColor: {r: 0.047, g: 0.043, b: 0.035, a: 1}
  m_AmbientIntensity: 1
  m_AmbientMode: 0
  m_SubtractiveShadowColor: {r: 0.42, g: 0.478, b: 0.627, a: 1}
  m_SkyboxMaterial: {fileID: 10304, guid: 0000000000000000f000000000000000, type: 0}
  m_HaloStrength: 0.5
  m_FlareStrength: 1
  m_FlareFadeSpeed: 3
  m_HaloTexture: {fileID: 0}
  m_SpotCookie: {fileID: 10001, guid: 0000000000000000e000000000000000, type: 0}
  m_DefaultReflectionMode: 0
  m_DefaultReflectionResolution: 128
  m_ReflectionBounces: 1
  m_ReflectionIntensity: 1
  m_CustomReflection: {fileID: 0}
  m_Sun: {fileID: 0}
  m_IndirectSpecularColor: {r: 0, g: 0, b: 0, a: 1}
  m_UseRadianceAmbientProbe: 0
--- !u!157 &4
LightmapSettings:
  m_ObjectHideFlags: 0
  serializedVersion: 12
  m_GIWorkflowMode: 0
  m_GISettings:
    serializedVersion: 2
    m_BounceScale: 1
    m_IndirectOutputScale: 1
    m_AlbedoBoost: 1
    m_EnvironmentLightingMode: 0
    m_EnableBakedLightmaps: 1
    m_EnableRealtimeLightmaps: 1
  m_LightmapEditorSettings:
    serializedVersion: 12
    m_Resolution: 2
    m_BakeResolution: 40
    m_AtlasSize: 1024
    m_AO: 0
    m_AOMaxDistance: 1
    m_CompAOExponent: 0
    m_CompAOExponentDirect: 0
    m_ExtractAmbientOcclusion: 0
    m_Padding: 2
    m_LightmapParameters: {fileID: 0}
    m_LightmapsBakeMode: 1
    m_TextureCompression: 1
    m_FinalGather: 0
    m_FinalGatherFiltering: 1
    m_FinalGatherRayCount: 1024
    m_ReflectionCompression: 2
    m_MixedBakeMode: 1
    m_BakeBackend: 0
    m_PVRSampling: 1
    m_PVRDirectSampleCount: 32
    m_PVRSampleCount: 512
    m_PVRBounces: 2
    m_PVREnvironmentSampleCount: 512
    m_PVREnvironmentReferencePointCount: 2048
    m_PVRFilteringMode: 0
    m_PVRDenoiserTypeDirect: 0
    m_PVRDenoiserTypeIndirect: 0
    m_PVRDenoiserTypeAO: 0
    m_PVRFilterTypeDirect: 0
    m_PVRFilterTypeIndirect: 0
    m_PVRFilterTypeAO: 0
    m_PVREnvironmentMIS: 0
    m_PVRCulling: 1
    m_PVRFilteringGaussRadiusDirect: 1
    m_PVRFilteringGaussRadiusIndirect: 5
    m_PVRFilteringGaussRadiusAO: 2
    m_PVRFilteringAtrousPositionSigmaDirect: 0.5
    m_PVRFilteringAtrousPositionSigmaIndirect: 2
    m_PVRFilteringAtrousPositionSigmaAO: 1
    m_ExportTrainingData: 0
    m_TrainingDataDestination: TrainingData
    m_LightProbeSampleCountMultiplier: 4
  m_LightingDataAsset: {fileID: 0}
  m_LightingSettings: {fileID: 4890085278179872738, guid: 120f6405e85674f628993698ccb58ecb,
    type: 2}
--- !u!196 &5
NavMeshSettings:
  serializedVersion: 2
  m_ObjectHideFlags: 0
  m_BuildSettings:
    serializedVersion: 2
    agentTypeID: 0
    agentRadius: 0.5
    agentHeight: 2
    agentSlope: 45
    agentClimb: 0.4
    ledgeDropHeight: 0
    maxJumpAcrossDistance: 0
    minRegionArea: 2
    manualCellSize: 0
    cellSize: 0.16666667
    manualTileSize: 0
    tileSize: 256
    accuratePlacement: 0
    maxJobWorkers: 0
    preserveTilesOutsideBounds: 0
    debug:
      m_Flags: 0
  m_NavMeshData: {fileID: 0}
--- !u!1001 &56494784
PrefabInstance:
  m_ObjectHideFlags: 0
  serializedVersion: 2
  m_Modification:
    m_TransformParent: {fileID: 1613563251}
    m_Modifications:
    - target: {fileID: 402300, guid: 079954accd64b32419ec069129c81273, type: 3}
      propertyPath: m_RootOrder
      value: 11
      objectReference: {fileID: 0}
    - target: {fileID: 402300, guid: 079954accd64b32419ec069129c81273, type: 3}
      propertyPath: m_LocalPosition.x
      value: 0
      objectReference: {fileID: 0}
    - target: {fileID: 402300, guid: 079954accd64b32419ec069129c81273, type: 3}
      propertyPath: m_LocalPosition.y
      value: 0
      objectReference: {fileID: 0}
    - target: {fileID: 402300, guid: 079954accd64b32419ec069129c81273, type: 3}
      propertyPath: m_LocalPosition.z
      value: 0
      objectReference: {fileID: 0}
    - target: {fileID: 402300, guid: 079954accd64b32419ec069129c81273, type: 3}
      propertyPath: m_LocalRotation.w
      value: .71332258
      objectReference: {fileID: 0}
    - target: {fileID: 402300, guid: 079954accd64b32419ec069129c81273, type: 3}
      propertyPath: m_LocalRotation.x
      value: -.700835884
      objectReference: {fileID: 0}
    - target: {fileID: 402300, guid: 079954accd64b32419ec069129c81273, type: 3}
      propertyPath: m_LocalRotation.y
      value: 0
      objectReference: {fileID: 0}
    - target: {fileID: 402300, guid: 079954accd64b32419ec069129c81273, type: 3}
      propertyPath: m_LocalRotation.z
      value: 0
      objectReference: {fileID: 0}
    m_RemovedComponents: []
  m_SourcePrefab: {fileID: 100100000, guid: 079954accd64b32419ec069129c81273, type: 3}
--- !u!4 &56494785 stripped
Transform:
  m_CorrespondingSourceObject: {fileID: 402300, guid: 079954accd64b32419ec069129c81273,
    type: 3}
  m_PrefabInstance: {fileID: 56494784}
  m_PrefabAsset: {fileID: 0}
--- !u!1001 &96853087
PrefabInstance:
  m_ObjectHideFlags: 0
  serializedVersion: 2
  m_Modification:
    m_TransformParent: {fileID: 1613563251}
    m_Modifications:
    - target: {fileID: 444372, guid: 6636b3078b0905e489f698a11b7a6b6b, type: 3}
      propertyPath: m_RootOrder
      value: 13
      objectReference: {fileID: 0}
    - target: {fileID: 444372, guid: 6636b3078b0905e489f698a11b7a6b6b, type: 3}
      propertyPath: m_LocalPosition.x
      value: 0
      objectReference: {fileID: 0}
    - target: {fileID: 444372, guid: 6636b3078b0905e489f698a11b7a6b6b, type: 3}
      propertyPath: m_LocalPosition.y
      value: 0
      objectReference: {fileID: 0}
    - target: {fileID: 444372, guid: 6636b3078b0905e489f698a11b7a6b6b, type: 3}
      propertyPath: m_LocalPosition.z
      value: 0
      objectReference: {fileID: 0}
    - target: {fileID: 444372, guid: 6636b3078b0905e489f698a11b7a6b6b, type: 3}
      propertyPath: m_LocalRotation.w
      value: 1
      objectReference: {fileID: 0}
    - target: {fileID: 444372, guid: 6636b3078b0905e489f698a11b7a6b6b, type: 3}
      propertyPath: m_LocalRotation.x
      value: 0
      objectReference: {fileID: 0}
    - target: {fileID: 444372, guid: 6636b3078b0905e489f698a11b7a6b6b, type: 3}
      propertyPath: m_LocalRotation.y
      value: 0
      objectReference: {fileID: 0}
    - target: {fileID: 444372, guid: 6636b3078b0905e489f698a11b7a6b6b, type: 3}
      propertyPath: m_LocalRotation.z
      value: 0
      objectReference: {fileID: 0}
    - target: {fileID: 19979870, guid: 6636b3078b0905e489f698a11b7a6b6b, type: 3}
      propertyPath: m_Materials.Array.data[0]
      value: 
      objectReference: {fileID: 2100000, guid: a0cec58fc32f482418596ffdf7c0d693, type: 2}
    m_RemovedComponents: []
  m_SourcePrefab: {fileID: 100100000, guid: 6636b3078b0905e489f698a11b7a6b6b, type: 3}
--- !u!4 &96853088 stripped
Transform:
  m_CorrespondingSourceObject: {fileID: 444372, guid: 6636b3078b0905e489f698a11b7a6b6b,
    type: 3}
  m_PrefabInstance: {fileID: 96853087}
  m_PrefabAsset: {fileID: 0}
--- !u!1001 &269900724
PrefabInstance:
  m_ObjectHideFlags: 0
  serializedVersion: 2
  m_Modification:
    m_TransformParent: {fileID: 1613563251}
    m_Modifications:
    - target: {fileID: 475750, guid: 263867d4955e3644f9a1dfa779ab7d1e, type: 3}
      propertyPath: m_RootOrder
      value: 18
      objectReference: {fileID: 0}
    - target: {fileID: 475750, guid: 263867d4955e3644f9a1dfa779ab7d1e, type: 3}
      propertyPath: m_LocalPosition.x
      value: 0
      objectReference: {fileID: 0}
    - target: {fileID: 475750, guid: 263867d4955e3644f9a1dfa779ab7d1e, type: 3}
      propertyPath: m_LocalPosition.y
      value: 0
      objectReference: {fileID: 0}
    - target: {fileID: 475750, guid: 263867d4955e3644f9a1dfa779ab7d1e, type: 3}
      propertyPath: m_LocalPosition.z
      value: 0
      objectReference: {fileID: 0}
    - target: {fileID: 475750, guid: 263867d4955e3644f9a1dfa779ab7d1e, type: 3}
      propertyPath: m_LocalRotation.w
      value: 1
      objectReference: {fileID: 0}
    - target: {fileID: 475750, guid: 263867d4955e3644f9a1dfa779ab7d1e, type: 3}
      propertyPath: m_LocalRotation.x
      value: 0
      objectReference: {fileID: 0}
    - target: {fileID: 475750, guid: 263867d4955e3644f9a1dfa779ab7d1e, type: 3}
      propertyPath: m_LocalRotation.y
      value: 0
      objectReference: {fileID: 0}
    - target: {fileID: 475750, guid: 263867d4955e3644f9a1dfa779ab7d1e, type: 3}
      propertyPath: m_LocalRotation.z
      value: 0
      objectReference: {fileID: 0}
    m_RemovedComponents: []
  m_SourcePrefab: {fileID: 100100000, guid: 263867d4955e3644f9a1dfa779ab7d1e, type: 3}
--- !u!4 &269900725 stripped
Transform:
  m_CorrespondingSourceObject: {fileID: 475750, guid: 263867d4955e3644f9a1dfa779ab7d1e,
    type: 3}
  m_PrefabInstance: {fileID: 269900724}
  m_PrefabAsset: {fileID: 0}
--- !u!1001 &326569808
PrefabInstance:
  m_ObjectHideFlags: 0
  serializedVersion: 2
  m_Modification:
    m_TransformParent: {fileID: 1613563251}
    m_Modifications:
    - target: {fileID: 481858, guid: cd427f0dc853ec74a9ba1c5ff0e48ca2, type: 3}
      propertyPath: m_RootOrder
      value: 9
      objectReference: {fileID: 0}
    - target: {fileID: 481858, guid: cd427f0dc853ec74a9ba1c5ff0e48ca2, type: 3}
      propertyPath: m_LocalPosition.x
      value: 0
      objectReference: {fileID: 0}
    - target: {fileID: 481858, guid: cd427f0dc853ec74a9ba1c5ff0e48ca2, type: 3}
      propertyPath: m_LocalPosition.y
      value: 0
      objectReference: {fileID: 0}
    - target: {fileID: 481858, guid: cd427f0dc853ec74a9ba1c5ff0e48ca2, type: 3}
      propertyPath: m_LocalPosition.z
      value: 0
      objectReference: {fileID: 0}
    - target: {fileID: 481858, guid: cd427f0dc853ec74a9ba1c5ff0e48ca2, type: 3}
      propertyPath: m_LocalRotation.w
      value: 1
      objectReference: {fileID: 0}
    - target: {fileID: 481858, guid: cd427f0dc853ec74a9ba1c5ff0e48ca2, type: 3}
      propertyPath: m_LocalRotation.x
      value: 0
      objectReference: {fileID: 0}
    - target: {fileID: 481858, guid: cd427f0dc853ec74a9ba1c5ff0e48ca2, type: 3}
      propertyPath: m_LocalRotation.y
      value: 0
      objectReference: {fileID: 0}
    - target: {fileID: 481858, guid: cd427f0dc853ec74a9ba1c5ff0e48ca2, type: 3}
      propertyPath: m_LocalRotation.z
      value: 0
      objectReference: {fileID: 0}
    m_RemovedComponents: []
  m_SourcePrefab: {fileID: 100100000, guid: cd427f0dc853ec74a9ba1c5ff0e48ca2, type: 3}
--- !u!4 &326569809 stripped
Transform:
  m_CorrespondingSourceObject: {fileID: 481858, guid: cd427f0dc853ec74a9ba1c5ff0e48ca2,
    type: 3}
  m_PrefabInstance: {fileID: 326569808}
  m_PrefabAsset: {fileID: 0}
--- !u!1001 &352179737
PrefabInstance:
  m_ObjectHideFlags: 0
  serializedVersion: 2
  m_Modification:
    m_TransformParent: {fileID: 1613563251}
    m_Modifications:
    - target: {fileID: 445260, guid: d7bf18dd20422304ea868e95c3518f19, type: 3}
      propertyPath: m_RootOrder
      value: 4
      objectReference: {fileID: 0}
    - target: {fileID: 445260, guid: d7bf18dd20422304ea868e95c3518f19, type: 3}
      propertyPath: m_LocalPosition.x
      value: 0
      objectReference: {fileID: 0}
    - target: {fileID: 445260, guid: d7bf18dd20422304ea868e95c3518f19, type: 3}
      propertyPath: m_LocalPosition.y
      value: 0
      objectReference: {fileID: 0}
    - target: {fileID: 445260, guid: d7bf18dd20422304ea868e95c3518f19, type: 3}
      propertyPath: m_LocalPosition.z
      value: 0
      objectReference: {fileID: 0}
    - target: {fileID: 445260, guid: d7bf18dd20422304ea868e95c3518f19, type: 3}
      propertyPath: m_LocalRotation.w
      value: 1
      objectReference: {fileID: 0}
    - target: {fileID: 445260, guid: d7bf18dd20422304ea868e95c3518f19, type: 3}
      propertyPath: m_LocalRotation.x
      value: 0
      objectReference: {fileID: 0}
    - target: {fileID: 445260, guid: d7bf18dd20422304ea868e95c3518f19, type: 3}
      propertyPath: m_LocalRotation.y
      value: 0
      objectReference: {fileID: 0}
    - target: {fileID: 445260, guid: d7bf18dd20422304ea868e95c3518f19, type: 3}
      propertyPath: m_LocalRotation.z
      value: 0
      objectReference: {fileID: 0}
    m_RemovedComponents: []
  m_SourcePrefab: {fileID: 100100000, guid: d7bf18dd20422304ea868e95c3518f19, type: 3}
--- !u!4 &352179738 stripped
Transform:
  m_CorrespondingSourceObject: {fileID: 445260, guid: d7bf18dd20422304ea868e95c3518f19,
    type: 3}
  m_PrefabInstance: {fileID: 352179737}
  m_PrefabAsset: {fileID: 0}
--- !u!1001 &569901813
PrefabInstance:
  m_ObjectHideFlags: 0
  serializedVersion: 2
  m_Modification:
    m_TransformParent: {fileID: 1613563251}
    m_Modifications:
    - target: {fileID: 420266, guid: 8c27aeead6d968e4ba986702d6b84335, type: 3}
      propertyPath: m_RootOrder
      value: 5
      objectReference: {fileID: 0}
    - target: {fileID: 420266, guid: 8c27aeead6d968e4ba986702d6b84335, type: 3}
      propertyPath: m_LocalPosition.x
      value: 0
      objectReference: {fileID: 0}
    - target: {fileID: 420266, guid: 8c27aeead6d968e4ba986702d6b84335, type: 3}
      propertyPath: m_LocalPosition.y
      value: 0
      objectReference: {fileID: 0}
    - target: {fileID: 420266, guid: 8c27aeead6d968e4ba986702d6b84335, type: 3}
      propertyPath: m_LocalPosition.z
      value: 0
      objectReference: {fileID: 0}
    - target: {fileID: 420266, guid: 8c27aeead6d968e4ba986702d6b84335, type: 3}
      propertyPath: m_LocalRotation.w
      value: 1
      objectReference: {fileID: 0}
    - target: {fileID: 420266, guid: 8c27aeead6d968e4ba986702d6b84335, type: 3}
      propertyPath: m_LocalRotation.x
      value: 0
      objectReference: {fileID: 0}
    - target: {fileID: 420266, guid: 8c27aeead6d968e4ba986702d6b84335, type: 3}
      propertyPath: m_LocalRotation.y
      value: 0
      objectReference: {fileID: 0}
    - target: {fileID: 420266, guid: 8c27aeead6d968e4ba986702d6b84335, type: 3}
      propertyPath: m_LocalRotation.z
      value: 0
      objectReference: {fileID: 0}
    m_RemovedComponents: []
  m_SourcePrefab: {fileID: 100100000, guid: 8c27aeead6d968e4ba986702d6b84335, type: 3}
--- !u!4 &569901814 stripped
Transform:
  m_CorrespondingSourceObject: {fileID: 420266, guid: 8c27aeead6d968e4ba986702d6b84335,
    type: 3}
  m_PrefabInstance: {fileID: 569901813}
  m_PrefabAsset: {fileID: 0}
--- !u!1001 &713842203
PrefabInstance:
  m_ObjectHideFlags: 0
  serializedVersion: 2
  m_Modification:
    m_TransformParent: {fileID: 1613563251}
    m_Modifications:
    - target: {fileID: 403952, guid: 6586ff0f14125534cae2f5d8f04b7871, type: 3}
      propertyPath: m_RootOrder
      value: 15
      objectReference: {fileID: 0}
    - target: {fileID: 403952, guid: 6586ff0f14125534cae2f5d8f04b7871, type: 3}
      propertyPath: m_LocalPosition.x
      value: 0
      objectReference: {fileID: 0}
    - target: {fileID: 403952, guid: 6586ff0f14125534cae2f5d8f04b7871, type: 3}
      propertyPath: m_LocalPosition.y
      value: 0
      objectReference: {fileID: 0}
    - target: {fileID: 403952, guid: 6586ff0f14125534cae2f5d8f04b7871, type: 3}
      propertyPath: m_LocalPosition.z
      value: 0
      objectReference: {fileID: 0}
    - target: {fileID: 403952, guid: 6586ff0f14125534cae2f5d8f04b7871, type: 3}
      propertyPath: m_LocalRotation.w
      value: 1
      objectReference: {fileID: 0}
    - target: {fileID: 403952, guid: 6586ff0f14125534cae2f5d8f04b7871, type: 3}
      propertyPath: m_LocalRotation.x
      value: 0
      objectReference: {fileID: 0}
    - target: {fileID: 403952, guid: 6586ff0f14125534cae2f5d8f04b7871, type: 3}
      propertyPath: m_LocalRotation.y
      value: 0
      objectReference: {fileID: 0}
    - target: {fileID: 403952, guid: 6586ff0f14125534cae2f5d8f04b7871, type: 3}
      propertyPath: m_LocalRotation.z
      value: 0
      objectReference: {fileID: 0}
    - target: {fileID: 19904564, guid: 6586ff0f14125534cae2f5d8f04b7871, type: 3}
      propertyPath: m_Materials.Array.data[0]
      value: 
      objectReference: {fileID: 2100000, guid: a0cec58fc32f482418596ffdf7c0d693, type: 2}
    m_RemovedComponents: []
  m_SourcePrefab: {fileID: 100100000, guid: 6586ff0f14125534cae2f5d8f04b7871, type: 3}
--- !u!4 &713842204 stripped
Transform:
  m_CorrespondingSourceObject: {fileID: 403952, guid: 6586ff0f14125534cae2f5d8f04b7871,
    type: 3}
  m_PrefabInstance: {fileID: 713842203}
  m_PrefabAsset: {fileID: 0}
--- !u!1001 &749029620
PrefabInstance:
  m_ObjectHideFlags: 0
  serializedVersion: 2
  m_Modification:
    m_TransformParent: {fileID: 1613563251}
    m_Modifications:
    - target: {fileID: 400000, guid: 756d99540142b5e4a8d174e18a6310d9, type: 3}
      propertyPath: m_RootOrder
      value: 0
      objectReference: {fileID: 0}
    - target: {fileID: 400000, guid: 756d99540142b5e4a8d174e18a6310d9, type: 3}
      propertyPath: m_LocalPosition.x
      value: 2.78999996
      objectReference: {fileID: 0}
    - target: {fileID: 400000, guid: 756d99540142b5e4a8d174e18a6310d9, type: 3}
      propertyPath: m_LocalPosition.y
      value: 2.01999998
      objectReference: {fileID: 0}
    - target: {fileID: 400000, guid: 756d99540142b5e4a8d174e18a6310d9, type: 3}
      propertyPath: m_LocalPosition.z
      value: 0
      objectReference: {fileID: 0}
    - target: {fileID: 400000, guid: 756d99540142b5e4a8d174e18a6310d9, type: 3}
      propertyPath: m_LocalRotation.w
      value: 1
      objectReference: {fileID: 0}
    - target: {fileID: 400000, guid: 756d99540142b5e4a8d174e18a6310d9, type: 3}
      propertyPath: m_LocalRotation.x
      value: 0
      objectReference: {fileID: 0}
    - target: {fileID: 400000, guid: 756d99540142b5e4a8d174e18a6310d9, type: 3}
      propertyPath: m_LocalRotation.y
      value: 0
      objectReference: {fileID: 0}
    - target: {fileID: 400000, guid: 756d99540142b5e4a8d174e18a6310d9, type: 3}
      propertyPath: m_LocalRotation.z
      value: 0
      objectReference: {fileID: 0}
    m_RemovedComponents: []
  m_SourcePrefab: {fileID: 100100000, guid: 756d99540142b5e4a8d174e18a6310d9, type: 3}
--- !u!4 &749029621 stripped
Transform:
  m_CorrespondingSourceObject: {fileID: 400000, guid: 756d99540142b5e4a8d174e18a6310d9,
    type: 3}
  m_PrefabInstance: {fileID: 749029620}
  m_PrefabAsset: {fileID: 0}
--- !u!1001 &752847373
PrefabInstance:
  m_ObjectHideFlags: 0
  serializedVersion: 2
  m_Modification:
    m_TransformParent: {fileID: 1613563251}
    m_Modifications:
    - target: {fileID: 459750, guid: cd4d7020429cde74db076ffa72495419, type: 3}
      propertyPath: m_RootOrder
      value: 17
      objectReference: {fileID: 0}
    - target: {fileID: 459750, guid: cd4d7020429cde74db076ffa72495419, type: 3}
      propertyPath: m_LocalPosition.x
      value: 0
      objectReference: {fileID: 0}
    - target: {fileID: 459750, guid: cd4d7020429cde74db076ffa72495419, type: 3}
      propertyPath: m_LocalPosition.y
      value: 0
      objectReference: {fileID: 0}
    - target: {fileID: 459750, guid: cd4d7020429cde74db076ffa72495419, type: 3}
      propertyPath: m_LocalPosition.z
      value: 0
      objectReference: {fileID: 0}
    - target: {fileID: 459750, guid: cd4d7020429cde74db076ffa72495419, type: 3}
      propertyPath: m_LocalRotation.w
      value: 1
      objectReference: {fileID: 0}
    - target: {fileID: 459750, guid: cd4d7020429cde74db076ffa72495419, type: 3}
      propertyPath: m_LocalRotation.x
      value: 0
      objectReference: {fileID: 0}
    - target: {fileID: 459750, guid: cd4d7020429cde74db076ffa72495419, type: 3}
      propertyPath: m_LocalRotation.y
      value: 0
      objectReference: {fileID: 0}
    - target: {fileID: 459750, guid: cd4d7020429cde74db076ffa72495419, type: 3}
      propertyPath: m_LocalRotation.z
      value: 0
      objectReference: {fileID: 0}
    - target: {fileID: 19945710, guid: cd4d7020429cde74db076ffa72495419, type: 3}
      propertyPath: m_Materials.Array.data[0]
      value: 
      objectReference: {fileID: 2100000, guid: a0cec58fc32f482418596ffdf7c0d693, type: 2}
    m_RemovedComponents: []
  m_SourcePrefab: {fileID: 100100000, guid: cd4d7020429cde74db076ffa72495419, type: 3}
--- !u!4 &752847374 stripped
Transform:
  m_CorrespondingSourceObject: {fileID: 459750, guid: cd4d7020429cde74db076ffa72495419,
    type: 3}
  m_PrefabInstance: {fileID: 752847373}
  m_PrefabAsset: {fileID: 0}
--- !u!1001 &1111931438
PrefabInstance:
  m_ObjectHideFlags: 0
  serializedVersion: 2
  m_Modification:
    m_TransformParent: {fileID: 1613563251}
    m_Modifications:
    - target: {fileID: 408150, guid: 26d069e6f78e6f8478e4dc0152bd6939, type: 3}
      propertyPath: m_RootOrder
      value: 16
      objectReference: {fileID: 0}
    - target: {fileID: 408150, guid: 26d069e6f78e6f8478e4dc0152bd6939, type: 3}
      propertyPath: m_LocalPosition.x
      value: 0
      objectReference: {fileID: 0}
    - target: {fileID: 408150, guid: 26d069e6f78e6f8478e4dc0152bd6939, type: 3}
      propertyPath: m_LocalPosition.y
      value: 0
      objectReference: {fileID: 0}
    - target: {fileID: 408150, guid: 26d069e6f78e6f8478e4dc0152bd6939, type: 3}
      propertyPath: m_LocalPosition.z
      value: 0
      objectReference: {fileID: 0}
    - target: {fileID: 408150, guid: 26d069e6f78e6f8478e4dc0152bd6939, type: 3}
      propertyPath: m_LocalRotation.w
      value: 1
      objectReference: {fileID: 0}
    - target: {fileID: 408150, guid: 26d069e6f78e6f8478e4dc0152bd6939, type: 3}
      propertyPath: m_LocalRotation.x
      value: 0
      objectReference: {fileID: 0}
    - target: {fileID: 408150, guid: 26d069e6f78e6f8478e4dc0152bd6939, type: 3}
      propertyPath: m_LocalRotation.y
      value: 0
      objectReference: {fileID: 0}
    - target: {fileID: 408150, guid: 26d069e6f78e6f8478e4dc0152bd6939, type: 3}
      propertyPath: m_LocalRotation.z
      value: 0
      objectReference: {fileID: 0}
    - target: {fileID: 19975658, guid: 26d069e6f78e6f8478e4dc0152bd6939, type: 3}
      propertyPath: m_Materials.Array.data[0]
      value: 
      objectReference: {fileID: 2100000, guid: a0cec58fc32f482418596ffdf7c0d693, type: 2}
    m_RemovedComponents: []
  m_SourcePrefab: {fileID: 100100000, guid: 26d069e6f78e6f8478e4dc0152bd6939, type: 3}
--- !u!4 &1111931439 stripped
Transform:
  m_CorrespondingSourceObject: {fileID: 408150, guid: 26d069e6f78e6f8478e4dc0152bd6939,
    type: 3}
  m_PrefabInstance: {fileID: 1111931438}
  m_PrefabAsset: {fileID: 0}
--- !u!1001 &1225777375
PrefabInstance:
  m_ObjectHideFlags: 0
  serializedVersion: 2
  m_Modification:
    m_TransformParent: {fileID: 1613563251}
    m_Modifications:
    - target: {fileID: 400000, guid: 5b6c2f68addb63847b151f0d41a9d3b1, type: 3}
      propertyPath: m_RootOrder
      value: 2
      objectReference: {fileID: 0}
    - target: {fileID: 400000, guid: 5b6c2f68addb63847b151f0d41a9d3b1, type: 3}
      propertyPath: m_LocalPosition.x
      value: 0
      objectReference: {fileID: 0}
    - target: {fileID: 400000, guid: 5b6c2f68addb63847b151f0d41a9d3b1, type: 3}
      propertyPath: m_LocalPosition.y
      value: 0
      objectReference: {fileID: 0}
    - target: {fileID: 400000, guid: 5b6c2f68addb63847b151f0d41a9d3b1, type: 3}
      propertyPath: m_LocalPosition.z
      value: 0
      objectReference: {fileID: 0}
    - target: {fileID: 400000, guid: 5b6c2f68addb63847b151f0d41a9d3b1, type: 3}
      propertyPath: m_LocalRotation.w
      value: 1
      objectReference: {fileID: 0}
    - target: {fileID: 400000, guid: 5b6c2f68addb63847b151f0d41a9d3b1, type: 3}
      propertyPath: m_LocalRotation.x
      value: 0
      objectReference: {fileID: 0}
    - target: {fileID: 400000, guid: 5b6c2f68addb63847b151f0d41a9d3b1, type: 3}
      propertyPath: m_LocalRotation.y
      value: 0
      objectReference: {fileID: 0}
    - target: {fileID: 400000, guid: 5b6c2f68addb63847b151f0d41a9d3b1, type: 3}
      propertyPath: m_LocalRotation.z
      value: 0
      objectReference: {fileID: 0}
    m_RemovedComponents: []
  m_SourcePrefab: {fileID: 100100000, guid: 5b6c2f68addb63847b151f0d41a9d3b1, type: 3}
--- !u!4 &1225777376 stripped
Transform:
  m_CorrespondingSourceObject: {fileID: 400000, guid: 5b6c2f68addb63847b151f0d41a9d3b1,
    type: 3}
  m_PrefabInstance: {fileID: 1225777375}
  m_PrefabAsset: {fileID: 0}
--- !u!1001 &1300837693
PrefabInstance:
  m_ObjectHideFlags: 0
  serializedVersion: 2
  m_Modification:
    m_TransformParent: {fileID: 1613563251}
    m_Modifications:
    - target: {fileID: 479346, guid: 5cd5599e01f32bd418f20a3b9eac1c57, type: 3}
      propertyPath: m_RootOrder
      value: 6
      objectReference: {fileID: 0}
    - target: {fileID: 479346, guid: 5cd5599e01f32bd418f20a3b9eac1c57, type: 3}
      propertyPath: m_LocalPosition.x
      value: 0
      objectReference: {fileID: 0}
    - target: {fileID: 479346, guid: 5cd5599e01f32bd418f20a3b9eac1c57, type: 3}
      propertyPath: m_LocalPosition.y
      value: 0
      objectReference: {fileID: 0}
    - target: {fileID: 479346, guid: 5cd5599e01f32bd418f20a3b9eac1c57, type: 3}
      propertyPath: m_LocalPosition.z
      value: 0
      objectReference: {fileID: 0}
    - target: {fileID: 479346, guid: 5cd5599e01f32bd418f20a3b9eac1c57, type: 3}
      propertyPath: m_LocalRotation.w
      value: 1
      objectReference: {fileID: 0}
    - target: {fileID: 479346, guid: 5cd5599e01f32bd418f20a3b9eac1c57, type: 3}
      propertyPath: m_LocalRotation.x
      value: 0
      objectReference: {fileID: 0}
    - target: {fileID: 479346, guid: 5cd5599e01f32bd418f20a3b9eac1c57, type: 3}
      propertyPath: m_LocalRotation.y
      value: 0
      objectReference: {fileID: 0}
    - target: {fileID: 479346, guid: 5cd5599e01f32bd418f20a3b9eac1c57, type: 3}
      propertyPath: m_LocalRotation.z
      value: 0
      objectReference: {fileID: 0}
    m_RemovedComponents: []
  m_SourcePrefab: {fileID: 100100000, guid: 5cd5599e01f32bd418f20a3b9eac1c57, type: 3}
--- !u!4 &1300837694 stripped
Transform:
  m_CorrespondingSourceObject: {fileID: 479346, guid: 5cd5599e01f32bd418f20a3b9eac1c57,
    type: 3}
  m_PrefabInstance: {fileID: 1300837693}
  m_PrefabAsset: {fileID: 0}
--- !u!1001 &1303053342
PrefabInstance:
  m_ObjectHideFlags: 0
  serializedVersion: 2
  m_Modification:
    m_TransformParent: {fileID: 1613563251}
    m_Modifications:
    - target: {fileID: 400000, guid: ab1112643ee572748b01dede71158272, type: 3}
      propertyPath: m_RootOrder
      value: 1
      objectReference: {fileID: 0}
    - target: {fileID: 400000, guid: ab1112643ee572748b01dede71158272, type: 3}
      propertyPath: m_LocalPosition.x
      value: -1.73000002
      objectReference: {fileID: 0}
    - target: {fileID: 400000, guid: ab1112643ee572748b01dede71158272, type: 3}
      propertyPath: m_LocalPosition.y
      value: 0
      objectReference: {fileID: 0}
    - target: {fileID: 400000, guid: ab1112643ee572748b01dede71158272, type: 3}
      propertyPath: m_LocalPosition.z
      value: 0
      objectReference: {fileID: 0}
    - target: {fileID: 400000, guid: ab1112643ee572748b01dede71158272, type: 3}
      propertyPath: m_LocalRotation.w
      value: 1
      objectReference: {fileID: 0}
    - target: {fileID: 400000, guid: ab1112643ee572748b01dede71158272, type: 3}
      propertyPath: m_LocalRotation.x
      value: 0
      objectReference: {fileID: 0}
    - target: {fileID: 400000, guid: ab1112643ee572748b01dede71158272, type: 3}
      propertyPath: m_LocalRotation.y
      value: 0
      objectReference: {fileID: 0}
    - target: {fileID: 400000, guid: ab1112643ee572748b01dede71158272, type: 3}
      propertyPath: m_LocalRotation.z
      value: 0
      objectReference: {fileID: 0}
    m_RemovedComponents: []
  m_SourcePrefab: {fileID: 100100000, guid: ab1112643ee572748b01dede71158272, type: 3}
--- !u!4 &1303053343 stripped
Transform:
  m_CorrespondingSourceObject: {fileID: 400000, guid: ab1112643ee572748b01dede71158272,
    type: 3}
  m_PrefabInstance: {fileID: 1303053342}
  m_PrefabAsset: {fileID: 0}
--- !u!1001 &1433476050
PrefabInstance:
  m_ObjectHideFlags: 0
  serializedVersion: 2
  m_Modification:
    m_TransformParent: {fileID: 1613563251}
    m_Modifications:
    - target: {fileID: 429128, guid: e49403f034d74ee44aa8a41b0ee4abfd, type: 3}
      propertyPath: m_RootOrder
      value: 7
      objectReference: {fileID: 0}
    - target: {fileID: 429128, guid: e49403f034d74ee44aa8a41b0ee4abfd, type: 3}
      propertyPath: m_LocalPosition.x
      value: 0
      objectReference: {fileID: 0}
    - target: {fileID: 429128, guid: e49403f034d74ee44aa8a41b0ee4abfd, type: 3}
      propertyPath: m_LocalPosition.y
      value: 0
      objectReference: {fileID: 0}
    - target: {fileID: 429128, guid: e49403f034d74ee44aa8a41b0ee4abfd, type: 3}
      propertyPath: m_LocalPosition.z
      value: 0
      objectReference: {fileID: 0}
    - target: {fileID: 429128, guid: e49403f034d74ee44aa8a41b0ee4abfd, type: 3}
      propertyPath: m_LocalRotation.w
      value: 1
      objectReference: {fileID: 0}
    - target: {fileID: 429128, guid: e49403f034d74ee44aa8a41b0ee4abfd, type: 3}
      propertyPath: m_LocalRotation.x
      value: 0
      objectReference: {fileID: 0}
    - target: {fileID: 429128, guid: e49403f034d74ee44aa8a41b0ee4abfd, type: 3}
      propertyPath: m_LocalRotation.y
      value: 0
      objectReference: {fileID: 0}
    - target: {fileID: 429128, guid: e49403f034d74ee44aa8a41b0ee4abfd, type: 3}
      propertyPath: m_LocalRotation.z
      value: 0
      objectReference: {fileID: 0}
    m_RemovedComponents: []
  m_SourcePrefab: {fileID: 100100000, guid: e49403f034d74ee44aa8a41b0ee4abfd, type: 3}
--- !u!4 &1433476051 stripped
Transform:
  m_CorrespondingSourceObject: {fileID: 429128, guid: e49403f034d74ee44aa8a41b0ee4abfd,
    type: 3}
  m_PrefabInstance: {fileID: 1433476050}
  m_PrefabAsset: {fileID: 0}
--- !u!1001 &1436199683
PrefabInstance:
  m_ObjectHideFlags: 0
  serializedVersion: 2
  m_Modification:
    m_TransformParent: {fileID: 1613563251}
    m_Modifications:
    - target: {fileID: 473066, guid: 0f75f6db4a318f54382e0c98b2226db8, type: 3}
      propertyPath: m_RootOrder
      value: 14
      objectReference: {fileID: 0}
    - target: {fileID: 473066, guid: 0f75f6db4a318f54382e0c98b2226db8, type: 3}
      propertyPath: m_LocalPosition.x
      value: 0
      objectReference: {fileID: 0}
    - target: {fileID: 473066, guid: 0f75f6db4a318f54382e0c98b2226db8, type: 3}
      propertyPath: m_LocalPosition.y
      value: 0
      objectReference: {fileID: 0}
    - target: {fileID: 473066, guid: 0f75f6db4a318f54382e0c98b2226db8, type: 3}
      propertyPath: m_LocalPosition.z
      value: 0
      objectReference: {fileID: 0}
    - target: {fileID: 473066, guid: 0f75f6db4a318f54382e0c98b2226db8, type: 3}
      propertyPath: m_LocalRotation.w
      value: 1
      objectReference: {fileID: 0}
    - target: {fileID: 473066, guid: 0f75f6db4a318f54382e0c98b2226db8, type: 3}
      propertyPath: m_LocalRotation.x
      value: 0
      objectReference: {fileID: 0}
    - target: {fileID: 473066, guid: 0f75f6db4a318f54382e0c98b2226db8, type: 3}
      propertyPath: m_LocalRotation.y
      value: 0
      objectReference: {fileID: 0}
    - target: {fileID: 473066, guid: 0f75f6db4a318f54382e0c98b2226db8, type: 3}
      propertyPath: m_LocalRotation.z
      value: 0
      objectReference: {fileID: 0}
    - target: {fileID: 19969578, guid: 0f75f6db4a318f54382e0c98b2226db8, type: 3}
      propertyPath: m_Materials.Array.data[0]
      value: 
      objectReference: {fileID: 2100000, guid: a0cec58fc32f482418596ffdf7c0d693, type: 2}
    m_RemovedComponents: []
  m_SourcePrefab: {fileID: 100100000, guid: 0f75f6db4a318f54382e0c98b2226db8, type: 3}
--- !u!4 &1436199684 stripped
Transform:
  m_CorrespondingSourceObject: {fileID: 473066, guid: 0f75f6db4a318f54382e0c98b2226db8,
    type: 3}
  m_PrefabInstance: {fileID: 1436199683}
  m_PrefabAsset: {fileID: 0}
--- !u!1001 &1452412519
PrefabInstance:
  m_ObjectHideFlags: 0
  serializedVersion: 2
  m_Modification:
    m_TransformParent: {fileID: 1613563251}
    m_Modifications:
    - target: {fileID: 421170, guid: 834c99069a124aa439d5795c3579843b, type: 3}
      propertyPath: m_RootOrder
      value: 3
      objectReference: {fileID: 0}
    - target: {fileID: 421170, guid: 834c99069a124aa439d5795c3579843b, type: 3}
      propertyPath: m_LocalPosition.x
      value: 0
      objectReference: {fileID: 0}
    - target: {fileID: 421170, guid: 834c99069a124aa439d5795c3579843b, type: 3}
      propertyPath: m_LocalPosition.y
      value: 0
      objectReference: {fileID: 0}
    - target: {fileID: 421170, guid: 834c99069a124aa439d5795c3579843b, type: 3}
      propertyPath: m_LocalPosition.z
      value: 0
      objectReference: {fileID: 0}
    - target: {fileID: 421170, guid: 834c99069a124aa439d5795c3579843b, type: 3}
      propertyPath: m_LocalRotation.w
      value: .707106709
      objectReference: {fileID: 0}
    - target: {fileID: 421170, guid: 834c99069a124aa439d5795c3579843b, type: 3}
      propertyPath: m_LocalRotation.x
      value: -.707106829
      objectReference: {fileID: 0}
    - target: {fileID: 421170, guid: 834c99069a124aa439d5795c3579843b, type: 3}
      propertyPath: m_LocalRotation.y
      value: 0
      objectReference: {fileID: 0}
    - target: {fileID: 421170, guid: 834c99069a124aa439d5795c3579843b, type: 3}
      propertyPath: m_LocalRotation.z
      value: 0
      objectReference: {fileID: 0}
    m_RemovedComponents: []
  m_SourcePrefab: {fileID: 100100000, guid: 834c99069a124aa439d5795c3579843b, type: 3}
--- !u!4 &1452412520 stripped
Transform:
  m_CorrespondingSourceObject: {fileID: 421170, guid: 834c99069a124aa439d5795c3579843b,
    type: 3}
  m_PrefabInstance: {fileID: 1452412519}
  m_PrefabAsset: {fileID: 0}
--- !u!1 &1613563250
GameObject:
  m_ObjectHideFlags: 0
  m_CorrespondingSourceObject: {fileID: 0}
  m_PrefabInstance: {fileID: 0}
  m_PrefabAsset: {fileID: 0}
  serializedVersion: 6
  m_Component:
  - component: {fileID: 1613563251}
  m_Layer: 0
  m_Name: FX
  m_TagString: Untagged
  m_Icon: {fileID: 0}
  m_NavMeshLayer: 0
  m_StaticEditorFlags: 0
  m_IsActive: 1
--- !u!4 &1613563251
Transform:
  m_ObjectHideFlags: 0
  m_CorrespondingSourceObject: {fileID: 0}
  m_PrefabInstance: {fileID: 0}
  m_PrefabAsset: {fileID: 0}
  m_GameObject: {fileID: 1613563250}
  m_LocalRotation: {x: 0, y: 0, z: 0, w: 1}
  m_LocalPosition: {x: 0, y: 0, z: 0}
  m_LocalScale: {x: 1, y: 1, z: 1}
  m_Children:
  - {fileID: 749029621}
  - {fileID: 1303053343}
  - {fileID: 1225777376}
  - {fileID: 1452412520}
  - {fileID: 352179738}
  - {fileID: 569901814}
  - {fileID: 1300837694}
  - {fileID: 1433476051}
  - {fileID: 1978590631}
  - {fileID: 326569809}
  - {fileID: 1940375979}
  - {fileID: 56494785}
  - {fileID: 1923449092}
  - {fileID: 96853088}
  - {fileID: 1436199684}
  - {fileID: 713842204}
  - {fileID: 1111931439}
  - {fileID: 752847374}
  - {fileID: 269900725}
  m_Father: {fileID: 0}
  m_RootOrder: 2
  m_LocalEulerAnglesHint: {x: 0, y: 0, z: 0}
--- !u!1001 &1923449091
PrefabInstance:
  m_ObjectHideFlags: 0
  serializedVersion: 2
  m_Modification:
    m_TransformParent: {fileID: 1613563251}
    m_Modifications:
    - target: {fileID: 441502, guid: 5702e2a6fea804b45b49b70d8feaf7ae, type: 3}
      propertyPath: m_RootOrder
      value: 12
      objectReference: {fileID: 0}
    - target: {fileID: 441502, guid: 5702e2a6fea804b45b49b70d8feaf7ae, type: 3}
      propertyPath: m_LocalPosition.x
      value: 0
      objectReference: {fileID: 0}
    - target: {fileID: 441502, guid: 5702e2a6fea804b45b49b70d8feaf7ae, type: 3}
      propertyPath: m_LocalPosition.y
      value: 0
      objectReference: {fileID: 0}
    - target: {fileID: 441502, guid: 5702e2a6fea804b45b49b70d8feaf7ae, type: 3}
      propertyPath: m_LocalPosition.z
      value: 0
      objectReference: {fileID: 0}
    - target: {fileID: 441502, guid: 5702e2a6fea804b45b49b70d8feaf7ae, type: 3}
      propertyPath: m_LocalRotation.w
      value: 1
      objectReference: {fileID: 0}
    - target: {fileID: 441502, guid: 5702e2a6fea804b45b49b70d8feaf7ae, type: 3}
      propertyPath: m_LocalRotation.x
      value: 0
      objectReference: {fileID: 0}
    - target: {fileID: 441502, guid: 5702e2a6fea804b45b49b70d8feaf7ae, type: 3}
      propertyPath: m_LocalRotation.y
      value: 0
      objectReference: {fileID: 0}
    - target: {fileID: 441502, guid: 5702e2a6fea804b45b49b70d8feaf7ae, type: 3}
      propertyPath: m_LocalRotation.z
      value: 0
      objectReference: {fileID: 0}
    m_RemovedComponents: []
  m_SourcePrefab: {fileID: 100100000, guid: 5702e2a6fea804b45b49b70d8feaf7ae, type: 3}
--- !u!4 &1923449092 stripped
Transform:
  m_CorrespondingSourceObject: {fileID: 441502, guid: 5702e2a6fea804b45b49b70d8feaf7ae,
    type: 3}
  m_PrefabInstance: {fileID: 1923449091}
  m_PrefabAsset: {fileID: 0}
--- !u!1001 &1940375978
PrefabInstance:
  m_ObjectHideFlags: 0
  serializedVersion: 2
  m_Modification:
    m_TransformParent: {fileID: 1613563251}
    m_Modifications:
    - target: {fileID: 434588, guid: 1570b78163aaedc44bfd35cf13a9f13f, type: 3}
      propertyPath: m_RootOrder
      value: 10
      objectReference: {fileID: 0}
    - target: {fileID: 434588, guid: 1570b78163aaedc44bfd35cf13a9f13f, type: 3}
      propertyPath: m_LocalPosition.x
      value: 0
      objectReference: {fileID: 0}
    - target: {fileID: 434588, guid: 1570b78163aaedc44bfd35cf13a9f13f, type: 3}
      propertyPath: m_LocalPosition.y
      value: 0
      objectReference: {fileID: 0}
    - target: {fileID: 434588, guid: 1570b78163aaedc44bfd35cf13a9f13f, type: 3}
      propertyPath: m_LocalPosition.z
      value: 0
      objectReference: {fileID: 0}
    - target: {fileID: 434588, guid: 1570b78163aaedc44bfd35cf13a9f13f, type: 3}
      propertyPath: m_LocalRotation.w
      value: 1
      objectReference: {fileID: 0}
    - target: {fileID: 434588, guid: 1570b78163aaedc44bfd35cf13a9f13f, type: 3}
      propertyPath: m_LocalRotation.x
      value: 0
      objectReference: {fileID: 0}
    - target: {fileID: 434588, guid: 1570b78163aaedc44bfd35cf13a9f13f, type: 3}
      propertyPath: m_LocalRotation.y
      value: 0
      objectReference: {fileID: 0}
    - target: {fileID: 434588, guid: 1570b78163aaedc44bfd35cf13a9f13f, type: 3}
      propertyPath: m_LocalRotation.z
      value: 0
      objectReference: {fileID: 0}
    m_RemovedComponents: []
  m_SourcePrefab: {fileID: 100100000, guid: 1570b78163aaedc44bfd35cf13a9f13f, type: 3}
--- !u!4 &1940375979 stripped
Transform:
  m_CorrespondingSourceObject: {fileID: 434588, guid: 1570b78163aaedc44bfd35cf13a9f13f,
    type: 3}
  m_PrefabInstance: {fileID: 1940375978}
  m_PrefabAsset: {fileID: 0}
--- !u!1 &1943499319
GameObject:
  m_ObjectHideFlags: 0
  m_CorrespondingSourceObject: {fileID: 0}
  m_PrefabInstance: {fileID: 0}
  m_PrefabAsset: {fileID: 0}
  serializedVersion: 6
  m_Component:
  - component: {fileID: 1943499321}
  - component: {fileID: 1943499320}
  m_Layer: 0
  m_Name: Directional Light
  m_TagString: Untagged
  m_Icon: {fileID: 0}
  m_NavMeshLayer: 0
  m_StaticEditorFlags: 0
  m_IsActive: 1
--- !u!108 &1943499320
Light:
  m_ObjectHideFlags: 0
  m_CorrespondingSourceObject: {fileID: 0}
  m_PrefabInstance: {fileID: 0}
  m_PrefabAsset: {fileID: 0}
  m_GameObject: {fileID: 1943499319}
  m_Enabled: 1
  serializedVersion: 10
  m_Type: 1
  m_Shape: 0
  m_Color: {r: 1, g: 0.95686275, b: 0.8392157, a: 1}
  m_Intensity: 1
  m_Range: 10
  m_SpotAngle: 30
  m_InnerSpotAngle: 21.802082
  m_CookieSize: 10
  m_Shadows:
    m_Type: 2
    m_Resolution: -1
    m_CustomResolution: -1
    m_Strength: 1
    m_Bias: 0.05
    m_NormalBias: 0.4
    m_NearPlane: 0.2
    m_CullingMatrixOverride:
      e00: 1
      e01: 0
      e02: 0
      e03: 0
      e10: 0
      e11: 1
      e12: 0
      e13: 0
      e20: 0
      e21: 0
      e22: 1
      e23: 0
      e30: 0
      e31: 0
      e32: 0
      e33: 1
    m_UseCullingMatrixOverride: 0
  m_Cookie: {fileID: 0}
  m_DrawHalo: 0
  m_Flare: {fileID: 0}
  m_RenderMode: 0
  m_CullingMask:
    serializedVersion: 2
    m_Bits: 4294967295
  m_RenderingLayerMask: 1
  m_Lightmapping: 4
  m_LightShadowCasterMode: 0
  m_AreaSize: {x: 1, y: 1}
  m_BounceIntensity: 1
  m_ColorTemperature: 6570
  m_UseColorTemperature: 0
  m_BoundingSphereOverride: {x: 0, y: 0, z: 0, w: 0}
  m_UseBoundingSphereOverride: 0
  m_UseViewFrustumForShadowCasterCull: 1
  m_ShadowRadius: 0
  m_ShadowAngle: 0
--- !u!4 &1943499321
Transform:
  m_ObjectHideFlags: 0
  m_CorrespondingSourceObject: {fileID: 0}
  m_PrefabInstance: {fileID: 0}
  m_PrefabAsset: {fileID: 0}
  m_GameObject: {fileID: 1943499319}
  m_LocalRotation: {x: 0.40821794, y: -0.23456973, z: 0.109381676, w: 0.87542605}
  m_LocalPosition: {x: 0, y: 3, z: 0}
  m_LocalScale: {x: 1, y: 1, z: 1}
  m_Children: []
  m_Father: {fileID: 0}
  m_RootOrder: 1
  m_LocalEulerAnglesHint: {x: 0, y: 0, z: 0}
--- !u!1 &1974695581
GameObject:
  m_ObjectHideFlags: 0
  m_CorrespondingSourceObject: {fileID: 0}
  m_PrefabInstance: {fileID: 0}
  m_PrefabAsset: {fileID: 0}
  serializedVersion: 6
  m_Component:
  - component: {fileID: 1974695586}
  - component: {fileID: 1974695585}
  - component: {fileID: 1974695583}
  - component: {fileID: 1974695582}
  m_Layer: 0
  m_Name: Main Camera
  m_TagString: MainCamera
  m_Icon: {fileID: 0}
  m_NavMeshLayer: 0
  m_StaticEditorFlags: 0
  m_IsActive: 1
--- !u!81 &1974695582
AudioListener:
  m_ObjectHideFlags: 0
  m_CorrespondingSourceObject: {fileID: 0}
  m_PrefabInstance: {fileID: 0}
  m_PrefabAsset: {fileID: 0}
  m_GameObject: {fileID: 1974695581}
  m_Enabled: 1
--- !u!124 &1974695583
Behaviour:
  m_ObjectHideFlags: 0
  m_CorrespondingSourceObject: {fileID: 0}
  m_PrefabInstance: {fileID: 0}
  m_PrefabAsset: {fileID: 0}
  m_GameObject: {fileID: 1974695581}
  m_Enabled: 1
--- !u!20 &1974695585
Camera:
  m_ObjectHideFlags: 0
  m_CorrespondingSourceObject: {fileID: 0}
  m_PrefabInstance: {fileID: 0}
  m_PrefabAsset: {fileID: 0}
  m_GameObject: {fileID: 1974695581}
  m_Enabled: 1
  serializedVersion: 2
  m_ClearFlags: 1
  m_BackGroundColor: {r: 0.19215687, g: 0.3019608, b: 0.4745098, a: 0.019607844}
  m_projectionMatrixMode: 1
  m_GateFitMode: 2
  m_FOVAxisMode: 0
  m_SensorSize: {x: 36, y: 24}
  m_LensShift: {x: 0, y: 0}
  m_FocalLength: 50
  m_NormalizedViewPortRect:
    serializedVersion: 2
    x: 0
    y: 0
    width: 1
    height: 1
  near clip plane: 0.3
  far clip plane: 1000
  field of view: 60
  orthographic: 0
  orthographic size: 5
  m_Depth: -1
  m_CullingMask:
    serializedVersion: 2
    m_Bits: 4294967295
  m_RenderingPath: -1
  m_TargetTexture: {fileID: 0}
  m_TargetDisplay: 0
  m_TargetEye: 3
  m_HDR: 0
  m_AllowMSAA: 1
  m_AllowDynamicResolution: 0
  m_ForceIntoRT: 0
  m_OcclusionCulling: 1
  m_StereoConvergence: 10
  m_StereoSeparation: 0.022
--- !u!4 &1974695586
Transform:
  m_ObjectHideFlags: 0
  m_CorrespondingSourceObject: {fileID: 0}
  m_PrefabInstance: {fileID: 0}
  m_PrefabAsset: {fileID: 0}
  m_GameObject: {fileID: 1974695581}
  m_LocalRotation: {x: 0, y: 0, z: 0, w: 1}
  m_LocalPosition: {x: 0, y: 1, z: -10}
  m_LocalScale: {x: 1, y: 1, z: 1}
  m_Children: []
  m_Father: {fileID: 0}
  m_RootOrder: 0
  m_LocalEulerAnglesHint: {x: 0, y: 0, z: 0}
--- !u!1001 &1978590630
PrefabInstance:
  m_ObjectHideFlags: 0
  serializedVersion: 2
  m_Modification:
    m_TransformParent: {fileID: 1613563251}
    m_Modifications:
    - target: {fileID: 468624, guid: c83a45822d0d3f94991e76a87670125c, type: 3}
      propertyPath: m_RootOrder
      value: 8
      objectReference: {fileID: 0}
    - target: {fileID: 468624, guid: c83a45822d0d3f94991e76a87670125c, type: 3}
      propertyPath: m_LocalPosition.x
      value: 0
      objectReference: {fileID: 0}
    - target: {fileID: 468624, guid: c83a45822d0d3f94991e76a87670125c, type: 3}
      propertyPath: m_LocalPosition.y
      value: 0
      objectReference: {fileID: 0}
    - target: {fileID: 468624, guid: c83a45822d0d3f94991e76a87670125c, type: 3}
      propertyPath: m_LocalPosition.z
      value: 0
      objectReference: {fileID: 0}
    - target: {fileID: 468624, guid: c83a45822d0d3f94991e76a87670125c, type: 3}
      propertyPath: m_LocalRotation.w
      value: 1
      objectReference: {fileID: 0}
    - target: {fileID: 468624, guid: c83a45822d0d3f94991e76a87670125c, type: 3}
      propertyPath: m_LocalRotation.x
      value: 0
      objectReference: {fileID: 0}
    - target: {fileID: 468624, guid: c83a45822d0d3f94991e76a87670125c, type: 3}
      propertyPath: m_LocalRotation.y
      value: 0
      objectReference: {fileID: 0}
    - target: {fileID: 468624, guid: c83a45822d0d3f94991e76a87670125c, type: 3}
      propertyPath: m_LocalRotation.z
      value: 0
      objectReference: {fileID: 0}
    m_RemovedComponents: []
  m_SourcePrefab: {fileID: 100100000, guid: c83a45822d0d3f94991e76a87670125c, type: 3}
--- !u!4 &1978590631 stripped
Transform:
  m_CorrespondingSourceObject: {fileID: 468624, guid: c83a45822d0d3f94991e76a87670125c,
    type: 3}
  m_PrefabInstance: {fileID: 1978590630}
  m_PrefabAsset: {fileID: 0}
