%YAML 1.1
%TAG !u! tag:unity3d.com,2011:
--- !u!162 &1
EditorUserSettings:
  m_ObjectHideFlags: 0
  serializedVersion: 4
  m_ConfigSettings:
    RecentlyUsedScenePath-0:
      value: 224247031146467a1e1d093650135e131d0457080310090005063f1ac1af0733fbe539f1a7192a3e3c0fee2c441b192bf7040d0ef2442e0e1c01b22a14f21f533fcc1fcd0e860a12c20d05
      flags: 0
    RecentlyUsedScenePath-1:
      value: 224247031146467a1e1d093650135e131d0457080310090005063f1ac1af0733fbe539f1a7192a3e3c0fee2c441b192bf7040d0ef2442e0e1c01b22a14f21f5335c4018b0fc61608d2
      flags: 0
    RecentlyUsedScenePath-2:
      value: 22424703114646680e0b0227036c6c1118131a253468747e38271427fb
      flags: 0
    RecentlyUsedScenePath-3:
      value: 22424703114646680e0b0227036c6c1118131a253466333e243d04
      flags: 0
    RecentlyUsedScenePath-4:
      value: 224247031146466804031c2e1505675f29331d272367023520265326ece92021
      flags: 0
    vcSharedLogLevel:
      value: 0d5e400f0650
      flags: 0
  m_VCAutomaticAdd: 1
  m_VCDebugCom: 0
  m_VCDebugCmd: 0
  m_VCDebugOut: 0
  m_SemanticMergeMode: 2
  m_VCShowFailedCheckout: 1
  m_VCOverwriteFailedCheckoutAssets: 1
  m_VCProjectOverlayIcons: 1
  m_VCHierarchyOverlayIcons: 1
  m_VCOtherOverlayIcons: 1
  m_VCAllowAsyncUpdate: 0
