%YAML 1.1
%TAG !u! tag:unity3d.com,2011:
--- !u!114 &11400000
MonoBehaviour:
  m_ObjectHideFlags: 0
  m_CorrespondingSourceObject: {fileID: 0}
  m_PrefabInstance: {fileID: 0}
  m_PrefabAsset: {fileID: 0}
  m_GameObject: {fileID: 0}
  m_Enabled: 1
  m_EditorHideFlags: 0
  m_Script: {fileID: 11500000, guid: 17d31b7bd1c07484fbfff7564ea72e64, type: 3}
  m_Name: Fireball
  m_EditorClassIdentifier: 
  animatorOverride: {fileID: 22100000, guid: 7fb65dc550388455f8c46e1be03dcc23, type: 2}
  equippedPrefab: {fileID: 0}
  weaponDamage: 10
  weaponRange: 20
  isRightHanded: 0
  projectile: {fileID: 5662527661237568267, guid: cae9c3140c4e04785a3f9d9eefe10c0e,
    type: 3}
