%YAML 1.1
%TAG !u! tag:unity3d.com,2011:
--- !u!114 &11400000
MonoBehaviour:
  m_ObjectHideFlags: 0
  m_CorrespondingSourceObject: {fileID: 0}
  m_PrefabInstance: {fileID: 0}
  m_PrefabAsset: {fileID: 0}
  m_GameObject: {fileID: 0}
  m_Enabled: 1
  m_EditorHideFlags: 0
  m_Script: {fileID: 11500000, guid: 17d31b7bd1c07484fbfff7564ea72e64, type: 3}
  m_Name: Bow Red Projectile
  m_EditorClassIdentifier: 
  animatorOverride: {fileID: 22100000, guid: ba66dfd003f2e4a89aeef9713f7aba8b, type: 2}
  equippedPrefab: {fileID: 5145119062873441283, guid: e341b407ef02f43c696ceee5aa2261ac,
    type: 3}
  weaponDamage: 15
  weaponRange: 10
  isRightHanded: 0
  projectile: {fileID: 8898510114339463215, guid: b365e0d36395d402f9d7f3f106731b8d,
    type: 3}
