(
	{q0,q1,q2,q3,q4,q5,q6},
	{a,b},
	{a,b,B,X},
	{
		(q0,B)->(q1,B,D),
		(q1,X)->(q1,X,D),
		(q1,a)->(q2,X,D),
		(q1,B)->(q5,B,E),
		(q2,a)->(q2,a,D),
		(q2,X)->(q2,X,D),
		(q2,b)->(q3,X,D),
		(q3,B)->(q4,B,E),
		(q3,b)->(q3,b,D),
		(q4,X)->(q4,X,E),
		(q4,a)->(q4,a,E),
		(q4,b)->(q4,b,E),
		(q4,B)->(q1,B,D),
		(q5,X)->(q5,X,E),
		(q5,B)->(q6,B,N)
	},
	q0,
	{q6}
)