\relax 
\providecommand\hyper@newdestlabel[2]{}
\bbl@cs{beforestart}
\providecommand\HyperFirstAtBeginDocument{\AtBeginDocument}
\HyperFirstAtBeginDocument{\ifx\hyper@anchor\@undefined
\global\let\oldcontentsline\contentsline
\gdef\contentsline#1#2#3#4{\oldcontentsline{#1}{#2}{#3}}
\global\let\oldnewlabel\newlabel
\gdef\newlabel#1#2{\newlabelxx{#1}#2}
\gdef\newlabelxx#1#2#3#4#5#6{\oldnewlabel{#1}{{#2}{#3}}}
\AtEndDocument{\ifx\hyper@anchor\@undefined
\let\contentsline\oldcontentsline
\let\newlabel\oldnewlabel
\fi}
\fi}
\global\let\hyper@last\relax 
\gdef\HyperFirstAtBeginDocument#1{#1}
\providecommand\HyField@AuxAddToFields[1]{}
\providecommand\HyField@AuxAddToCoFields[2]{}
\babel@aux{english}{}
\@writefile{toc}{\contentsline {section}{\numberline {1}Introduction}{2}{section.1}\protected@file@percent }
\@writefile{toc}{\contentsline {section}{\numberline {2}Methods}{3}{section.2}\protected@file@percent }
\@writefile{lof}{\contentsline {figure}{\numberline {1}{\ignorespaces Decreasing Exploration Profile.\relax }}{3}{figure.caption.2}\protected@file@percent }
\providecommand*\caption@xref[2]{\@setref\relax\@undefined{#1}}
\newlabel{Fig:expexp}{{1}{3}{Decreasing Exploration Profile.\relax }{figure.caption.2}{}}
\@writefile{lof}{\contentsline {figure}{\numberline {2}{\ignorespaces Decreasing Exploration Profile with Cosine behaviour.\relax }}{3}{figure.caption.3}\protected@file@percent }
\newlabel{Fig:expcos}{{2}{3}{Decreasing Exploration Profile with Cosine behaviour.\relax }{figure.caption.3}{}}
\@writefile{lot}{\contentsline {table}{\numberline {1}{\ignorespaces List of best hyperparameters for CartPole-V1.\relax }}{3}{table.caption.5}\protected@file@percent }
\newlabel{Tab:1}{{1}{3}{List of best hyperparameters for CartPole-V1.\relax }{table.caption.5}{}}
\@writefile{lof}{\contentsline {figure}{\numberline {3}{\ignorespaces Importance of Hyperparameters in RL environment.\relax }}{4}{figure.caption.6}\protected@file@percent }
\newlabel{Fig:Optuna}{{3}{4}{Importance of Hyperparameters in RL environment.\relax }{figure.caption.6}{}}
\@writefile{lof}{\contentsline {figure}{\numberline {4}{\ignorespaces Score History using CNN DQN.\relax }}{4}{figure.caption.8}\protected@file@percent }
\newlabel{Fig:scorecurveCNN}{{4}{4}{Score History using CNN DQN.\relax }{figure.caption.8}{}}
\@writefile{lof}{\contentsline {figure}{\numberline {5}{\ignorespaces Structure of DQN for elaborating pixels.\relax }}{4}{figure.caption.9}\protected@file@percent }
\newlabel{Fig:StructureCNN}{{5}{4}{Structure of DQN for elaborating pixels.\relax }{figure.caption.9}{}}
\@writefile{lof}{\contentsline {figure}{\numberline {6}{\ignorespaces MountainCar-V0 Environment.\relax }}{5}{figure.caption.11}\protected@file@percent }
\newlabel{Fig:MountainCargame}{{6}{5}{MountainCar-V0 Environment.\relax }{figure.caption.11}{}}
\@writefile{lof}{\contentsline {figure}{\numberline {7}{\ignorespaces Score History fot MountainCar-V0 environment.\relax }}{6}{figure.caption.13}\protected@file@percent }
\newlabel{Fig:ScoreTrainingMountain}{{7}{6}{Score History fot MountainCar-V0 environment.\relax }{figure.caption.13}{}}
\@writefile{lof}{\contentsline {figure}{\numberline {8}{\ignorespaces Slice Plot from Optuna.\relax }}{7}{figure.caption.16}\protected@file@percent }
\newlabel{Fig:OptunaSlice}{{8}{7}{Slice Plot from Optuna.\relax }{figure.caption.16}{}}
\@writefile{lof}{\contentsline {figure}{\numberline {9}{\ignorespaces Study History from Optuna\relax }}{7}{figure.caption.17}\protected@file@percent }
\newlabel{Fig:OptunaHistory}{{9}{7}{Study History from Optuna\relax }{figure.caption.17}{}}
