\relax 
\providecommand\hyper@newdestlabel[2]{}
\bbl@cs{beforestart}
\providecommand\HyperFirstAtBeginDocument{\AtBeginDocument}
\HyperFirstAtBeginDocument{\ifx\hyper@anchor\@undefined
\global\let\oldcontentsline\contentsline
\gdef\contentsline#1#2#3#4{\oldcontentsline{#1}{#2}{#3}}
\global\let\oldnewlabel\newlabel
\gdef\newlabel#1#2{\newlabelxx{#1}#2}
\gdef\newlabelxx#1#2#3#4#5#6{\oldnewlabel{#1}{{#2}{#3}}}
\AtEndDocument{\ifx\hyper@anchor\@undefined
\let\contentsline\oldcontentsline
\let\newlabel\oldnewlabel
\fi}
\fi}
\global\let\hyper@last\relax 
\gdef\HyperFirstAtBeginDocument#1{#1}
\providecommand\HyField@AuxAddToFields[1]{}
\providecommand\HyField@AuxAddToCoFields[2]{}
\babel@aux{english}{}
\@writefile{toc}{\contentsline {section}{\numberline {1}Introduction}{2}{section.1}\protected@file@percent }
\@writefile{toc}{\contentsline {section}{\numberline {2}Methods}{2}{section.2}\protected@file@percent }
\@writefile{lof}{\contentsline {figure}{\numberline {1}{\ignorespaces Example of initial and reconstructed image.\relax }}{2}{figure.caption.1}\protected@file@percent }
\providecommand*\caption@xref[2]{\@setref\relax\@undefined{#1}}
\newlabel{NoNoiseResults}{{1}{2}{Example of initial and reconstructed image.\relax }{figure.caption.1}{}}
\@writefile{lof}{\contentsline {figure}{\numberline {2}{\ignorespaces Training Loss (Reconstruction MSE).\relax }}{3}{figure.caption.2}\protected@file@percent }
\newlabel{NoNoiseLossTraining}{{2}{3}{Training Loss (Reconstruction MSE).\relax }{figure.caption.2}{}}
\@writefile{lot}{\contentsline {table}{\numberline {1}{\ignorespaces List of dicrete values of hyperparameters.\relax }}{3}{table.caption.4}\protected@file@percent }
\newlabel{Tab:1}{{1}{3}{List of dicrete values of hyperparameters.\relax }{table.caption.4}{}}
\@writefile{lof}{\contentsline {figure}{\numberline {3}{\ignorespaces Example of denoising performances.\relax }}{3}{figure.caption.6}\protected@file@percent }
\newlabel{DenoisingSamples}{{3}{3}{Example of denoising performances.\relax }{figure.caption.6}{}}
\@writefile{lof}{\contentsline {figure}{\numberline {4}{\ignorespaces Denoising loss training dynamics.\relax }}{4}{figure.caption.7}\protected@file@percent }
\newlabel{DenoisingTraining}{{4}{4}{Denoising loss training dynamics.\relax }{figure.caption.7}{}}
\@writefile{lof}{\contentsline {figure}{\numberline {5}{\ignorespaces t-SNE applied to normal samples.\relax }}{4}{figure.caption.10}\protected@file@percent }
\newlabel{tSNE}{{5}{4}{t-SNE applied to normal samples.\relax }{figure.caption.10}{}}
\newlabel{GANeq}{{2}{5}{GAN - Generation of new MNIST samples}{equation.2.2}{}}
\@writefile{lof}{\contentsline {figure}{\numberline {6}{\ignorespaces GAN samples at epoch $150$.\relax }}{5}{figure.caption.12}\protected@file@percent }
\newlabel{GAN150Epoch}{{6}{5}{GAN samples at epoch $150$.\relax }{figure.caption.12}{}}
\@writefile{lof}{\contentsline {figure}{\numberline {7}{\ignorespaces t-SNE applied to normal samples.\relax }}{6}{figure.caption.14}\protected@file@percent }
\@writefile{lof}{\contentsline {figure}{\numberline {8}{\ignorespaces t-SNE applied to noisy samples.\relax }}{6}{figure.caption.15}\protected@file@percent }
\newlabel{NoisytSNE}{{8}{6}{t-SNE applied to noisy samples.\relax }{figure.caption.15}{}}
\newlabel{VariGAuss}{{9a}{7}{Subfigure 9a}{subfigure.9.1}{}}
\newlabel{sub@VariGAuss}{{(a)}{a}{Subfigure 9a\relax }{subfigure.9.1}{}}
\newlabel{MeanGauss}{{9b}{7}{Subfigure 9b}{subfigure.9.2}{}}
\newlabel{sub@MeanGauss}{{(b)}{b}{Subfigure 9b\relax }{subfigure.9.2}{}}
\newlabel{probZeroMAsk}{{9c}{7}{Subfigure 9c}{subfigure.9.3}{}}
\newlabel{sub@probZeroMAsk}{{(c)}{c}{Subfigure 9c\relax }{subfigure.9.3}{}}
\@writefile{lof}{\contentsline {figure}{\numberline {9}{\ignorespaces Different behaviours with different threshold of noise. (a) Variance of the Gaussian (b) Mean of the Gaussian (c) Probability of Zero Mask.\relax }}{7}{figure.caption.16}\protected@file@percent }
\newlabel{changingNoise}{{9}{7}{Different behaviours with different threshold of noise. (a) Variance of the Gaussian (b) Mean of the Gaussian (c) Probability of Zero Mask.\relax }{figure.caption.16}{}}
\@writefile{lof}{\contentsline {subfigure}{\numberline{(a)}{\ignorespaces {}}}{7}{subfigure.9.1}\protected@file@percent }
\@writefile{lof}{\contentsline {subfigure}{\numberline{(b)}{\ignorespaces {}}}{7}{subfigure.9.2}\protected@file@percent }
\@writefile{lof}{\contentsline {subfigure}{\numberline{(c)}{\ignorespaces {}}}{7}{subfigure.9.3}\protected@file@percent }
\@writefile{lof}{\contentsline {figure}{\numberline {10}{\ignorespaces GAN samples at epoch $100$.\relax }}{7}{figure.caption.17}\protected@file@percent }
\newlabel{GAN100Epoch}{{10}{7}{GAN samples at epoch $100$.\relax }{figure.caption.17}{}}
\@writefile{lof}{\contentsline {figure}{\numberline {11}{\ignorespaces GAN samples at epoch $50$.\relax }}{8}{figure.caption.18}\protected@file@percent }
\newlabel{GAN50Epoch}{{11}{8}{GAN samples at epoch $50$.\relax }{figure.caption.18}{}}
\@writefile{lof}{\contentsline {figure}{\numberline {12}{\ignorespaces GAN samples at epoch $0$.\relax }}{8}{figure.caption.19}\protected@file@percent }
\newlabel{GAN0Epoch}{{12}{8}{GAN samples at epoch $0$.\relax }{figure.caption.19}{}}
