\relax 
\providecommand\hyper@newdestlabel[2]{}
\bbl@cs{beforestart}
\providecommand\HyperFirstAtBeginDocument{\AtBeginDocument}
\HyperFirstAtBeginDocument{\ifx\hyper@anchor\@undefined
\global\let\oldcontentsline\contentsline
\gdef\contentsline#1#2#3#4{\oldcontentsline{#1}{#2}{#3}}
\global\let\oldnewlabel\newlabel
\gdef\newlabel#1#2{\newlabelxx{#1}#2}
\gdef\newlabelxx#1#2#3#4#5#6{\oldnewlabel{#1}{{#2}{#3}}}
\AtEndDocument{\ifx\hyper@anchor\@undefined
\let\contentsline\oldcontentsline
\let\newlabel\oldnewlabel
\fi}
\fi}
\global\let\hyper@last\relax 
\gdef\HyperFirstAtBeginDocument#1{#1}
\providecommand\HyField@AuxAddToFields[1]{}
\providecommand\HyField@AuxAddToCoFields[2]{}
\babel@aux{english}{}
\@writefile{toc}{\contentsline {section}{\numberline {1}Introduction}{2}{section.1}\protected@file@percent }
\@writefile{toc}{\contentsline {section}{\numberline {2}Part 1 - Regression}{2}{section.2}\protected@file@percent }
\@writefile{lof}{\contentsline {figure}{\numberline {1}{\ignorespaces Training set. }}{2}{figure.1}\protected@file@percent }
\newlabel{TrainingSet}{{1}{2}{Training set}{figure.1}{}}
\@writefile{lof}{\contentsline {figure}{\numberline {2}{\ignorespaces Loss of validation and training of best model according to Grid Search. }}{3}{figure.2}\protected@file@percent }
\newlabel{BestValTra}{{2}{3}{Loss of validation and training of best model according to Grid Search}{figure.2}{}}
\@writefile{lof}{\contentsline {figure}{\numberline {3}{\ignorespaces Model of the function in the range of the training set w.r.t. test points.}}{3}{figure.3}\protected@file@percent }
\newlabel{BestModel}{{3}{3}{Model of the function in the range of the training set w.r.t. test points}{figure.3}{}}
\@writefile{toc}{\contentsline {subsection}{\numberline {2.1}Tuning Hyperparameters - Grid Search}{3}{subsection.2.1}\protected@file@percent }
\@writefile{lot}{\contentsline {table}{\numberline {1}{\ignorespaces List of dicrete values of hyperparameters.}}{4}{table.1}\protected@file@percent }
\newlabel{Tab:1}{{1}{4}{List of dicrete values of hyperparameters}{table.1}{}}
\@writefile{toc}{\contentsline {section}{\numberline {3}Part 2 - Classification}{4}{section.3}\protected@file@percent }
\@writefile{lof}{\contentsline {figure}{\numberline {4}{\ignorespaces Model of the function in the range of the training set w.r.t. test points.}}{4}{figure.4}\protected@file@percent }
\newlabel{BestValTraCla}{{4}{4}{Model of the function in the range of the training set w.r.t. test points}{figure.4}{}}
\@writefile{lof}{\contentsline {figure}{\numberline {5}{\ignorespaces Confusion Matrix.}}{4}{figure.5}\protected@file@percent }
\newlabel{confusionMatrix}{{5}{4}{Confusion Matrix}{figure.5}{}}
\@writefile{lof}{\contentsline {figure}{\numberline {6}{\ignorespaces Images, GroundTruth and prediction for some examples.}}{4}{figure.6}\protected@file@percent }
\newlabel{example}{{6}{4}{Images, GroundTruth and prediction for some examples}{figure.6}{}}
\@writefile{toc}{\contentsline {subsection}{\numberline {3.1}Use of CNN for classification task}{4}{subsection.3.1}\protected@file@percent }
\@writefile{lot}{\contentsline {table}{\numberline {2}{\ignorespaces Parameters of Pseudo Random Search.}}{5}{table.2}\protected@file@percent }
\@writefile{toc}{\contentsline {subsection}{\numberline {3.2}Tuning Hyperparameters -Pseudo Random Search}{5}{subsection.3.2}\protected@file@percent }
\@writefile{toc}{\contentsline {section}{\numberline {4}Appendix}{5}{section.4}\protected@file@percent }
\@writefile{lof}{\contentsline {figure}{\numberline {7}{\ignorespaces Model of the function in the range of the training set w.r.t. test points. Case with lower epochs (100) and batch size (8).}}{5}{figure.7}\protected@file@percent }
\@writefile{lof}{\contentsline {figure}{\numberline {8}{\ignorespaces Histograms of activation of regression task.}}{5}{figure.8}\protected@file@percent }
\newlabel{histRegress}{{8}{5}{Histograms of activation of regression task}{figure.8}{}}
\@writefile{lof}{\contentsline {figure}{\numberline {9}{\ignorespaces Visualization of convolutional filters ($1^{st}$ layer).}}{6}{figure.9}\protected@file@percent }
\newlabel{kernelConv}{{9}{6}{Visualization of convolutional filters ($1^{st}$ layer)}{figure.9}{}}
