\relax 
\providecommand\hyper@newdestlabel[2]{}
\providecommand\HyperFirstAtBeginDocument{\AtBeginDocument}
\HyperFirstAtBeginDocument{\ifx\hyper@anchor\@undefined
\global\let\oldcontentsline\contentsline
\gdef\contentsline#1#2#3#4{\oldcontentsline{#1}{#2}{#3}}
\global\let\oldnewlabel\newlabel
\gdef\newlabel#1#2{\newlabelxx{#1}#2}
\gdef\newlabelxx#1#2#3#4#5#6{\oldnewlabel{#1}{{#2}{#3}}}
\AtEndDocument{\ifx\hyper@anchor\@undefined
\let\contentsline\oldcontentsline
\let\newlabel\oldnewlabel
\fi}
\fi}
\global\let\hyper@last\relax 
\gdef\HyperFirstAtBeginDocument#1{#1}
\providecommand\HyField@AuxAddToFields[1]{}
\providecommand\HyField@AuxAddToCoFields[2]{}
\babel@aux{english}{}
\@writefile{toc}{\contentsline {section}{\numberline {1}Abstract}{3}{section.1}}
\@writefile{lof}{\contentsline {figure}{\numberline {1}{\ignorespaces Starting Adjacency Matrix.}}{3}{figure.1}}
\newlabel{Adj}{{1}{3}{Starting Adjacency Matrix}{figure.1}{}}
\@writefile{toc}{\contentsline {section}{\numberline {2}Ranking}{3}{section.2}}
\@writefile{toc}{\contentsline {subsection}{\numberline {2.1}PageRank}{3}{subsection.2.1}}
\newlabel{StochProc}{{1}{3}{PageRank}{equation.2.1}{}}
\newlabel{PageRankEquation}{{2}{4}{PageRank}{equation.2.2}{}}
\@writefile{lof}{\contentsline {figure}{\numberline {2}{\ignorespaces Convergence of the second highest eigenvalue.}}{4}{figure.2}}
\newlabel{2Eigen}{{2}{4}{Convergence of the second highest eigenvalue}{figure.2}{}}
\@writefile{lof}{\contentsline {figure}{\numberline {3}{\ignorespaces Eigenvalues of PageRank.}}{4}{figure.3}}
\newlabel{Eigen}{{3}{4}{Eigenvalues of PageRank}{figure.3}{}}
\@writefile{toc}{\contentsline {subsubsection}{\numberline {2.1.1}Power Iteration}{4}{subsubsection.2.1.1}}
\@writefile{toc}{\contentsline {subsubsection}{\numberline {2.1.2}Solving Linear Equation}{5}{subsubsection.2.1.2}}
\@writefile{lof}{\contentsline {figure}{\numberline {4}{\ignorespaces PageRank values.}}{5}{figure.4}}
\newlabel{plotPage}{{4}{5}{PageRank values}{figure.4}{}}
\@writefile{toc}{\contentsline {subsection}{\numberline {2.2}SimRank}{5}{subsection.2.2}}
\@writefile{lof}{\contentsline {figure}{\numberline {5}{\ignorespaces 3D SimRank matrix.}}{6}{figure.5}}
\newlabel{SimRank}{{5}{6}{3D SimRank matrix}{figure.5}{}}
\@writefile{lof}{\contentsline {figure}{\numberline {6}{\ignorespaces 2D SimRank matrix.}}{6}{figure.6}}
\newlabel{SimRank3D}{{6}{6}{2D SimRank matrix}{figure.6}{}}
\@writefile{toc}{\contentsline {section}{\numberline {3}Community Detection}{6}{section.3}}
\@writefile{toc}{\contentsline {subsection}{\numberline {3.1}PageRank nibble}{6}{subsection.3.1}}
\@writefile{lof}{\contentsline {figure}{\numberline {7}{\ignorespaces Conductance of PageRank-nibble.}}{6}{figure.7}}
\newlabel{ConductanceNibble}{{7}{6}{Conductance of PageRank-nibble}{figure.7}{}}
\@writefile{lof}{\contentsline {figure}{\numberline {8}{\ignorespaces Core \& Internal Network partitions.}}{6}{figure.8}}
\newlabel{PageRankNibble}{{8}{6}{Core \& Internal Network partitions}{figure.8}{}}
\@writefile{toc}{\contentsline {subsection}{\numberline {3.2}Spectral Clustering}{7}{subsection.3.2}}
\@writefile{lof}{\contentsline {figure}{\numberline {9}{\ignorespaces Conductance of Spectral Clustering.}}{7}{figure.9}}
\newlabel{SweepCO}{{9}{7}{Conductance of Spectral Clustering}{figure.9}{}}
\@writefile{toc}{\contentsline {subsection}{\numberline {3.3}Modularity}{7}{subsection.3.3}}
\@writefile{lof}{\contentsline {figure}{\numberline {10}{\ignorespaces Plot of the 32 communities.}}{8}{figure.10}}
\newlabel{commu}{{10}{8}{Plot of the 32 communities}{figure.10}{}}
\@writefile{toc}{\contentsline {section}{\numberline {4}Link Prediction}{8}{section.4}}
\@writefile{lof}{\contentsline {figure}{\numberline {11}{\ignorespaces Detection of two communities by Modularity.}}{9}{figure.11}}
\newlabel{ModCom}{{11}{9}{Detection of two communities by Modularity}{figure.11}{}}
\newlabel{TabLink}{{4}{9}{Link Prediction}{section.4}{}}
\@writefile{toc}{\contentsline {subsection}{\numberline {4.1}Neighbour based Techniques}{9}{subsection.4.1}}
\@writefile{toc}{\contentsline {subsubsection}{\numberline {4.1.1}Common Neighbour}{9}{subsubsection.4.1.1}}
\@writefile{toc}{\contentsline {subsubsection}{\numberline {4.1.2}Adamic Adar}{9}{subsubsection.4.1.2}}
\@writefile{toc}{\contentsline {subsubsection}{\numberline {4.1.3}Resource Allocation}{10}{subsubsection.4.1.3}}
\@writefile{lof}{\contentsline {figure}{\numberline {12}{\ignorespaces $\mathbf  {S_{CN}}$ matrix.}}{10}{figure.12}}
\newlabel{commonNeigh}{{12}{10}{$\mathbf {S_{CN}}$ matrix}{figure.12}{}}
\@writefile{lof}{\contentsline {figure}{\numberline {13}{\ignorespaces $\mathbf  {S_{AA}}$ matrix.}}{10}{figure.13}}
\newlabel{AdamicA}{{13}{10}{$\mathbf {S_{AA}}$ matrix}{figure.13}{}}
\@writefile{lof}{\contentsline {figure}{\numberline {14}{\ignorespaces $\mathbf  {S_{RA}}$ matrix.}}{10}{figure.14}}
\newlabel{ResourceA}{{14}{10}{$\mathbf {S_{RA}}$ matrix}{figure.14}{}}
\@writefile{toc}{\contentsline {subsection}{\numberline {4.2}Path based Techniques}{10}{subsection.4.2}}
\@writefile{toc}{\contentsline {subsubsection}{\numberline {4.2.1}Kats}{10}{subsubsection.4.2.1}}
\@writefile{toc}{\contentsline {subsubsection}{\numberline {4.2.2}Local Path}{10}{subsubsection.4.2.2}}
\@writefile{lof}{\contentsline {figure}{\numberline {15}{\ignorespaces $\mathbf  {S_{Kats}}$ matrix.}}{11}{figure.15}}
\newlabel{KatsA}{{15}{11}{$\mathbf {S_{Kats}}$ matrix}{figure.15}{}}
\@writefile{lof}{\contentsline {figure}{\numberline {16}{\ignorespaces $\mathbf  {S_{LP}}$ matrix.}}{11}{figure.16}}
\newlabel{LocalA}{{16}{11}{$\mathbf {S_{LP}}$ matrix}{figure.16}{}}
\@writefile{toc}{\contentsline {subsection}{\numberline {4.3}Random Walk based Technique}{11}{subsection.4.3}}
\@writefile{toc}{\contentsline {subsubsection}{\numberline {4.3.1}Random Walk with restart}{11}{subsubsection.4.3.1}}
\@writefile{lof}{\contentsline {figure}{\numberline {17}{\ignorespaces $\mathbf  {S_{RWR}}$ matrix.}}{11}{figure.17}}
\newlabel{RandomWalkLink}{{17}{11}{$\mathbf {S_{RWR}}$ matrix}{figure.17}{}}
\@writefile{toc}{\contentsline {subsection}{\numberline {4.4}AUC}{12}{subsection.4.4}}
\@writefile{lof}{\contentsline {figure}{\numberline {18}{\ignorespaces AUC measures for each paradigm with 10\%.}}{12}{figure.18}}
\newlabel{auc}{{18}{12}{AUC measures for each paradigm with 10\%}{figure.18}{}}
\@writefile{lof}{\contentsline {figure}{\numberline {19}{\ignorespaces AUC measures for each paradigm with 20\%.}}{13}{figure.19}}
\newlabel{auc20}{{19}{13}{AUC measures for each paradigm with 20\%}{figure.19}{}}
\@writefile{toc}{\contentsline {section}{\numberline {5}References}{13}{section.5}}
