\relax 
\babel@aux{english}{}
\@writefile{toc}{\contentsline {section}{\numberline {1}Network Generation}{1}\protected@file@percent }
\newlabel{gephi}{{1}{1}}
\@writefile{lof}{\contentsline {figure}{\numberline {1}{\ignorespaces Plotting the network using Gephi.}}{1}\protected@file@percent }
\@writefile{toc}{\contentsline {section}{\numberline {2}Network analytics}{2}\protected@file@percent }
\@writefile{lof}{\contentsline {figure}{\numberline {2}{\ignorespaces Plots of the power-law fitting.}}{3}\protected@file@percent }
