\relax 
\babel@aux{english}{}
\@writefile{toc}{\contentsline {section}{\numberline {1}Network Generation}{1}\protected@file@percent }
\newlabel{gephi}{{1}{1}}
\@writefile{lof}{\contentsline {figure}{\numberline {1}{\ignorespaces Plotting the network using Gephi.}}{1}\protected@file@percent }
\@writefile{toc}{\contentsline {section}{\numberline {2}Network analytics}{2}\protected@file@percent }
\@writefile{lof}{\contentsline {figure}{\numberline {2}{\ignorespaces Plots of the power-law fitting.}}{3}\protected@file@percent }
\@writefile{toc}{\contentsline {section}{\numberline {3}Distance and diameter}{3}\protected@file@percent }
\@writefile{toc}{\contentsline {section}{\numberline {4}Clustering Coefficients}{4}\protected@file@percent }
\newlabel{clust}{{4}{4}}
\@writefile{lof}{\contentsline {figure}{\numberline {3}{\ignorespaces Plot of Clustering coefficient distribution.}}{4}\protected@file@percent }
\@writefile{toc}{\contentsline {section}{\numberline {5}Assortativity}{4}\protected@file@percent }
\newlabel{asso}{{5}{5}}
\@writefile{lof}{\contentsline {figure}{\numberline {4}{\ignorespaces Plot of Assortativity.}}{5}\protected@file@percent }
\@writefile{toc}{\contentsline {section}{\numberline {6}Robustness}{5}\protected@file@percent }
\newlabel{Rob}{{6}{6}}
\@writefile{lof}{\contentsline {figure}{\numberline {5}{\ignorespaces Plot of Robustness.}}{6}\protected@file@percent }
