{
  "container": [
    "p-6",
    "bg-white",
    "rounded-lg",
    "shadow-md",
    "flex",
    "w-full",
    "max-w-6xl",
    "justify-between",
    "mb-6"
  ],
  "filter-label": ["mr-6"],
  "filter-input": ["border"]
}
