[
    {
        "id": 2,
        "accountId": 30,
        "commissionId": 781,
        "bankAccountNumber": "0946641892\/7172",
        "amount": -51
    },
    {
        "id": 705,
        "accountId": 22,
        "commissionId": 8124,
        "bankAccountNumber": "0183084816\/4119",
        "amount": 21
    },
    {
        "id": 5713714,
        "accountId": 22,
        "commissionId": 8124,
        "bankAccountNumber": "0615448826\/0966",
        "amount": 8
    },
    {
        "id": 80800125,
        "accountId": 2977,
        "commissionId": 39039112,
        "bankAccountNumber": "0339087055\/9479",
        "amount": 91
    },
    {
        "id": null,
        "accountId": 30,
        "commissionId": 233,
        "bankAccountNumber": "123232\/12212",
        "amount": 10
    },
    {
        "id": null,
        "accountId": 30,
        "commissionId": 233,
        "bankAccountNumber": "123232\/12212",
        "amount": 10
    },
    {
        "id": null,
        "accountId": 30,
        "commissionId": 2258893,
        "bankAccountNumber": "123232\/12212",
        "amount": 59
    }
]