{
    "defaultSeverity": "warning",
    "extends": [
        "tslint:recommended", 
        "tslint-config-prettier"
    ],
    "jsRules": {},
    "rules": {
        "ordered-imports": false,
        "object-literal-sort-keys": false,
        "member-ordering": false
    },
    "rulesDirectory": []
}