Datum;WoTag;Woche;lfdTag;JulTag;DiffUTC;SAofficial;SUofficial;SAcivil;SUcivil;SAnautic;SUnautic;SAastro;SUastro;blueSAfrom;blueSAuntil;goldSAfrom;goldSAuntil;goldSUfrom;goldSUuntil;blueSUfrom;blueSUuntil;MondTag;MondProzent;Mondphase;MA;MU;ArbZeitFaktor;FtText;SAazimuth;SAwindrose;SUazimuth;SUwindrose;SonneHoechstStand;ElevationHS;SchattenlaengeHS
01.01.2021;Freitag;53;1;2459216;1;09:26;16:56;08:42;17:39;07:57;18:25;07:14;19:08;08:12;09:07;09:43;00:00;00:00;16:39;17:15;18:10;18;76;;19:21;11:23;0;Neujahr ;1,299,206;SO;2,298,762;SW;13:11;131,678;4,27
02.01.2021;Samstag;53;2;2459217;1;09:26;16:57;08:42;17:40;07:57;18:26;07:14;19:09;08:11;09:07;09:42;00:00;00:00;16:40;17:16;18:11;19;69;;20:42;11:51;1;;1,297,817;SO;230,031;SW;13:12;132,623;4,24
03.01.2021;Sonntag;53;3;2459218;1;09:25;16:58;08:42;17:41;07:57;18:27;07:14;19:10;08:11;09:07;09:42;00:00;00:00;16:42;17:17;18:12;20;62;;22:04;12:12;1;;1,294,397;SO;230,191;SW;13:12;133,642;4,21
04.01.2021;Montag;1;4;2459219;1;09:25;16:59;08:42;17:42;07:56;18:28;07:13;19:11;08:11;09:06;09:42;00:00;00:00;16:43;17:18;18:13;21;55;;23:26;12:29;1;;1,292,958;SO;230,356;SW;13:13;134,737;4,17
05.01.2021;Dienstag;1;5;2459220;1;09:25;17:01;08:42;17:44;07:56;18:29;07:13;19:12;08:11;09:06;09:41;00:00;00:00;16:44;17:19;18:14;22;48;;00:50;12:45;1;;1,291,495;SO;2,307,274;SW;13:13;135,906;4,14
06.01.2021;Mittwoch;1;6;2459221;1;09:24;17:02;08:41;17:45;07:56;18:30;07:13;19:13;08:11;09:06;09:41;00:00;00:00;16:46;17:21;18:16;23;41;;01:00;12:59;1;Dreikoenigstag ;1,288,004;SO;2,309,032;SW;13:14;13,715;4,1
07.01.2021;Donnerstag;1;7;2459222;1;09:24;17:03;08:41;17:46;07:56;18:31;07:13;19:14;08:10;09:05;09:40;00:00;00:00;16:47;17:22;18:17;24;34;;02:14;13:14;1;;1,286,496;SO;2,310,844;SW;13:14;138,466;4,06
08.01.2021;Freitag;1;8;2459223;1;09:23;17:05;08:41;17:47;07:55;18:33;07:13;19:15;08:10;09:05;09:40;00:00;00:00;16:49;17:23;18:18;25;28;;03:40;13:32;1;;1,282,962;SO;2,314,723;SW;13:15;139,856;4,02
09.01.2021;Samstag;1;9;2459224;1;09:23;17:06;08:40;17:49;07:55;18:34;07:12;19:17;08:10;09:04;09:39;00:00;00:00;16:50;17:25;18:19;26;21;;05:08;13:55;1;;1,281,414;SO;2,316,647;SW;13:15;141,318;3,97
10.01.2021;Sonntag;1;10;2459225;1;09:22;17:08;08:40;17:50;07:55;18:35;07:12;19:18;08:09;09:04;09:38;00:00;00:00;16:52;17:26;18:20;27;14;;06:36;14:26;1;;127,784;SO;232,064;SW;13:15;14,285;3,93
11.01.2021;Montag;2;11;2459226;1;09:21;17:09;08:39;17:51;07:54;18:36;07:11;19:19;08:09;09:03;09:37;00:00;00:00;16:53;17:28;18:22;28;7;;07:58;15:08;1;;1,274,247;SO;2,322,678;SW;13:16;144,454;3,88
12.01.2021;Dienstag;2;12;2459227;1;09:20;17:11;08:38;17:53;07:54;18:38;07:11;19:20;08:08;09:02;09:37;00:00;00:00;16:55;17:29;18:23;29;0;;09:07;16:06;1;;1,270,637;SO;2,326,787;SW;13:16;146,127;3,84
13.01.2021;Mittwoch;2;13;2459228;1;09:20;17:13;08:38;17:54;07:53;18:39;07:10;19:22;08:08;09:02;09:36;00:00;00:00;16:57;17:31;18:25;0;0;Neumond;10:00;17:17;1;;1,269,018;SO;2,330,955;SW;13:17;14,787;3,79
14.01.2021;Donnerstag;2;14;2459229;1;09:19;17:14;08:37;17:56;07:52;18:41;07:10;19:23;08:07;09:01;09:35;00:00;00:00;16:58;17:32;18:26;1;7;;10:38;18:36;1;;1,265,375;SO;2,333,171;SW;13:17;149,681;3,74
15.01.2021;Freitag;2;15;2459230;1;09:18;17:16;08:36;17:57;07:52;18:42;07:09;19:24;08:06;09:00;09:34;00:00;00:00;17:00;17:34;18:27;2;14;;11:04;19:56;1;;1,261,717;SO;2,337,459;SW;13:17;151,558;3,69
16.01.2021;Samstag;2;16;2459231;1;09:17;17:18;08:35;17:59;07:51;18:43;07:09;19:26;08:05;08:59;09:33;13:00;13:41;17:02;17:35;18:29;3;21;;11:24;21:14;1;;1,258,045;SO;2,341,808;SW;13:18;153,504;3,64
17.01.2021;Sonntag;2;17;2459232;1;09:16;17:19;08:35;18:01;07:50;18:45;07:08;19:27;08:05;08:58;09:31;12:47;13:52;17:04;17:37;18:30;4;28;;11:39;22:30;1;;1,254,358;SO;2,344,205;SW;13:18;155,514;3,59
18.01.2021;Montag;3;18;2459233;1;09:15;17:21;08:34;18:02;07:49;18:46;07:07;19:28;08:04;08:57;09:30;12:38;14:01;17:06;17:39;18:32;5;34;;11:53;23:42;1;;1,250,659;SO;2,348,676;SW;13:18;157,589;3,54
19.01.2021;Dienstag;3;19;2459234;1;09:14;17:23;08:33;18:04;07:48;18:48;07:06;19:30;08:03;08:56;09:29;12:31;14:08;17:07;17:40;18:33;6;41;;12:05;00:53;1;;1,246,948;SO;2,353,209;SW;13:19;159,728;3,49
20.01.2021;Mittwoch;3;20;2459235;1;09:12;17:25;08:32;18:05;07:48;18:49;07:06;19:31;08:02;08:55;09:28;12:24;14:15;17:09;17:42;18:35;7;48;;12:17;01:00;1;;1,241,215;SO;2,357,804;SW;13:19;16,193;3,44
21.01.2021;Donnerstag;3;21;2459236;1;09:11;17:27;08:31;18:07;07:47;18:51;07:05;19:33;08:01;08:54;09:26;12:19;14:21;17:11;17:44;18:37;8;55;;12:30;02:03;1;Weltknuddeltag Internationaler Jogginghosentag ;1,237,481;OSO;2,362,461;SW;13:19;164,193;3,39
22.01.2021;Freitag;3;22;2459237;1;09:10;17:28;08:29;18:09;07:46;18:52;07:04;19:34;08:00;08:52;09:25;12:13;14:27;17:13;17:46;18:38;9;62;;12:46;03:13;1;;1,233,736;OSO;2,365,167;WSW;13:20;166,517;3,34
23.01.2021;Samstag;3;23;2459238;1;09:08;17:30;08:28;18:10;07:45;18:54;07:03;19:36;07:59;08:51;09:24;12:08;14:33;17:15;17:48;18:40;10;69;;13:04;04:25;1;;1,227,972;OSO;2,369,948;WSW;13:20;168,902;3,29
24.01.2021;Sonntag;3;24;2459239;1;09:07;17:32;08:27;18:12;07:43;18:56;07:02;19:37;07:58;08:50;09:22;12:03;14:38;17:17;17:49;18:41;11;76;;13:29;05:36;1;;1,224,207;OSO;2,374,792;WSW;13:20;171,344;3,24
25.01.2021;Montag;4;25;2459240;1;09:06;17:34;08:26;18:14;07:42;18:57;07:01;19:39;07:57;08:49;09:21;11:58;14:43;17:19;17:51;18:43;12;83;;14:04;06:46;1;Winterschlussverkauf ;1,220,435;OSO;2,379,697;WSW;13:20;173,845;3,19
26.01.2021;Dienstag;4;26;2459241;1;09:04;17:36;08:24;18:16;07:41;18:59;07:00;19:41;07:55;08:47;09:19;11:54;14:48;17:21;17:53;18:45;13;90;;14:50;07:48;1;;1,214,644;OSO;2,384,665;WSW;13:21;176,402;3,14
27.01.2021;Mittwoch;4;27;2459242;1;09:03;17:38;08:23;18:17;07:40;19:01;06:58;19:42;07:54;08:46;09:18;11:50;14:52;17:23;17:55;18:46;14;100;;15:50;08:41;1;Holocaust-Gedenktag ;1,210,855;OSO;2,389,695;WSW;13:21;179,015;3,1
28.01.2021;Donnerstag;4;28;2459243;1;09:01;17:40;08:22;18:19;07:39;19:02;06:57;19:44;07:53;08:44;09:16;11:45;14:57;17:25;17:57;18:48;15;100;Vollmond;17:03;09:22;1;;1,205,049;OSO;2,394,786;WSW;13:21;181,683;3,05
29.01.2021;Freitag;4;29;2459244;1;09:00;17:42;08:20;18:21;07:37;19:04;06:56;19:45;07:51;08:43;09:14;11:41;15:01;17:27;17:59;18:50;16;90;;18:24;09:53;1;;1,201,247;OSO;2,399,939;WSW;13:21;184,403;3
30.01.2021;Samstag;4;30;2459245;1;08:58;17:44;08:19;18:23;07:36;19:06;06:55;19:47;07:50;08:41;09:13;11:37;15:06;17:29;18:00;18:52;17;83;;19:48;10:17;1;;1,195,427;OSO;2,405,153;WSW;13:21;187,176;2,95
31.01.2021;Sonntag;4;31;2459246;1;08:56;17:46;08:17;18:25;07:35;19:07;06:53;19:49;07:49;08:40;09:11;11:33;15:10;17:31;18:02;18:53;18;76;;21:13;10:36;1;;1,189,602;OSO;2,410,428;WSW;13:21;19;2,9
01.02.2021;Montag;5;32;2459247;1;08:55;17:48;08:16;18:26;07:33;19:09;06:52;19:50;07:47;08:38;09:09;11:29;15:14;17:33;18:04;18:55;19;69;;22:38;10:52;1;;118,68;OSO;241,502;WSW;13:21;191,251;2,88
02.02.2021;Dienstag;5;33;2459248;1;08:53;17:50;08:14;18:28;07:32;19:11;06:51;19:52;07:46;08:36;09:07;11:26;15:18;17:35;18:06;18:57;20;62;;00:02;11:06;1;;1,180,967;OSO;2,420,381;WSW;13:22;194,148;2,84
03.02.2021;Mittwoch;5;34;2459249;1;08:51;17:52;08:13;18:30;07:30;19:12;06:49;19:54;07:44;08:35;09:05;11:22;15:22;17:38;18:08;18:59;21;55;;01:00;11:21;1;;1,175,129;OSO;2,425,801;WSW;13:22;197,092;2,79
04.02.2021;Donnerstag;5;35;2459250;1;08:49;17:54;08:11;18:32;07:29;19:14;06:48;19:55;07:43;08:33;09:04;11:18;15:26;17:40;18:10;19:00;22;48;;01:28;11:38;1;;1,169,287;OSO;2,431,281;WSW;13:22;200,084;2,75
05.02.2021;Freitag;5;36;2459251;1;08:48;17:56;08:09;18:34;07:27;19:16;06:46;19:57;07:41;08:31;09:02;11:14;15:30;17:42;18:12;19:02;23;41;;02:55;11:59;1;;1,165,451;OSO;2,436,818;WSW;13:22;203,122;2,7
06.02.2021;Samstag;5;37;2459252;1;08:46;17:58;08:08;18:36;07:26;19:18;06:45;19:59;07:39;08:29;09:00;11:11;15:34;17:44;18:14;19:04;24;34;;04:21;12:26;1;;1,159,601;OSO;2,442,414;WSW;13:22;206,204;2,66
07.02.2021;Sonntag;5;38;2459253;1;08:44;18:00;08:06;18:38;07:24;19:20;06:43;20:00;07:38;08:28;08:58;11:07;15:37;17:46;18:16;19:06;25;28;;05:43;13:02;1;;1,153,748;OSO;2,448,066;WSW;13:22;209,331;2,61
08.02.2021;Montag;6;39;2459254;1;08:42;18:02;08:04;18:39;07:22;19:21;06:41;20:02;07:36;08:26;08:56;11:04;15:41;17:48;18:18;19:07;26;21;;06:55;13:53;1;;1,147,891;OSO;2,453,774;WSW;13:22;21,25;2,57
09.02.2021;Dienstag;6;40;2459255;1;08:40;18:04;08:02;18:41;07:21;19:23;06:40;20:04;07:34;08:24;08:54;11:00;15:44;17:50;18:20;19:09;27;14;;07:53;14:57;1;;1,142,032;OSO;2,459,537;WSW;13:22;215,711;2,53
10.02.2021;Mittwoch;6;41;2459256;1;08:38;18:06;08:01;18:43;07:19;19:25;06:38;20:06;07:33;08:22;08:52;10:57;15:48;17:52;18:22;19:11;28;7;;08:35;16:13;1;;1,136,171;OSO;2,465,355;WSW;13:22;218,962;2,49
11.02.2021;Donnerstag;6;42;2459257;1;08:36;18:08;07:59;18:45;07:17;19:27;06:36;20:08;07:31;08:20;08:50;10:53;15:51;17:54;18:24;19:13;29;0;;09:05;17:32;1;Weiberfastnacht 42! ;1,130,308;OSO;2,471,226;WSW;13:22;222,253;2,45
12.02.2021;Freitag;6;43;2459258;1;08:34;18:10;07:57;18:47;07:15;19:28;06:34;20:09;07:29;08:18;08:48;10:50;15:55;17:56;18:26;19:15;0;0;Neumond;09:27;18:52;1;;1,124,443;OSO;247,715;WSW;13:22;225,581;2,41
13.02.2021;Samstag;6;44;2459259;1;08:32;18:12;07:55;18:49;07:13;19:30;06:33;20:11;07:27;08:16;08:45;10:46;15:58;17:58;18:28;19:17;1;7;;09:44;20:09;1;;1,118,577;OSO;2,483,126;WSW;13:22;228,947;2,37
14.02.2021;Sonntag;6;45;2459260;1;08:30;18:14;07:53;18:51;07:12;19:32;06:31;20:13;07:25;08:14;08:43;10:43;16:01;18:00;18:30;19:18;2;14;;09:58;21:23;1;Valentinstag ;111,271;OSO;2,489,152;WSW;13:22;232,348;2,33
15.02.2021;Montag;7;46;2459261;1;08:28;18:16;07:51;18:53;07:10;19:34;06:29;20:15;07:23;08:12;08:41;10:40;16:04;18:03;18:31;19:20;3;21;;10:11;22:36;0;Rosenmontag ;1,106,842;OSO;2,495,227;WSW;13:22;235,784;2,29
16.02.2021;Dienstag;7;47;2459262;1;08:26;18:18;07:49;18:55;07:08;19:36;06:27;20:17;07:21;08:10;08:39;10:37;16:08;18:05;18:33;19:22;4;28;;10:23;23:46;1;Karnevalsdienstag ;1,100,974;OSO;2,501,351;WSW;13:22;239,253;2,25
17.02.2021;Mittwoch;7;48;2459263;1;08:24;18:20;07:47;18:56;07:06;19:38;06:25;20:18;07:19;08:08;08:37;10:33;16:11;18:07;18:35;19:24;5;34;;10:35;00:57;1;Aschermittwoch ;1,095,106;OSO;2,507,523;WSW;13:22;242,755;2,22
18.02.2021;Donnerstag;7;49;2459264;1;08:21;18:22;07:45;18:58;07:04;19:39;06:23;20:20;07:17;08:06;08:35;10:30;16:14;18:09;18:37;19:26;6;41;;10:49;01:00;1;;1,087,225;OSO;251,374;WSW;13:22;246,287;2,18
19.02.2021;Freitag;7;50;2459265;1;08:19;18:24;07:43;19:00;07:02;19:41;06:21;20:22;07:15;08:04;08:32;10:27;16:17;18:11;18:39;19:28;7;48;;11:06;02:09;1;;1,081,357;OSO;2,520,003;WSW;13:22;24,985;2,15
20.02.2021;Samstag;7;51;2459266;1;08:17;18:26;07:41;19:02;07:00;19:43;06:19;20:24;07:13;08:02;08:30;10:24;16:20;18:13;18:41;19:29;8;55;;11:28;03:20;1;;1,075,489;OSO;2,526,309;WSW;13:22;253,441;2,11
21.02.2021;Sonntag;7;52;2459267;1;08:15;18:28;07:39;19:04;06:58;19:45;06:17;20:26;07:11;08:00;08:28;10:20;16:23;18:15;18:43;19:31;9;62;;11:58;04:30;1;;1,069,623;OSO;2,532,658;WSW;13:21;25,706;2,08
22.02.2021;Montag;8;53;2459268;1;08:13;18:30;07:37;19:06;06:56;19:47;06:15;20:28;07:09;07:57;08:26;10:17;16:26;18:17;18:45;19:33;10;69;;12:38;05:34;1;;1,063,758;OSO;2,539,048;WSW;13:21;260,706;2,04
23.02.2021;Dienstag;8;54;2459269;1;08:10;18:32;07:34;19:08;06:53;19:49;06:13;20:30;07:07;07:55;08:23;10:14;16:29;18:19;18:47;19:35;11;76;;13:31;06:32;1;;105,588;OSO;2,545,478;WSW;13:21;264,377;2,01
24.02.2021;Mittwoch;8;55;2459270;1;08:08;18:34;07:32;19:10;06:51;19:51;06:10;20:31;07:05;07:53;08:21;10:11;16:31;18:21;18:49;19:37;12;83;;14:39;07:17;1;;1,050,017;OSO;2,551,947;WSW;13:21;268,073;1,98
25.02.2021;Donnerstag;8;56;2459271;1;08:06;18:36;07:30;19:12;06:49;19:52;06:08;20:33;07:03;07:51;08:19;10:08;16:34;18:23;18:51;19:39;13;90;;15:57;07:52;1;;1,044,157;OSO;2,558,453;WSW;13:21;271,791;1,95
26.02.2021;Freitag;8;57;2459272;1;08:03;18:38;07:28;19:13;06:47;19:54;06:06;20:35;07:01;07:48;08:16;10:05;16:37;18:25;18:53;19:41;14;100;;17:22;08:19;1;;1,036,283;OSO;2,564,996;WSW;13:21;275,532;1,92
27.02.2021;Samstag;8;58;2459273;1;08:01;18:40;07:26;19:15;06:45;19:56;06:04;20:37;06:58;07:46;08:14;10:02;16:40;18:27;18:55;19:43;15;100;Vollmond;18:49;08:39;1;;1,030,427;OSO;2,571,573;WSW;13:21;279,293;1,89
28.02.2021;Sonntag;8;59;2459274;1;07:59;18:42;07:23;19:17;06:43;19:58;06:01;20:39;06:56;07:44;08:12;09:59;16:42;18:29;18:57;19:44;16;90;;20:16;08:56;1;;1,024,572;OSO;2,578,183;WSW;13:20;283,074;1,86
01.03.2021;Montag;9;60;2459275;1;07:57;18:44;07:21;19:19;06:40;20:00;05:59;20:41;06:54;07:42;08:09;09:55;16:45;18:31;18:59;19:46;18;76;;21:44;09:12;1;;1,014,311;OSO;259,129;W;13:20;296,209;1,76
02.03.2021;Dienstag;9;61;2459276;1;07:54;18:46;07:19;19:21;06:38;20:02;05:57;20:43;06:52;07:39;08:07;09:52;16:48;18:33;19:01;19:48;19;69;;23:12;09:27;1;;1,006,452;O;2,598,031;W;13:19;300,065;1,73
03.03.2021;Mittwoch;9;62;2459277;1;07:52;18:48;07:16;19:23;06:36;20:04;05:54;20:45;06:49;07:37;08:05;09:49;16:50;18:35;19:02;19:50;20;62;;00:41;09:43;1;;1,000,616;O;2,604,797;W;13:19;303,935;1,7
04.03.2021;Donnerstag;9;63;2459278;1;07:49;18:49;07:14;19:25;06:33;20:06;05:52;20:47;06:47;07:35;08:02;09:46;16:53;18:37;19:04;19:52;21;55;;01:00;10:03;1;;992,763;O;2,609,565;W;13:19;307,819;1,68
05.03.2021;Freitag;9;64;2459279;1;07:47;18:51;07:12;19:27;06:31;20:08;05:50;20:49;06:45;07:32;08:00;09:43;16:55;18:39;19:06;19:54;22;48;;02:10;10:28;1;;986,934;O;2,616,378;W;13:19;311,713;1,65
06.03.2021;Samstag;9;65;2459280;1;07:45;18:53;07:09;19:29;06:29;20:09;05:47;20:51;06:42;07:30;07:57;09:41;16:58;18:41;19:08;19:56;23;41;;03:34;11:01;1;;981,109;O;2,623,213;W;13:18;315,617;1,63
07.03.2021;Sonntag;9;66;2459281;1;07:42;18:55;07:07;19:30;06:26;20:11;05:45;20:53;06:40;07:28;07:55;09:38;17:00;18:43;19:10;19:58;24;34;;04:50;11:46;1;;973,268;O;2,630,067;W;13:18;319,533;1,6
08.03.2021;Montag;10;67;2459282;1;07:40;18:57;07:05;19:32;06:24;20:13;05:42;20:55;06:38;07:25;07:53;09:35;17:03;18:45;19:12;20:00;25;28;;05:50;12:46;1;Weltfrauentag ;96,745;O;2,636,939;W;13:18;323,456;1,58
09.03.2021;Dienstag;10;68;2459283;1;07:38;18:59;07:02;19:34;06:21;20:15;05:40;20:57;06:35;07:23;07:50;09:32;17:05;18:47;19:14;20:02;26;21;;06:36;13:57;1;;961,637;O;2,643,828;W;13:18;327,387;1,56
10.03.2021;Mittwoch;10;69;2459284;1;07:35;19:01;07:00;19:36;06:19;20:17;05:37;20:59;06:33;07:20;07:48;09:29;17:08;18:48;19:16;20:03;27;14;;07:09;15:15;1;;953,809;O;2,650,732;W;13:17;331,323;1,53
11.03.2021;Donnerstag;10;70;2459285;1;07:33;19:03;06:58;19:38;06:17;20:19;05:34;21:01;06:30;07:18;07:45;09:26;17:10;18:50;19:18;20:05;28;7;;07:32;16:34;1;;948,005;O;265,765;W;13:17;335,267;1,51
12.03.2021;Freitag;10;71;2459286;1;07:30;19:05;06:55;19:40;06:14;20:21;05:32;21:03;06:28;07:16;07:43;09:23;17:12;18:52;19:20;20:07;29;0;;07:50;17:51;1;;940,185;O;266,458;W;13:17;339,214;1,49
13.03.2021;Samstag;10;72;2459287;1;07:28;19:07;06:53;19:42;06:12;20:23;05:29;21:06;06:25;07:13;07:40;09:20;17:15;18:54;19:21;20:09;0;0;Neumond;08:05;19:06;1;;93,439;O;267,152;W;13:17;343,164;1,47
14.03.2021;Sonntag;10;73;2459288;1;07:25;19:09;06:50;19:44;06:09;20:25;05:26;21:08;06:23;07:11;07:38;09:17;17:17;18:56;19:23;20:11;1;7;;08:17;20:19;1;;926,581;O;267,847;W;13:16;347,116;1,44
15.03.2021;Montag;11;74;2459289;1;07:23;19:11;06:48;19:46;06:07;20:27;05:24;21:10;06:20;07:08;07:35;09:15;17:19;18:58;19:25;20:13;2;14;;08:29;21:31;1;;920,796;O;2,685,427;W;13:16;351,071;1,42
16.03.2021;Dienstag;11;75;2459290;1;07:20;19:12;06:45;19:48;06:04;20:29;05:21;21:12;06:18;07:06;07:33;09:12;17:21;19:00;19:27;20:15;3;21;;08:41;22:43;1;;912,996;O;2,690,368;W;13:16;355,025;1,4
17.03.2021;Mittwoch;11;76;2459291;1;07:18;19:14;06:43;19:49;06:01;20:31;05:18;21:14;06:15;07:03;07:30;09:09;17:23;19:02;19:29;20:17;4;28;;08:54;23:54;1;;907,221;O;2,697,336;W;13:15;358,977;1,38
18.03.2021;Donnerstag;11;77;2459292;1;07:16;19:16;06:40;19:51;05:59;20:33;05:16;21:16;06:13;07:01;07:28;09:06;17:26;19:04;19:31;20:19;5;34;;09:09;01:00;1;;901,452;O;2,704,308;W;13:15;36,293;1,36
19.03.2021;Freitag;11;78;2459293;1;07:13;19:18;06:38;19:53;05:56;20:35;05:13;21:19;06:10;06:58;07:26;09:03;17:28;19:06;19:33;20:21;6;41;;09:29;01:05;1;;893,669;O;271,128;W;13:15;366,879;1,34
20.03.2021;Samstag;11;79;2459294;1;07:11;19:20;06:35;19:55;05:54;20:37;05:10;21:21;06:08;06:56;07:23;09:01;17:30;19:07;19:35;20:23;7;48;;09:54;02:16;1;Fruehlingsanfang ;88,791;O;2,718,254;W;13:15;370,823;1,32
21.03.2021;Sonntag;11;80;2459295;1;07:08;19:22;06:33;19:57;05:51;20:39;05:07;21:23;06:05;06:53;07:21;08:58;17:32;19:09;19:37;20:25;8;55;;10:29;03:22;1;Welttag gegen Rassismus ;880,138;O;2,725,225;W;13:14;374,764;1,3
22.03.2021;Montag;12;81;2459296;1;07:06;19:24;06:30;19:59;05:48;20:41;05:04;21:25;06:03;06:51;07:18;08:55;17:34;19:11;19:38;20:27;9;62;;11:16;04:23;1;;874,391;O;2,732,194;W;13:14;378,698;1,29
23.03.2021;Dienstag;12;82;2459297;1;07:03;19:26;06:28;20:01;05:46;20:43;05:01;21:28;06:00;06:48;07:16;08:53;17:36;19:13;19:40;20:29;10;69;;12:17;05:12;1;;866,631;O;2,739,159;W;13:14;382,626;1,27
24.03.2021;Mittwoch;12;83;2459298;1;07:01;19:27;06:25;20:03;05:43;20:45;04:58;21:30;05:57;06:46;07:13;08:50;17:38;19:15;19:42;20:31;11;76;;13:29;05:50;1;;860,896;O;2,744,095;W;13:13;386,546;1,25
25.03.2021;Donnerstag;12;84;2459299;1;06:58;19:29;06:23;20:05;05:41;20:47;04:55;21:32;05:55;06:44;07:11;08:47;17:40;19:17;19:44;20:33;12;83;;14:50;06:20;1;;853,148;O;2,751,047;W;13:13;390,457;1,23
26.03.2021;Freitag;12;85;2459300;1;06:56;19:31;06:20;20:07;05:38;20:49;04:53;21:35;05:52;06:41;07:08;08:45;17:42;19:19;19:46;20:35;13;90;;16:16;06:42;1;;847,425;O;275,799;W;13:13;394,359;1,22
27.03.2021;Samstag;12;86;2459301;1;06:53;19:33;06:18;20:09;05:35;20:51;04:50;21:37;05:50;06:39;07:06;08:42;17:44;19:20;19:48;20:37;14;100;;17:44;07:00;1;;839,689;O;2,764,923;W;13:12;398,249;1,2
28.03.2021;Sonntag;12;87;2459302;2;07:51;20:35;07:15;21:10;06:32;21:53;05:47;22:39;06:47;07:36;08:03;09:40;18:46;20:22;20:50;21:39;15;100;Vollmond;20:13;08:16;1;Beginn MESZ Palmsonntag ;833,979;O;2,771,845;W;14:12;402,129;1,18
29.03.2021;Montag;13;88;2459303;2;07:48;20:37;07:13;21:12;06:30;21:56;05:43;22:42;06:44;07:34;08:01;09:37;18:48;20:24;20:52;21:41;16;90;;21:44;08:31;1;;826,257;O;2,778,754;W;14:12;405,995;1,17
30.03.2021;Dienstag;13;89;2459304;2;07:46;20:39;07:10;21:14;06:27;21:58;05:40;22:44;06:42;07:31;07:58;09:34;18:50;20:26;20:53;21:43;17;83;;23:16;08:47;1;;82,056;O;2,785,648;W;14:12;409,848;1,15
31.03.2021;Mittwoch;13;90;2459305;2;07:44;20:40;07:08;21:16;06:24;22:00;05:37;22:47;06:39;07:29;07:56;09:32;18:52;20:28;20:55;21:45;18;76;;00:49;09:05;1;World Backup Day ;814,869;O;2,790,504;W;14:11;413,686;1,14
01.04.2021;Donnerstag;13;91;2459306;2;07:41;20:42;07:05;21:18;06:22;22:02;05:34;22:49;06:36;07:26;07:54;09:29;18:54;20:30;20:57;21:47;19;69;;02:00;09:28;1;Gruendonnerstag ;808,092;O;2,795,784;W;14:11;415,361;1,13
02.04.2021;Freitag;13;92;2459307;2;07:39;20:44;07:03;21:20;06:19;22:04;05:31;22:52;06:34;07:24;07:51;09:27;18:56;20:32;20:59;21:49;20;62;;02:19;09:58;0;Karfreitag ;802,411;O;2,802,638;W;14:11;419,177;1,11
03.04.2021;Samstag;13;93;2459308;2;07:36;20:46;07:00;21:22;06:16;22:06;05:28;22:55;06:31;07:21;07:49;09:24;18:58;20:33;21:01;21:51;21;55;;03:42;10:40;1;;794,719;O;2,809,472;W;14:11;422,975;1,1
04.04.2021;Sonntag;13;94;2459309;2;07:34;20:48;06:57;21:24;06:13;22:08;05:25;22:57;06:28;07:19;07:46;09:22;19:00;20:35;21:03;21:53;22;48;;04:49;11:37;0;Ostersonntag ;789,053;O;2,816,287;WNW;14:10;426,756;1,08
05.04.2021;Montag;14;95;2459310;2;07:31;20:50;06:55;21:26;06:10;22:11;05:21;23:00;06:26;07:16;07:44;09:19;19:01;20:37;21:05;21:55;23;41;;05:39;12:46;0;Ostermontag ;781,374;ONO;282,308;WNW;14:10;430,519;1,07
06.04.2021;Dienstag;14;96;2459311;2;07:29;20:52;06:52;21:28;06:08;22:13;05:18;23:03;06:23;07:14;07:42;09:17;19:03;20:39;21:07;21:58;24;34;;06:14;14:03;1;;775,723;ONO;282,985;WNW;14:10;434,261;1,06
07.04.2021;Mittwoch;14;97;2459312;2;07:26;20:53;06:50;21:30;06:05;22:15;05:15;23:05;06:20;07:11;07:39;09:15;19:05;20:41;21:09;22:00;25;28;;06:40;15:21;1;Weltgesundheitstag WHO ;768,058;ONO;2,834,572;WNW;14:09;437,982;1,04
08.04.2021;Donnerstag;14;98;2459313;2;07:24;20:55;06:47;21:32;06:02;22:17;05:12;23:08;06:18;07:09;07:37;09:12;19:07;20:43;21:11;22:02;26;21;;06:58;16:38;1;;762,422;ONO;2,841,292;WNW;14:09;441,682;1,03
09.04.2021;Freitag;14;99;2459314;2;07:22;20:57;06:45;21:34;05:59;22:20;05:08;23:11;06:15;07:06;07:34;09:10;19:09;20:44;21:12;22:04;27;14;;07:13;17:54;1;;756,792;ONO;2,847,985;WNW;14:09;44,536;1,02
10.04.2021;Samstag;14;100;2459315;2;07:19;20:59;06:42;21:36;05:56;22:22;05:05;23:14;06:12;07:04;07:32;09:08;19:11;20:46;21:14;22:06;28;7;;07:26;19:07;1;;749,151;ONO;2,854,651;WNW;14:09;449,013;1
11.04.2021;Sonntag;14;101;2459316;2;07:17;21:01;06:40;21:38;05:54;22:24;05:01;23:17;06:09;07:01;07:30;09:05;19:12;20:48;21:16;22:08;29;0;;07:37;20:18;1;Weisser Sonntag ;743,537;ONO;2,861,287;WNW;14:08;452,642;0,99
12.04.2021;Montag;15;102;2459317;2;07:14;21:03;06:37;21:40;05:51;22:27;04:58;23:20;06:07;06:59;07:27;09:03;19:14;20:50;21:18;22:11;0;0;Neumond;07:49;21:30;1;;735,911;ONO;2,867,893;WNW;14:08;456,246;0,98
13.04.2021;Dienstag;15;103;2459318;2;07:12;21:05;06:35;21:42;05:48;22:29;04:54;23:23;06:04;06:57;07:25;09:01;19:16;20:52;21:20;22:13;1;7;;08:01;22:41;1;;730,313;ONO;2,874,467;WNW;14:08;459,824;0,97
14.04.2021;Mittwoch;15;104;2459319;2;07:10;21:06;06:32;21:44;05:45;22:31;04:51;23:26;06:01;06:54;07:23;08:59;19:17;20:53;21:22;22:15;2;14;;08:15;23:53;1;;724,724;ONO;2,878,986;WNW;14:08;463,373;0,95
15.04.2021;Donnerstag;15;105;2459320;2;07:07;21:08;06:30;21:46;05:42;22:34;04:47;23:29;05:59;06:52;07:20;08:56;19:19;20:55;21:24;22:17;3;21;;08:32;01:05;1;;717,122;ONO;2,885,493;WNW;14:07;466,895;0,94
16.04.2021;Freitag;15;106;2459321;2;07:05;21:10;06:27;21:48;05:39;22:36;04:44;23:32;05:56;06:49;07:18;08:54;19:21;20:57;21:26;22:19;4;28;;08:55;02:00;1;;711,548;ONO;2,891,966;WNW;14:07;470,388;0,93
17.04.2021;Samstag;15;107;2459322;2;07:03;21:12;06:25;21:50;05:36;22:38;04:40;23:35;05:53;06:47;07:16;08:52;19:23;20:59;21:28;22:22;5;34;;09:26;02:13;1;;705,983;ONO;2,898,404;WNW;14:07;473,851;0,92
18.04.2021;Sonntag;15;108;2459323;2;07:00;21:14;06:22;21:52;05:34;22:41;04:36;23:39;05:50;06:45;07:13;08:50;19:24;21:01;21:30;22:24;6;41;;10:07;03:16;1;;698,406;ONO;2,904,804;WNW;14:07;477,282;0,91
19.04.2021;Montag;16;109;2459324;2;06:58;21:16;06:20;21:54;05:31;22:43;04:33;23:42;05:48;06:42;07:11;08:48;19:26;21:02;21:32;22:26;7;48;;11:01;04:08;1;;692,859;ONO;2,911,166;WNW;14:07;480,681;0,9
20.04.2021;Dienstag;16;110;2459325;2;06:56;21:18;06:17;21:56;05:28;22:46;04:29;23:45;05:45;06:40;07:09;08:46;19:28;21:04;21:33;22:29;8;55;;12:08;04:50;1;;68,732;ONO;291,749;WNW;14:06;484,048;0,89
21.04.2021;Mittwoch;16;111;2459326;2;06:53;21:19;06:15;21:58;05:25;22:48;04:25;23:49;05:42;06:37;07:07;08:44;19:29;21:06;21:35;22:31;9;62;;13:24;05:22;1;;679,768;ONO;292,175;WNW;14:06;487,381;0,88
22.04.2021;Donnerstag;16;112;2459327;2;06:51;21:21;06:12;22:00;05:22;22:51;04:21;23:52;05:39;06:35;07:05;08:41;19:31;21:08;21:37;22:33;10;69;;14:46;05:46;1;Girls Day ;674,247;ONO;2,927,992;WNW;14:06;49,068;0,87
23.04.2021;Freitag;16;113;2459328;2;06:49;21:23;06:10;22:03;05:19;22:53;04:17;23:56;05:37;06:33;07:02;08:39;19:32;21:10;21:39;22:36;11;76;;16:11;06:04;1;;668,735;ONO;2,934,193;WNW;14:06;493,942;0,86
24.04.2021;Samstag;16;114;2459329;2;06:47;21:25;06:07;22:05;05:16;22:56;04:13;00:00;05:34;06:31;07:00;08:37;19:34;21:11;21:41;22:38;12;83;;17:39;06:20;1;;663,233;ONO;2,940,352;WNW;14:06;497,168;0,85
25.04.2021;Sonntag;16;115;2459330;2;06:45;21:27;06:05;22:07;05:13;22:58;04:09;00:04;05:31;06:28;06:58;08:36;19:36;21:13;21:43;22:40;13;90;;19:08;06:35;1;;657,739;ONO;2,946,467;WNW;14:05;500,356;0,84
26.04.2021;Montag;17;116;2459331;2;06:42;21:29;06:02;22:09;05:10;23:01;04:05;00:07;05:29;06:26;06:56;08:34;19:37;21:15;21:45;22:43;14;100;;20:40;06:50;1;;650,234;ONO;2,952,539;WNW;14:05;503,507;0,83
27.04.2021;Dienstag;17;117;2459332;2;06:40;21:30;06:00;22:11;05:07;23:04;04:00;00:12;05:26;06:24;06:54;08:32;19:39;21:17;21:47;22:45;15;100;Vollmond;22:15;07:07;1;;644,759;ONO;2,956,542;WNW;14:05;506,618;0,82
28.04.2021;Mittwoch;17;118;2459333;2;06:38;21:32;05:58;22:13;05:05;23:06;03:56;00:16;05:23;06:21;06:52;08:30;19:40;21:19;21:49;22:47;16;90;;23:50;07:27;1;;639,295;ONO;2,962,522;WNW;14:05;509,689;0,81
29.04.2021;Donnerstag;17;119;2459334;2;06:36;21:34;05:55;22:15;05:02;23:09;03:51;00:20;05:21;06:19;06:50;08:28;19:42;21:20;21:51;22:50;17;83;;01:20;07:54;1;;633,841;ONO;2,968,457;WNW;14:05;51,272;0,8
30.04.2021;Freitag;17;120;2459335;2;06:34;21:36;05:53;22:17;04:59;23:12;03:47;00:24;05:18;06:17;06:48;08:26;19:43;21:22;21:53;22:52;18;76;;02:00;08:32;1;Walpurgisnacht ;628,396;ONO;2,974,345;WNW;14:05;515,708;0,79
01.05.2021;Samstag;17;121;2459336;2;06:32;21:38;05:50;22:19;04:56;23:14;03:42;00:29;05:15;06:15;06:46;08:24;19:45;21:24;21:55;22:55;20;62;;02:38;09:24;0;Maifeiertag Weltfischbroetchentag Rhein in Flammen ;622,357;ONO;2,980,955;WNW;14:05;519,928;0,78
02.05.2021;Sonntag;17;122;2459337;2;06:30;21:40;05:48;22:21;04:53;23:17;03:37;00:34;05:12;06:13;06:44;08:23;19:46;21:26;21:57;22:57;21;55;;03:37;10:31;1;;616,938;ONO;2,986,726;WNW;14:05;52,281;0,77
03.05.2021;Montag;18;123;2459338;2;06:28;21:41;05:46;22:23;04:50;23:20;03:32;00:39;05:10;06:11;06:42;08:21;19:48;21:27;21:59;23:00;22;48;;04:18;11:49;1;;61,153;ONO;2,990,425;WNW;14:04;525,647;0,77
04.05.2021;Dienstag;18;124;2459339;2;06:26;21:43;05:44;22:25;04:47;23:22;03:26;00:44;05:07;06:08;06:40;08:19;19:49;21:29;22:00;23:02;23;41;;04:47;13:08;1;;606,133;ONO;2,996,098;WNW;14:04;52,844;0,76
05.05.2021;Mittwoch;18;125;2459340;2;06:24;21:45;05:41;22:28;04:44;23:25;03:21;00:50;05:05;06:06;06:38;08:18;19:51;21:31;22:02;23:04;24;34;;05:07;14:27;1;Europatag ;600,747;ONO;3,001,721;WNW;14:04;531,185;0,75
06.05.2021;Donnerstag;18;126;2459341;2;06:22;21:47;05:39;22:30;04:41;23:28;03:15;00:56;05:02;06:04;06:36;08:16;19:52;21:33;22:04;23:07;25;28;;05:23;15:43;1;;595,372;ONO;3,007,295;WNW;14:04;533,883;0,74
07.05.2021;Freitag;18;127;2459342;2;06:20;21:49;05:37;22:32;04:38;23:31;03:08;01:03;04:59;06:02;06:34;08:14;19:54;21:34;22:06;23:09;26;21;;05:35;16:56;1;;590,008;ONO;3,012,818;WNW;14:04;536,533;0,74
08.05.2021;Samstag;18;128;2459343;2;06:18;21:50;05:35;22:34;04:35;23:33;03:01;01:10;04:57;06:00;06:32;08:13;19:55;21:36;22:08;23:12;27;14;;05:47;18:08;1;Gratis Comic Tag ;584,657;ONO;3,016,267;WNW;14:04;539,134;0,73
09.05.2021;Sonntag;18;129;2459344;2;06:16;21:52;05:32;22:36;04:32;23:36;02:53;01:18;04:54;05:58;06:30;08:11;19:57;21:38;22:10;23:14;28;7;;05:58;19:19;1;Muttertag ;579,317;ONO;3,021,689;WNW;14:04;541,685;0,72
10.05.2021;Montag;19;130;2459345;2;06:14;21:54;05:30;22:38;04:29;23:39;02:44;01:28;04:52;05:56;06:29;08:10;19:58;21:39;22:12;23:17;29;0;;06:09;20:30;1;;573,989;ONO;3,027,059;WNW;14:04;544,185;0,72
11.05.2021;Dienstag;19;131;2459346;2;06:12;21:56;05:28;22:40;04:26;23:42;02:33;01:42;04:49;05:54;06:27;08:08;19:59;21:41;22:14;23:19;0;0;Neumond;06:22;21:42;1;;568,673;ONO;3,032,379;WNW;14:04;546,634;0,71
12.05.2021;Mittwoch;19;132;2459347;2;06:10;21:57;05:26;22:42;04:24;23:45;02:10;00:00;04:46;05:52;06:25;08:07;20:01;21:43;22:15;23:22;1;7;;06:38;22:54;1;;56,337;ONO;3,035,623;WNW;14:04;549,031;0,7
13.05.2021;Donnerstag;19;133;2459348;2;06:09;21:59;05:24;22:44;04:21;23:48;00:00;00:00;04:44;05:51;06:23;08:05;20:02;21:44;22:17;23:24;2;14;;06:59;00:04;0;Himmelfahrt ;560,104;NO;304,084;NW;14:04;551,374;0,7
14.05.2021;Freitag;19;134;2459349;2;06:07;22:01;05:22;22:46;04:18;23:51;00:00;00:00;04:41;05:49;06:22;08:04;20:03;21:46;22:19;23:27;3;21;;07:27;01:09;1;;554,827;NO;3,046,005;NW;14:04;553,664;0,69
15.05.2021;Samstag;19;135;2459350;2;06:05;22:03;05:20;22:48;04:15;23:54;00:00;00:00;04:39;05:47;06:20;08:03;20:05;21:48;22:21;23:29;4;28;;08:04;02:00;1;Internationaler Tag der Familie UNO Eisheilige Kalte Sophie ;549,563;NO;3,051,118;NW;14:04;555,899;0,68
16.05.2021;Sonntag;19;136;2459351;2;06:04;22:04;05:18;22:50;04:12;23:56;00:00;00:00;04:36;05:45;06:19;08:02;20:06;21:49;22:23;23:32;5;34;;08:53;02:05;1;;546,338;NO;3,054,156;NW;14:04;558,079;0,68
17.05.2021;Montag;20;137;2459352;2;06:02;22:06;05:16;22:52;04:09;23:59;00:00;00:00;04:34;05:43;06:17;08:00;20:07;21:51;22:24;23:34;6;41;;09:55;02:50;1;;541,102;NO;3,059,167;NW;14:04;560,202;0,67
18.05.2021;Dienstag;20;138;2459353;2;06:00;22:07;05:14;22:54;04:06;00:02;00:00;00:00;04:32;05:42;06:15;07:59;20:09;21:52;22:26;23:37;7;48;;11:07;03:25;1;;53,588;NO;3,062,103;NW;14:04;562,269;0,67
19.05.2021;Mittwoch;20;139;2459354;2;05:59;22:09;05:12;22:56;04:03;00:05;00:00;00:00;04:29;05:40;06:14;07:58;20:10;21:54;22:28;23:39;8;55;;12:25;03:50;1;;532,699;NO;3,067,011;NW;14:04;564,279;0,66
20.05.2021;Donnerstag;20;140;2459355;2;05:57;22:11;05:10;22:58;04:00;00:08;00:00;00:00;04:27;05:38;06:13;07:57;20:11;21:55;22:30;23:42;9;62;;13:47;04:10;1;;527,506;NO;3,071,869;NW;14:04;56,623;0,66
21.05.2021;Freitag;20;141;2459356;2;05:56;22:12;05:08;23:00;03:58;00:11;00:00;00:00;04:25;05:37;06:11;07:56;20:12;21:57;22:31;23:44;10;69;;15:10;04:26;1;;524,355;NO;3,074,652;NW;14:04;568,123;0,65
22.05.2021;Samstag;20;142;2459357;2;05:54;22:14;05:07;23:02;03:55;00:14;00:00;00:00;04:22;05:35;06:10;07:55;20:13;21:58;22:33;23:46;11;76;;16:35;04:41;1;;519,193;NO;3,079,409;NW;14:05;569,957;0,65
23.05.2021;Sonntag;20;143;2459358;2;05:53;22:15;05:05;23:04;03:52;00:17;00:00;00:00;04:20;05:34;06:08;07:54;20:15;22:00;22:35;23:49;12;83;;18:04;04:55;0;Pfingsten ;516,075;NO;3,082,091;NW;14:05;57,173;0,65
24.05.2021;Montag;21;144;2459359;2;05:52;22:17;05:03;23:05;03:49;00:20;00:00;00:00;04:18;05:32;06:07;07:53;20:16;22:01;22:36;23:51;13;90;;19:37;05:10;0;Pfingstmontag ;512,973;NO;3,086,749;NW;14:05;573,443;0,64
25.05.2021;Dienstag;21;145;2459360;2;05:50;22:18;05:02;23:07;03:46;00:23;00:00;00:00;04:16;05:31;06:06;07:52;20:17;22:03;22:38;23:54;14;100;;21:12;05:28;1;Towel Day ;50,786;NO;3,089,333;NW;14:05;575,095;0,64
26.05.2021;Mittwoch;21;146;2459361;2;05:49;22:20;05:00;23:09;03:44;00:26;00:00;00:00;04:13;05:30;06:05;07:51;20:18;22:04;22:39;23:56;15;100;Vollmond;22:46;05:50;1;;504,792;NO;3,093,893;NW;14:05;576,684;0,63
27.05.2021;Donnerstag;21;147;2459362;2;05:48;22:21;04:59;23:11;03:41;00:29;00:00;00:00;04:11;05:28;06:04;07:50;20:19;22:05;22:41;23:58;16;90;;00:13;06:22;1;;501,742;NO;309,638;NW;14:05;578,211;0,63
28.05.2021;Freitag;21;148;2459363;2;05:47;22:23;04:57;23:12;03:38;00:32;00:00;00:00;04:09;05:27;06:03;07:49;20:20;22:07;22:42;00:00;17;83;;01:24;07:08;1;;498,711;NO;3,100,845;NW;14:05;579,675;0,63
29.05.2021;Samstag;21;149;2459364;2;05:46;22:24;04:56;23:14;03:35;00:35;00:00;00:00;04:07;05:26;06:02;07:48;20:21;22:08;22:44;00:03;18;76;;02:00;08:10;1;;495,698;NO;3,103,236;NW;14:05;581,075;0,62
30.05.2021;Sonntag;21;150;2459365;2;05:45;22:25;04:54;23:16;03:33;00:38;00:00;00:00;04:05;05:25;06:01;07:48;20:22;22:09;22:45;00:05;19;69;;02:14;09:27;1;;492,704;NO;3,105,582;NW;14:06;582,412;0,62
31.05.2021;Montag;22;151;2459366;2;05:44;22:26;04:53;23:17;03:30;00:41;00:00;00:00;04:03;05:23;06:00;07:47;20:23;22:10;22:47;00:07;20;62;;02:49;10:49;1;;48,973;NO;3,107,881;NW;14:06;583,685;0,62
01.06.2021;Dienstag;22;152;2459367;2;05:43;22:28;04:52;23:19;03:27;00:44;00:00;00:00;04:02;05:22;05:59;07:46;20:24;22:12;22:48;00:09;21;55;;03:13;12:10;1;Internationaler Kindertag ;487,294;NO;3,112,041;NW;14:06;584,221;0,61
02.06.2021;Mittwoch;22;153;2459368;2;05:42;22:29;04:51;23:20;03:25;00:47;00:00;00:00;04:00;05:21;05:58;07:46;20:25;22:13;22:49;00:11;22;48;;03:31;13:29;1;;484,349;NO;3,114,275;NW;14:06;58,54;0,61
03.06.2021;Donnerstag;22;154;2459369;2;05:41;22:30;04:49;23:22;03:22;00:49;00:00;00:00;03:58;05:20;05:57;07:45;20:26;22:14;22:50;00:13;23;41;;03:44;14:44;0;Fronleichnam ;481,425;NO;3,116,465;NW;14:06;586,513;0,61
04.06.2021;Freitag;22;155;2459370;2;05:40;22:31;04:48;23:23;03:20;00:52;00:00;00:00;03:56;05:20;05:56;07:45;20:26;22:15;22:52;00:15;24;34;;03:56;15:57;1;;478,523;NO;3,118,611;NW;14:06;58,756;0,61
05.06.2021;Samstag;22;156;2459371;2;05:39;22:32;04:47;23:24;03:17;00:55;00:00;00:00;03:55;05:19;05:56;07:44;20:27;22:16;22:53;00:17;25;28;;04:07;17:08;1;;475,642;NO;3,120,715;NW;14:06;58,854;0,6
06.06.2021;Sonntag;22;157;2459372;2;05:39;22:33;04:46;23:26;03:15;00:58;00:00;00:00;03:53;05:18;05:55;07:44;20:28;22:17;22:54;00:19;26;21;;04:18;18:19;1;;474,817;NO;3,122,776;NW;14:07;589,455;0,6
07.06.2021;Montag;23;158;2459373;2;05:38;22:34;04:45;23:27;03:13;01:00;00:00;00:00;03:52;05:17;05:54;07:43;20:29;22:18;22:55;00:20;27;14;;04:30;19:31;1;;471,982;NO;3,124,797;NW;14:07;590,303;0,6
08.06.2021;Dienstag;23;159;2459374;2;05:37;22:35;04:45;23:28;03:11;01:03;00:00;00:00;03:51;05:17;05:54;07:43;20:29;22:19;22:56;00:22;28;7;;04:45;20:43;1;Tag des Meeres ;469,171;NO;3,126,777;NW;14:07;591,082;0,6
09.06.2021;Mittwoch;23;160;2459375;2;05:37;22:36;04:44;23:29;03:09;01:05;00:00;00:00;03:50;05:16;05:53;07:43;20:30;22:20;22:57;00:24;29;0;;05:04;21:54;1;;468,418;NO;3,128,717;NW;14:07;591,794;0,6
10.06.2021;Donnerstag;23;161;2459376;2;05:36;22:37;04:43;23:30;03:06;01:07;00:00;00:00;03:48;05:15;05:53;07:42;20:31;22:20;22:58;00:25;0;0;Neumond;05:29;23:02;1;;465,657;NO;3,130,619;NW;14:07;592,438;0,6
11.06.2021;Freitag;23;162;2459377;2;05:36;22:38;04:43;23:31;03:05;01:10;00:00;00:00;03:47;05:15;05:53;07:42;20:31;22:21;22:59;00:27;1;7;;06:03;00:01;1;;464,955;NO;3,132,483;NW;14:08;593,015;0,59
12.06.2021;Samstag;23;163;2459378;2;05:36;22:38;04:42;23:32;03:03;01:12;00:00;00:00;03:46;05:14;05:52;07:42;20:32;22:22;23:00;00:28;2;14;;06:49;00:50;1;;464,281;NO;3,132,278;NW;14:08;593,523;0,59
13.06.2021;Sonntag;23;164;2459379;2;05:35;22:39;04:42;23:33;03:01;01:14;00:00;00:00;03:46;05:14;05:52;07:42;20:33;22:22;23:00;00:29;3;21;;07:47;01:28;1;;461,599;NO;3,134,069;NW;14:08;593,963;0,59
14.06.2021;Montag;24;165;2459380;2;05:35;22:40;04:41;23:34;03:00;01:16;00:00;00:00;03:45;05:14;05:52;07:42;20:33;22:23;23:01;00:30;4;28;;08:56;01:56;1;;46,098;NO;3,135,824;NW;14:08;594,333;0,59
15.06.2021;Dienstag;24;166;2459381;2;05:35;22:40;04:41;23:34;02:58;01:17;00:00;00:00;03:44;05:14;05:52;07:42;20:33;22:24;23:02;00:31;5;34;;10:12;02:00;1;;460,389;NO;3,135,512;NW;14:09;594,635;0,59
16.06.2021;Mittwoch;24;167;2459382;2;05:35;22:41;04:41;23:35;02:57;01:19;00:00;00:00;03:44;05:13;05:51;07:42;20:34;22:24;23:02;00:32;6;41;;11:32;02:16;1;;459,828;NO;3,137,199;NW;14:09;594,869;0,59
17.06.2021;Donnerstag;24;168;2459383;2;05:35;22:41;04:40;23:36;02:56;01:20;00:00;00:00;03:43;05:13;05:51;07:42;20:34;22:25;23:03;00:33;7;48;;12:53;02:33;1;;459,298;NO;3,136,821;NW;14:09;595,034;0,59
18.06.2021;Freitag;24;169;2459384;2;05:35;22:42;04:40;23:36;02:56;01:21;00:00;00:00;03:43;05:13;05:51;07:42;20:35;22:25;23:03;00:33;8;55;;14:15;02:48;1;;458,798;NO;3,138,443;NW;14:09;595,129;0,59
19.06.2021;Samstag;24;170;2459385;2;05:35;22:42;04:40;23:36;02:55;01:22;00:00;00:00;03:43;05:13;05:51;07:42;20:35;22:25;23:03;00:34;9;62;;15:39;03:01;1;;458,331;NO;3,138,001;NW;14:09;595,155;0,59
20.06.2021;Sonntag;24;171;2459386;2;05:35;22:42;04:40;23:37;02:55;01:22;00:00;00:00;03:43;05:13;05:52;07:42;20:35;22:26;23:04;00:34;10;69;;17:06;03:15;1;;457,896;NO;3,137,529;NW;14:10;595,113;0,59
21.06.2021;Montag;25;172;2459387;2;05:35;22:43;04:41;23:37;02:55;01:23;00:00;00:00;03:43;05:14;05:52;07:42;20:35;22:26;23:04;00:35;11;76;;18:37;03:31;1;Sommeranfang ;457,494;NO;313,906;NW;14:10;595,003;0,59
22.06.2021;Dienstag;25;173;2459388;2;05:35;22:43;04:41;23:37;02:55;01:23;00:00;00:00;03:43;05:14;05:52;07:42;20:36;22:26;23:04;00:35;12;83;;20:10;03:50;1;;457,126;NO;3,138,529;NW;14:10;594,823;0,59
23.06.2021;Mittwoch;25;174;2459389;2;05:35;22:43;04:41;23:37;02:55;01:23;00:00;00:00;03:44;05:14;05:52;07:43;20:36;22:26;23:04;00:35;13;90;;21:42;04:16;1;;456,793;NO;3,137,971;NW;14:10;594,574;0,59
24.06.2021;Donnerstag;25;175;2459390;2;05:36;22:43;04:41;23:37;02:56;01:22;00:00;00:00;03:44;05:14;05:53;07:43;20:36;22:26;23:04;00:35;14;100;;23:02;04:54;1;Johannistag - letzter Spargel ;458,534;NO;3,137,385;NW;14:10;594,256;0,59
25.06.2021;Freitag;25;176;2459391;2;05:36;22:43;04:42;23:37;02:57;01:22;00:00;00:00;03:45;05:15;05:53;07:43;20:36;22:26;23:04;00:34;15;100;Vollmond;00:03;05:48;1;;458,273;NO;3,136,773;NW;14:11;593,871;0,59
26.06.2021;Samstag;25;177;2459392;2;05:37;22:43;04:42;23:37;02:58;01:21;00:00;00:00;03:45;05:15;05:53;07:44;20:36;22:26;23:04;00:34;16;90;;00:46;06:59;1;;460,088;NO;3,136,135;NW;14:11;593,417;0,59
27.06.2021;Sonntag;25;178;2459393;2;05:37;22:43;04:43;23:37;03:00;01:20;00:00;00:00;03:46;05:16;05:54;07:44;20:36;22:26;23:04;00:34;17;83;;01:15;08:21;1;Siebenschlaefer ;459,903;NO;3,135,472;NW;14:11;592,895;0,59
28.06.2021;Montag;26;179;2459394;2;05:38;22:43;04:44;23:37;03:01;01:19;00:00;00:00;03:47;05:16;05:54;07:44;20:36;22:26;23:04;00:33;18;76;;01:35;09:47;1;;461,795;NO;3,134,786;NW;14:11;592,305;0,6
29.06.2021;Dienstag;26;180;2459395;2;05:38;22:43;04:44;23:36;03:03;01:17;00:00;00:00;03:48;05:17;05:55;07:45;20:36;22:26;23:04;00:32;19;69;;01:51;11:09;1;;461,687;NO;3,134,076;NW;14:11;591,647;0,6
30.06.2021;Mittwoch;26;181;2459396;2;05:39;22:42;04:45;23:36;03:05;01:16;00:00;00:00;03:49;05:18;05:56;07:45;20:36;22:26;23:03;00:32;20;62;;02:00;12:27;1;;46,366;NO;3,131,308;NW;14:12;590,923;0,6
01.07.2021;Donnerstag;26;182;2459397;2;05:40;22:42;04:46;23:35;03:07;01:14;00:00;00:00;03:50;05:19;05:56;07:46;20:36;22:25;23:03;00:31;22;48;;02:03;13:43;1;;465,675;NO;3,130,216;NW;14:12;589,765;0,6
02.07.2021;Freitag;26;183;2459398;2;05:40;22:41;04:47;23:35;03:09;01:12;00:00;00:00;03:52;05:19;05:57;07:47;20:35;22:25;23:02;00:30;23;41;;02:15;14:55;1;;465,709;NO;3,127,395;NW;14:12;588,877;0,6
03.07.2021;Samstag;26;184;2459399;2;05:41;22:41;04:48;23:34;03:11;01:10;00:00;00:00;03:53;05:20;05:58;07:47;20:35;22:24;23:02;00:29;24;34;;02:26;16:07;1;;467,826;NO;312,659;NW;14:12;587,924;0,61
04.07.2021;Sonntag;26;185;2459400;2;05:42;22:40;04:49;23:33;03:14;01:08;00:00;00:00;03:55;05:21;05:59;07:48;20:35;22:24;23:01;00:27;25;28;;02:38;17:19;1;;469,987;NO;3,123,729;NW;14:12;586,904;0,61
05.07.2021;Montag;27;186;2459401;2;05:43;22:40;04:50;23:33;03:16;01:06;00:00;00:00;03:56;05:22;05:59;07:48;20:34;22:23;23:01;00:26;26;21;;02:52;18:30;1;;472,193;NO;3,122,885;NW;14:12;585,819;0,61
06.07.2021;Dienstag;27;187;2459402;2;05:44;22:39;04:51;23:32;03:19;01:03;00:00;00:00;03:58;05:23;06:00;07:49;20:34;22:23;23:00;00:25;27;14;;03:09;19:43;1;Internationaler Tag des Kusses ;474,443;NO;3,119,986;NW;14:13;584,671;0,61
07.07.2021;Mittwoch;27;188;2459403;2;05:45;22:39;04:53;23:31;03:21;01:01;00:00;00:00;04:00;05:24;06:01;07:50;20:34;22:22;22:59;00:23;28;7;;03:32;20:51;1;;476,739;NO;3,119,107;NW;14:13;583,457;0,62
08.07.2021;Donnerstag;27;189;2459404;2;05:46;22:38;04:54;23:30;03:24;00:59;00:00;00:00;04:02;05:25;06:02;07:51;20:33;22:22;22:58;00:22;29;0;;04:03;21:55;1;;479,081;NO;3,116,172;NW;14:13;58,218;0,62
09.07.2021;Freitag;27;190;2459405;2;05:47;22:37;04:55;23:29;03:27;00:56;00:00;00:00;04:03;05:26;06:03;07:51;20:33;22:21;22:57;00:20;0;0;Neumond;04:44;22:47;1;;481,471;NO;3,113,221;NW;14:13;580,839;0,62
10.07.2021;Samstag;27;191;2459406;2;05:48;22:36;04:57;23:28;03:30;00:54;00:00;00:00;04:05;05:28;06:04;07:52;20:32;22:20;22:57;00:18;1;7;;05:40;23:29;1;;483,907;NO;3,110,253;NW;14:13;579,435;0,63
11.07.2021;Sonntag;27;192;2459407;2;05:49;22:35;04:58;23:26;03:32;00:51;00:00;00:00;04:07;05:29;06:05;07:53;20:31;22:19;22:56;00:17;2;14;;06:46;00:00;1;;486,392;NO;3,107,269;NW;14:13;577,968;0,63
12.07.2021;Montag;28;193;2459408;2;05:50;22:34;05:00;23:25;03:35;00:49;00:00;00:00;04:09;05:30;06:07;07:54;20:31;22:18;22:54;00:15;3;21;;08:01;00:22;1;;488,925;NO;310,427;NW;14:13;576,439;0,63
13.07.2021;Dienstag;28;194;2459409;2;05:52;22:33;05:01;23:24;03:38;00:46;00:00;00:00;04:12;05:32;06:08;07:55;20:30;22:17;22:53;00:13;4;28;;09:21;00:40;1;;493,549;NO;3,101,256;NW;14:14;57,485;0,64
14.07.2021;Mittwoch;28;195;2459410;2;05:53;22:32;05:03;23:22;03:41;00:43;00:00;00:00;04:14;05:33;06:09;07:56;20:29;22:16;22:52;00:11;5;34;;10:41;00:56;1;;49,618;NO;3,098,227;NW;14:14;57,32;0,64
15.07.2021;Donnerstag;28;196;2459411;2;05:54;22:31;05:04;23:21;03:44;00:41;00:00;00:00;04:16;05:34;06:10;07:57;20:29;22:15;22:51;00:09;6;41;;12:03;01:09;1;;498,862;NO;3,095,185;NW;14:14;571,491;0,65
16.07.2021;Freitag;28;197;2459412;2;05:56;22:30;05:06;23:20;03:47;00:38;00:00;00:00;04:18;05:36;06:11;07:58;20:28;22:14;22:50;00:07;7;48;;13:25;01:22;1;;503,635;NO;3,092,128;NW;14:14;569,721;0,65
17.07.2021;Samstag;28;198;2459413;2;05:57;22:29;05:08;23:18;03:50;00:35;00:00;00:00;04:20;05:37;06:13;07:59;20:27;22:13;22:48;00:05;8;55;;14:48;01:36;1;;506,417;NO;3,089,059;NW;14:14;567,893;0,65
18.07.2021;Sonntag;28;199;2459414;2;05:58;22:28;05:09;23:16;03:53;00:32;00:00;00:00;04:23;05:39;06:14;08:00;20:26;22:12;22:47;00:03;9;62;;16:15;01:53;1;;50,925;NO;3,085,977;NW;14:14;566,007;0,66
19.07.2021;Montag;29;200;2459415;2;06:00;22:26;05:11;23:15;03:56;00:30;00:00;00:00;04:25;05:40;06:15;08:01;20:25;22:11;22:46;00:01;10;69;;17:45;02:00;1;;514,177;NO;3,080,842;NW;14:14;564,064;0,66
20.07.2021;Dienstag;29;201;2459416;2;06:01;22:25;05:13;23:13;03:59;00:27;00:00;00:00;04:27;05:42;06:17;08:02;20:24;22:09;22:44;23:58;11;76;;19:15;02:15;1;;517,112;NO;3,077,735;NW;14:14;562,064;0,67
21.07.2021;Mittwoch;29;202;2459417;2;06:03;22:24;05:15;23:11;04:01;00:24;00:00;00:00;04:30;05:43;06:18;08:03;20:23;22:08;22:43;23:56;12;83;;20:38;02:47;1;;522,141;NO;3,074,616;NW;14:14;560,007;0,67
22.07.2021;Donnerstag;29;203;2459418;2;06:04;22:22;05:16;23:10;04:04;00:21;00:00;00:00;04:32;05:45;06:20;08:04;20:22;22:07;22:41;23:54;13;90;;21:48;03:32;1;;525,179;NO;3,069,446;NW;14:14;557,896;0,68
23.07.2021;Freitag;29;204;2459419;2;06:06;22:21;05:18;23:08;04:07;00:18;00:00;00:00;04:34;05:47;06:21;08:05;20:21;22:05;22:40;23:52;14;100;;22:38;04:34;1;;530,312;NO;3,066,304;NW;14:14;555,729;0,69
24.07.2021;Samstag;29;205;2459420;2;06:07;22:19;05:20;23:06;04:10;00:15;00:00;00:00;04:37;05:48;06:22;08:07;20:20;22:04;22:38;23:49;15;100;Vollmond;23:13;05:52;1;;533,454;NO;3,061,112;NW;14:14;55,351;0,69
25.07.2021;Sonntag;29;206;2459421;2;06:09;22:18;05:22;23:04;04:13;00:13;00:00;00:00;04:39;05:50;06:24;08:08;20:19;22:02;22:36;23:47;16;90;;23:38;07:18;1;;53,869;NO;3,057,948;NW;14:14;551,236;0,7
26.07.2021;Montag;30;207;2459422;2;06:10;22:16;05:24;23:02;04:16;00:10;00:00;00:00;04:41;05:52;06:25;08:09;20:18;22:01;22:35;23:44;17;83;;23:55;08:43;1;Sommerschlussverkauf ;541,935;NO;3,052,734;NW;14:14;548,911;0,7
27.07.2021;Dienstag;30;208;2459423;2;06:12;22:14;05:26;23:00;04:19;00:07;00:00;00:00;04:44;05:53;06:27;08:10;20:16;21:59;22:33;23:42;18;76;;00:09;10:05;1;;547,275;NO;3,047,511;NW;14:14;546,534;0,71
28.07.2021;Mittwoch;30;209;2459424;2;06:14;22:13;05:28;22:58;04:22;00:04;00:00;00:00;04:46;05:55;06:28;08:11;20:15;21:58;22:31;23:40;19;69;;00:21;11:23;1;;552,666;NO;3,044,316;NW;14:14;544,107;0,72
29.07.2021;Donnerstag;30;210;2459425;2;06:15;22:11;05:30;22:56;04:25;00:01;00:00;00:00;04:49;05:57;06:30;08:13;20:14;21:56;22:29;23:37;20;62;;00:32;12:38;1;;556,067;NO;3,039,072;NW;14:14;541,629;0,72
30.07.2021;Freitag;30;211;2459426;2;06:17;22:09;05:32;22:54;04:27;23:58;00:00;00:00;04:51;05:59;06:32;08:14;20:12;21:55;22:27;23:35;21;55;;00:44;13:51;1;Sysadmin Day Internationaler Tag der Freundschaft ;561,561;NO;3,033,819;WNW;14:14;539,102;0,73
31.07.2021;Samstag;30;212;2459427;2;06:18;22:08;05:34;22:52;04:30;23:55;00:00;00:00;04:54;06:00;06:33;08:15;20:11;21:53;22:26;23:32;22;48;;00:57;15:04;1;;565,063;ONO;3,030,595;WNW;14:14;536,527;0,74
01.08.2021;Sonntag;30;213;2459428;2;06:20;22:06;05:36;22:50;04:33;23:52;00:00;01:55;04:56;06:02;06:35;08:17;20:09;21:51;22:24;23:30;23;41;;01:13;16:16;1;;569,802;ONO;3,025,996;WNW;14:14;535,385;0,74
02.08.2021;Montag;31;214;2459429;2;06:22;22:04;05:38;22:48;04:36;23:49;02:41;01:40;04:58;06:04;06:36;08:18;20:08;21:49;22:22;23:27;24;34;;01:34;17:29;1;;575,419;ONO;302,072;WNW;14:13;532,741;0,75
03.08.2021;Dienstag;31;215;2459430;2;06:24;22:02;05:40;22:46;04:39;23:46;02:53;01:29;05:01;06:06;06:38;08:19;20:07;21:48;22:20;23:24;25;28;;02:00;18:39;1;;581,087;ONO;3,015,435;WNW;14:13;530,052;0,75
04.08.2021;Mittwoch;31;216;2459431;2;06:25;22:00;05:42;22:44;04:41;23:43;03:02;01:21;05:03;06:08;06:40;08:21;20:05;21:46;22:18;23:22;26;21;;02:01;19:45;1;;584,764;ONO;3,010,142;WNW;14:13;527,317;0,76
05.08.2021;Donnerstag;31;217;2459432;2;06:27;21:58;05:44;22:41;04:44;23:40;03:09;01:13;05:06;06:09;06:41;08:22;20:03;21:44;22:16;23:19;27;14;;02:38;20:41;1;;590,531;ONO;300,484;WNW;14:13;524,538;0,77
06.08.2021;Freitag;31;218;2459433;2;06:29;21:56;05:46;22:39;04:47;23:38;03:16;01:06;05:08;06:11;06:43;08:23;20:02;21:42;22:14;23:17;28;7;;03:29;21:27;1;;596,346;ONO;2,999,529;WNW;14:13;521,714;0,78
07.08.2021;Samstag;31;219;2459434;2;06:30;21:54;05:48;22:37;04:50;23:35;03:23;01:00;05:11;06:13;06:45;08:25;20:00;21:40;22:12;23:14;29;0;;04:32;22:01;1;;600,171;ONO;299,421;WNW;14:13;518,847;0,78
08.08.2021;Sonntag;31;220;2459435;2;06:32;21:52;05:50;22:35;04:52;23:32;03:28;00:54;05:13;06:15;06:46;08:26;19:59;21:38;22:10;23:11;0;0;Neumond;05:46;22:27;1;;606,083;ONO;2,988,882;WNW;14:13;515,938;0,79
09.08.2021;Montag;32;221;2459436;2;06:34;21:50;05:52;22:32;04:55;23:29;03:34;00:49;05:15;06:17;06:48;08:28;19:57;21:36;22:07;23:09;1;7;;07:06;22:47;1;;612,043;ONO;2,983,547;WNW;14:13;512,988;0,8
10.08.2021;Dienstag;32;222;2459437;2;06:36;21:48;05:54;22:30;04:58;23:26;03:39;00:43;05:18;06:19;06:50;08:29;19:55;21:34;22:05;23:06;2;14;;08:27;23:03;1;;618,049;ONO;2,978,203;WNW;14:12;509,997;0,81
11.08.2021;Mittwoch;32;223;2459438;2;06:37;21:46;05:56;22:28;05:00;23:23;03:44;00:38;05:20;06:20;06:51;08:30;19:53;21:32;22:03;23:03;3;21;;09:50;23:16;1;;622,062;ONO;2,972,851;WNW;14:12;506,967;0,82
12.08.2021;Donnerstag;32;224;2459439;2;06:39;21:44;05:58;22:25;05:03;23:20;03:49;00:33;05:22;06:22;06:53;08:32;19:52;21:30;22:01;23:01;4;28;;11:13;23:30;1;;62,816;ONO;2,967,492;WNW;14:12;503,898;0,83
13.08.2021;Freitag;32;225;2459440;2;06:41;21:42;06:00;22:23;05:06;23:17;03:53;00:29;05:25;06:24;06:55;08:33;19:50;21:28;21:59;22:58;5;34;;12:37;23:43;1;;634,303;ONO;2,962,125;WNW;14:12;500,791;0,84
14.08.2021;Samstag;32;226;2459441;2;06:43;21:40;06:02;22:21;05:08;23:14;03:57;00:24;05:27;06:26;06:56;08:35;19:48;21:26;21:57;22:55;6;41;;14:03;23:59;1;;640,489;ONO;295,675;WNW;14:12;497,647;0,85
15.08.2021;Sonntag;32;227;2459442;2;06:44;21:38;06:04;22:18;05:11;23:11;04:02;00:19;05:29;06:28;06:58;08:36;19:46;21:24;21:54;22:52;7;48;;15:31;00:18;1;Mariae Himmelfahrt ;644,681;ONO;2,951,367;WNW;14:11;494,466;0,86
16.08.2021;Montag;33;228;2459443;2;06:46;21:36;06:06;22:16;05:13;23:08;04:06;00:15;05:32;06:30;07:00;08:38;19:44;21:22;21:52;22:50;8;55;;16:59;00:45;1;;650,954;ONO;2,945,977;WNW;14:11;491,252;0,87
17.08.2021;Dienstag;33;229;2459444;2;06:48;21:33;06:08;22:13;05:16;23:05;04:10;00:11;05:34;06:32;07:02;08:39;19:42;21:20;21:50;22:47;9;62;;18:23;01:24;1;;657,267;ONO;2,938,545;WNW;14:11;488,002;0,88
18.08.2021;Mittwoch;33;230;2459445;2;06:50;21:31;06:10;22:11;05:18;23:02;04:13;00:07;05:36;06:33;07:03;08:41;19:40;21:18;21:47;22:44;10;69;;19:36;02:00;1;;663,622;ONO;2,933,141;WNW;14:11;484,719;0,89
19.08.2021;Donnerstag;33;231;2459446;2;06:52;21:29;06:12;22:08;05:21;22:59;04:17;00:02;05:39;06:35;07:05;08:42;19:38;21:16;21:45;22:42;11;76;;20:32;02:18;1;;670,016;ONO;2,927,729;WNW;14:10;481,402;0,9
20.08.2021;Freitag;33;232;2459447;2;06:53;21:27;06:14;22:06;05:23;22:56;04:21;23:58;05:41;06:37;07:07;08:44;19:36;21:13;21:43;22:39;12;83;;21:12;03:29;1;;674,412;ONO;292,231;WNW;14:10;478,055;0,91
21.08.2021;Samstag;33;233;2459448;2;06:55;21:24;06:16;22:03;05:26;22:54;04:24;23:54;05:43;06:39;07:08;08:45;19:34;21:11;21:40;22:36;13;90;;21:39;04:51;1;;680,883;ONO;291,485;WNW;14:10;474,677;0,92
22.08.2021;Sonntag;33;234;2459449;2;06:57;21:22;06:18;22:01;05:28;22:51;04:28;23:50;05:45;06:41;07:10;08:47;19:32;21:09;21:38;22:33;14;100;;21:59;06:16;1;;687,391;ONO;2,909,417;WNW;14:10;471,268;0,93
23.08.2021;Montag;34;235;2459450;2;06:59;21:20;06:20;21:59;05:30;22:48;04:31;23:47;05:48;06:43;07:12;08:49;19:30;21:07;21:36;22:31;15;100;Vollmond;22:14;07:41;1;;693,934;ONO;2,903,976;WNW;14:09;46,783;0,94
24.08.2021;Dienstag;34;236;2459451;2;07:00;21:18;06:22;21:56;05:33;22:45;04:34;23:43;05:50;06:45;07:14;08:50;19:28;21:04;21:33;22:28;16;90;;22:27;09:01;1;;698,477;ONO;2,898,529;WNW;14:09;464,365;0,95
25.08.2021;Mittwoch;34;237;2459452;2;07:02;21:15;06:24;21:54;05:35;22:42;04:38;23:39;05:52;06:46;07:15;08:52;19:26;21:02;21:31;22:25;17;83;;22:38;10:18;1;;705,089;ONO;2,891,043;WNW;14:09;460,872;0,96
26.08.2021;Donnerstag;34;238;2459453;2;07:04;21:13;06:26;21:51;05:38;22:39;04:41;23:35;05:54;06:48;07:17;08:53;19:24;21:00;21:29;22:22;18;76;;22:50;11:33;1;;711,734;ONO;2,885,582;WNW;14:09;457,352;0,97
27.08.2021;Freitag;34;239;2459454;2;07:06;21:11;06:28;21:48;05:40;22:36;04:44;23:32;05:56;06:50;07:19;08:55;19:21;20:57;21:26;22:20;19;69;;23:02;12:47;1;;71,841;ONO;2,880,114;WNW;14:08;453,807;0,99
28.08.2021;Samstag;34;240;2459455;2;07:08;21:08;06:30;21:46;05:42;22:33;04:47;23:28;05:59;06:52;07:21;08:57;19:19;20:55;21:24;22:17;20;62;;23:17;14:00;1;;725,116;ONO;2,872,608;WNW;14:08;450,238;1
29.08.2021;Sonntag;34;241;2459456;2;07:09;21:06;06:32;21:43;05:44;22:30;04:50;23:25;06:01;06:54;07:22;08:58;19:17;20:53;21:21;22:14;21;55;;23:35;15:13;1;;729,818;ONO;2,867,127;WNW;14:08;446,644;1,01
30.08.2021;Montag;35;242;2459457;2;07:11;21:03;06:34;21:41;05:47;22:28;04:53;23:21;06:03;06:56;07:24;09:00;19:15;20:50;21:19;22:11;22;48;;23:59;16:24;1;;736,582;ONO;2,859,609;WNW;14:07;443,027;1,02
31.08.2021;Dienstag;35;243;2459458;2;07:13;21:01;06:36;21:38;05:49;22:25;04:56;23:17;06:05;06:57;07:26;09:02;19:12;20:48;21:16;22:09;23;41;;00:32;17:33;1;;743,373;ONO;2,854,114;WNW;14:07;43,939;1,04
01.09.2021;Mittwoch;35;244;2459459;2;07:15;20:59;06:37;21:36;05:51;22:22;04:59;23:14;06:07;06:59;07:28;09:03;19:10;20:46;21:14;22:06;24;34;;01:17;18:33;1;Antikriegstag ;748,637;ONO;2,849,425;WNW;14:07;437,791;1,04
02.09.2021;Donnerstag;35;245;2459460;2;07:16;20:56;06:39;21:33;05:53;22:19;05:02;23:11;06:09;07:01;07:29;09:05;19:08;20:43;21:12;22:03;25;28;;02:00;19:23;1;;753,433;ONO;2,841,893;WNW;14:07;434,122;1,06
03.09.2021;Freitag;35;246;2459461;2;07:18;20:54;06:41;21:31;05:56;22:16;05:04;23:07;06:11;07:03;07:31;09:07;19:05;20:41;21:09;22:01;26;21;;02:15;20:01;1;;760,283;ONO;2,836,383;WNW;14:06;430,434;1,07
04.09.2021;Samstag;35;247;2459462;2;07:20;20:51;06:43;21:28;05:58;22:13;05:07;23:04;06:13;07:05;07:33;09:08;19:03;20:39;21:07;21:58;27;14;;03:25;20:30;1;;767,157;ONO;2,828,838;WNW;14:06;426,727;1,08
05.09.2021;Sonntag;35;248;2459463;2;07:22;20:49;06:45;21:26;06:00;22:10;05:10;23:00;06:15;07:07;07:34;09:10;19:01;20:36;21:04;21:55;28;7;;04:43;20:51;1;;774,051;ONO;2,823,315;WNW;14:05;423,001;1,1
06.09.2021;Montag;36;249;2459464;2;07:24;20:46;06:47;21:23;06:02;22:08;05:12;22:57;06:17;07:08;07:36;09:12;18:58;20:34;21:02;21:52;29;0;;06:06;21:09;1;;780,965;ONO;2,815,759;WNW;14:05;41,926;1,11
07.09.2021;Dienstag;36;250;2459465;2;07:25;20:44;06:49;21:20;06:04;22:05;05:15;22:54;06:20;07:10;07:38;09:14;18:56;20:31;20:59;21:50;0;0;Neumond;07:30;21:23;1;;785,869;ONO;2,810,223;W;14:05;415,502;1,13
08.09.2021;Mittwoch;36;251;2459466;2;07:27;20:42;06:51;21:18;06:06;22:02;05:18;22:51;06:22;07:12;07:40;09:15;18:53;20:29;20:57;21:47;1;7;;08:55;21:36;1;;792,819;O;2,804,681;W;14:04;411,727;1,14
09.09.2021;Donnerstag;36;252;2459467;2;07:29;20:39;06:53;21:15;06:09;21:59;05:20;22:47;06:24;07:14;07:41;09:17;18:51;20:26;20:54;21:44;2;14;;10:21;21:50;1;;799,786;O;2,797,106;W;14:04;40,794;1,16
10.09.2021;Freitag;36;253;2459468;2;07:31;20:37;06:55;21:13;06:11;21:56;05:23;22:44;06:26;07:16;07:43;09:19;18:48;20:24;20:52;21:42;3;21;;11:48;22:04;1;;806,767;O;2,791,552;W;14:04;404,138;1,17
11.09.2021;Samstag;36;254;2459469;2;07:32;20:34;06:56;21:10;06:13;21:54;05:25;22:41;06:28;07:17;07:45;09:21;18:46;20:22;20:49;21:39;4;28;;13:17;22:22;1;;811,734;O;2,783,966;W;14:03;400,323;1,19
12.09.2021;Sonntag;36;255;2459470;2;07:34;20:32;06:58;21:08;06:15;21:51;05:28;22:38;06:30;07:19;07:47;09:23;18:43;20:19;20:47;21:36;5;34;;14:47;22:47;1;Tag der Heimat Tag des offenen Denkmals Puetzchens Markt ;818,741;O;2,778,399;W;14:03;396,498;1,21
13.09.2021;Montag;37;256;2459471;2;07:36;20:29;07:00;21:05;06:17;21:48;05:30;22:35;06:32;07:21;07:48;09:24;18:41;20:17;20:44;21:34;6;41;;16:13;23:21;1;Tag des Programmierers ;825,758;O;2,770,802;W;14:03;392,662;1,22
14.09.2021;Dienstag;37;257;2459472;2;07:38;20:27;07:02;21:02;06:19;21:45;05:32;22:32;06:33;07:23;07:50;09:26;18:38;20:14;20:42;21:31;7;48;;17:30;00:10;1;;832,785;O;2,765,224;W;14:02;388,815;1,24
15.09.2021;Mittwoch;37;258;2459473;2;07:40;20:24;07:04;21:00;06:21;21:43;05:35;22:29;06:35;07:25;07:52;09:28;18:36;20:12;20:39;21:28;8;55;;18:30;01:15;1;;839,819;O;2,757,616;W;14:02;38,496;1,26
16.09.2021;Donnerstag;37;259;2459474;2;07:41;20:22;07:06;20:57;06:23;21:40;05:37;22:26;06:37;07:26;07:54;09:30;18:33;20:09;20:37;21:26;9;62;;19:14;02:00;1;;844,834;O;2,752,025;W;14:02;381,096;1,27
17.09.2021;Freitag;37;260;2459475;2;07:43;20:19;07:08;20:55;06:25;21:37;05:39;22:23;06:39;07:28;07:56;09:32;18:30;20:07;20:34;21:23;10;69;;19:44;02:32;1;;85,188;O;2,744,406;W;14:01;377,226;1,29
18.09.2021;Samstag;37;261;2459476;2;07:45;20:17;07:09;20:52;06:27;21:35;05:42;22:20;06:41;07:30;07:57;09:34;18:28;20:04;20:32;21:20;11;76;;20:04;03:56;1;;85,893;O;2,738,804;W;14:01;37,335;1,31
19.09.2021;Sonntag;37;262;2459477;2;07:47;20:14;07:11;20:50;06:29;21:32;05:44;22:17;06:43;07:32;07:59;09:36;18:25;20:02;20:29;21:18;12;83;;20:20;05:19;1;;865,981;O;2,731,175;W;14:01;369,468;1,33
20.09.2021;Montag;38;263;2459478;2;07:48;20:12;07:13;20:47;06:31;21:29;05:46;22:14;06:45;07:34;08:01;09:38;18:22;19:59;20:27;21:15;13;90;;20:33;06:40;1;;871,009;O;2,725,561;W;14:00;365,582;1,35
21.09.2021;Dienstag;38;264;2459479;2;07:50;20:09;07:15;20:45;06:33;21:27;05:48;22:11;06:47;07:35;08:03;09:40;18:20;19:57;20:24;21:12;14;100;;20:45;07:59;1;Weltfriedenstag ;878,061;O;2,717,921;W;14:00;361,693;1,37
22.09.2021;Mittwoch;38;265;2459480;2;07:52;20:07;07:17;20:42;06:35;21:24;05:51;22:08;06:49;07:37;08:04;09:42;18:17;19:54;20:22;21:10;15;100;Vollmond;20:56;09:15;1;Herbstanfang ;885,111;O;2,712,297;W;13:59;35,78;1,39
23.09.2021;Donnerstag;38;266;2459481;2;07:54;20:04;07:19;20:40;06:37;21:21;05:53;22:05;06:51;07:39;08:06;09:44;18:14;19:52;20:19;21:07;16;90;;21:08;10:29;1;;892,157;O;2,704,647;W;13:59;353,908;1,41
24.09.2021;Freitag;38;267;2459482;2;07:56;20:02;07:20;20:37;06:39;21:19;05:55;22:02;06:53;07:41;08:08;09:46;18:12;19:49;20:17;21:05;17;83;;21:21;11:43;1;Tag der Raumfahrt ;899,198;O;2,699,011;W;13:59;350,014;1,43
25.09.2021;Samstag;38;268;2459483;2;07:57;19:59;07:22;20:34;06:41;21:16;05:57;21:59;06:55;07:43;08:10;09:48;18:09;19:47;20:14;21:02;18;76;;21:38;12:57;1;;904,209;O;2,691,352;W;13:58;34,612;1,45
26.09.2021;Sonntag;38;269;2459484;2;07:59;19:57;07:24;20:32;06:42;21:13;05:59;21:57;06:56;07:44;08:12;09:50;18:06;19:44;20:12;21:00;19;69;;21:59;14:10;1;;911,236;O;2,685,706;W;13:58;342,229;1,47
27.09.2021;Montag;39;270;2459485;2;08:01;19:54;07:26;20:30;06:44;21:11;06:01;21:54;06:58;07:46;08:13;09:52;18:03;19:42;20:09;20:57;20;62;;22:27;15:20;1;;918,253;O;2,678,036;W;13:58;33,834;1,49
28.09.2021;Dienstag;39;271;2459486;2;08:03;19:52;07:28;20:27;06:46;21:08;06:03;21:51;07:00;07:48;08:15;09:54;18:00;19:39;20:07;20:54;21;55;;23:06;16:23;1;;925,259;O;267,238;W;13:57;334,453;1,51
29.09.2021;Mittwoch;39;272;2459487;2;08:05;19:49;07:29;20:25;06:48;21:06;06:05;21:48;07:02;07:50;08:17;09:56;17:58;19:37;20:04;20:52;22;48;;23:58;17:18;1;;932,253;O;2,664,702;W;13:57;330,572;1,54
30.09.2021;Donnerstag;39;273;2459488;2;08:06;19:47;07:31;20:22;06:50;21:03;06:07;21:46;07:04;07:52;08:19;09:58;17:55;19:34;20:02;20:49;23;41;;01:03;18:00;1;;937,213;O;2,659,036;W;13:57;326,695;1,56
01.10.2021;Freitag;39;274;2459489;2;08:08;19:44;07:33;20:20;06:52;21:01;06:09;21:43;07:06;07:53;08:21;10:01;17:52;19:32;19:59;20:47;25;28;;02:00;18:31;1;;945,452;O;265,063;W;13:56;321,133;1,59
02.10.2021;Samstag;39;275;2459490;2;08:10;19:42;07:35;20:17;06:54;20:58;06:12;21:40;07:08;07:55;08:22;10:03;17:49;19:30;19:57;20:44;26;21;;02:17;18:55;1;Welttag des Laechelns ;952,393;O;2,644,953;W;13:56;317,274;1,62
03.10.2021;Sonntag;39;276;2459491;2;08:12;19:40;07:37;20:15;06:56;20:56;06:14;21:38;07:09;07:57;08:24;10:05;17:46;19:27;19:54;20:42;27;14;;03:38;19:14;0;Erntedankfest Tag der Einheit ;959,315;O;263,927;W;13:56;313,423;1,64
04.10.2021;Montag;40;277;2459492;2;08:14;19:37;07:38;20:12;06:58;20:53;06:15;21:35;07:11;07:59;08:26;10:07;17:43;19:25;19:52;20:40;28;7;;05:02;19:29;1;Welttierschutztag ;966,216;O;2,631,568;W;13:55;309,581;1,67
05.10.2021;Dienstag;40;278;2459493;2;08:15;19:35;07:40;20:10;06:59;20:51;06:17;21:33;07:13;08:01;08:28;10:10;17:40;19:22;19:50;20:37;29;0;;06:27;19:42;1;Weltlehrertag ;971,078;O;2,625,877;W;13:55;305,751;1,69
06.10.2021;Mittwoch;40;279;2459494;2;08:17;19:32;07:42;20:07;07:01;20:48;06:19;21:30;07:15;08:02;08:30;10:12;17:37;19:20;19:47;20:35;0;0;Neumond;07:54;19:55;1;;977,935;O;2,618,167;W;13:55;301,932;1,72
07.10.2021;Donnerstag;40;280;2459495;2;08:19;19:30;07:44;20:05;07:03;20:46;06:21;21:28;07:17;08:04;08:32;10:14;17:34;19:17;19:45;20:32;1;7;;09:23;20:09;1;;984,768;O;2,612,467;W;13:54;298,125;1,75
08.10.2021;Freitag;40;281;2459496;2;08:21;19:27;07:46;20:03;07:05;20:44;06:23;21:25;07:19;08:06;08:34;10:17;17:31;19:15;19:42;20:30;2;14;;10:54;20:26;1;;991,574;O;260,475;W;13:54;294,333;1,77
09.10.2021;Samstag;40;282;2459497;2;08:23;19:25;07:48;20:00;07:07;20:41;06:25;21:23;07:20;08:08;08:35;10:19;17:28;19:12;19:40;20:28;3;21;;12:27;20:48;1;;998,353;O;2,599,043;W;13:54;290,555;1,8
10.10.2021;Sonntag;40;283;2459498;2;08:25;19:23;07:49;19:58;07:09;20:39;06:27;21:20;07:22;08:10;08:37;10:22;17:25;19:10;19:38;20:25;4;28;;13:59;21:19;1;;1,005,103;O;2,593,332;W;13:54;286,793;1,83
11.10.2021;Montag;41;284;2459499;2;08:27;19:20;07:51;19:56;07:10;20:36;06:29;21:18;07:24;08:12;08:39;10:24;17:22;19:08;19:35;20:23;5;34;;15:22;22:04;1;;1,011,823;O;2,585,605;WSW;13:53;283,047;1,86
12.10.2021;Dienstag;41;285;2459500;2;08:28;19:18;07:53;19:53;07:12;20:34;06:31;21:15;07:26;08:13;08:41;10:27;17:19;19:05;19:33;20:21;6;41;;16:29;23:05;1;;1,016,496;OSO;2,579,887;WSW;13:53;27,932;1,89
13.10.2021;Mittwoch;41;286;2459501;2;08:30;19:16;07:55;19:51;07:14;20:32;06:33;21:13;07:28;08:15;08:43;10:29;17:16;19:03;19:31;20:18;7;48;;17:17;00:19;1;;1,023,152;OSO;2,574,165;WSW;13:53;275,612;1,92
14.10.2021;Donnerstag;41;287;2459502;2;08:32;19:13;07:57;19:49;07:16;20:30;06:35;21:11;07:29;08:17;08:45;10:32;17:13;19:00;19:28;20:16;8;55;;17:50;01:42;1;;1,029,773;OSO;256,643;WSW;13:53;271,923;1,95
15.10.2021;Freitag;41;288;2459503;2;08:34;19:11;07:58;19:47;07:18;20:27;06:37;21:08;07:31;08:19;08:47;10:34;17:10;18:58;19:26;20:14;9;62;;18:12;02:00;1;;1,036,359;OSO;2,560,702;WSW;13:53;268,255;1,98
16.10.2021;Samstag;41;289;2459504;2;08:36;19:09;08:00;19:44;07:19;20:25;06:38;21:06;07:33;08:21;08:49;10:37;17:07;18:56;19:24;20:12;10;69;;18:29;03:04;1;;1,042,908;OSO;2,554,972;WSW;13:52;264,609;2,01
17.10.2021;Sonntag;41;290;2459505;2;08:38;19:06;08:02;19:42;07:21;20:23;06:40;21:04;07:35;08:23;08:51;10:40;17:04;18:53;19:21;20:09;11;76;;18:42;04:25;1;;1,049,418;OSO;2,547,229;WSW;13:52;260,988;2,04
18.10.2021;Montag;42;291;2459506;2;08:40;19:04;08:04;19:40;07:23;20:21;06:42;21:02;07:37;08:25;08:53;10:42;17:01;18:51;19:19;20:07;12;83;;18:54;05:43;1;;1,055,889;OSO;2,541,494;WSW;13:52;25,739;2,07
19.10.2021;Dienstag;42;292;2459507;2;08:42;19:02;08:06;19:38;07:25;20:19;06:44;20:59;07:38;08:26;08:55;10:45;16:58;18:49;19:17;20:05;13;90;;19:04;06:59;1;;1,062,319;OSO;2,535,756;WSW;13:52;253,817;2,11
20.10.2021;Mittwoch;42;293;2459508;2;08:43;18:59;08:07;19:35;07:27;20:16;06:46;20:57;07:40;08:28;08:57;10:48;16:55;18:46;19:15;20:03;14;100;;19:15;08:13;1;;1,066,696;OSO;2,528,008;WSW;13:52;25,027;2,14
21.10.2021;Donnerstag;42;294;2459509;2;08:45;18:57;08:09;19:33;07:28;20:14;06:47;20:55;07:42;08:30;08:59;10:51;16:51;18:44;19:12;20:01;15;100;Vollmond;19:28;09:28;1;;1,073,041;OSO;2,522,267;WSW;13:52;246,751;2,18
22.10.2021;Freitag;42;295;2459510;2;08:47;18:55;08:11;19:31;07:30;20:12;06:49;20:53;07:44;08:32;09:00;10:54;16:48;18:42;19:10;19:59;16;90;;19:42;10:41;1;;1,079,341;OSO;2,516,524;WSW;13:51;24,326;2,21
23.10.2021;Samstag;42;296;2459511;2;08:49;18:53;08:13;19:29;07:32;20:10;06:51;20:51;07:45;08:34;09:02;10:57;16:45;18:40;19:08;19:57;17;83;;20:01;11:56;1;;1,085,596;OSO;2,510,779;WSW;13:51;23,98;2,25
24.10.2021;Sonntag;42;297;2459512;2;08:51;18:51;08:15;19:27;07:34;20:08;06:53;20:49;07:47;08:36;09:04;11:00;16:42;18:37;19:06;19:55;18;76;;20:26;13:07;1;;1,091,804;OSO;2,505,034;WSW;13:51;23,637;2,28
25.10.2021;Montag;43;298;2459513;2;08:53;18:48;08:17;19:25;07:35;20:06;06:55;20:47;07:49;08:38;09:06;11:03;16:38;18:35;19:04;19:53;19;69;;21:00;14:14;1;;1,097,964;OSO;249,728;WSW;13:51;232,972;2,32
26.10.2021;Dienstag;43;299;2459514;2;08:55;18:46;08:18;19:23;07:37;20:04;06:56;20:45;07:51;08:39;09:08;11:06;16:35;18:33;19:02;19:51;20;62;;21:47;15:12;1;;1,104,076;OSO;2,491,533;WSW;13:51;229,607;2,36
27.10.2021;Mittwoch;43;300;2459515;2;08:57;18:44;08:20;19:21;07:39;20:02;06:58;20:43;07:53;08:41;09:10;11:09;16:32;18:31;19:00;19:49;21;55;;22:46;15:58;1;;1,110,137;OSO;2,485,786;WSW;13:51;226,276;2,4
28.10.2021;Donnerstag;43;301;2459516;2;08:59;18:42;08:22;19:19;07:41;20:00;07:00;20:41;07:54;08:43;09:12;11:12;16:28;18:28;18:58;19:47;22;48;;23:56;16:33;1;;1,116,147;OSO;2,480,038;WSW;13:51;22,298;2,44
29.10.2021;Freitag;43;302;2459517;2;09:01;18:40;08:24;19:17;07:42;19:58;07:02;20:39;07:56;08:45;09:14;11:15;16:25;18:26;18:56;19:45;23;41;;01:12;16:59;1;;1,122,104;OSO;247,429;WSW;13:51;219,721;2,48
30.10.2021;Samstag;43;303;2459518;2;09:03;18:38;08:26;19:15;07:44;19:57;07:03;20:37;07:58;08:47;09:16;11:18;16:22;18:24;18:54;19:43;24;34;;02:00;17:19;1;;1,128,009;OSO;2,468,543;WSW;13:51;216,499;2,52
31.10.2021;Sonntag;43;304;2459519;1;08:05;17:36;07:28;18:13;06:46;18:55;06:05;19:36;07:00;07:49;08:18;10:22;15:18;17:22;17:52;18:41;25;28;;02:33;16:35;1;Ende MESZ Halloween Reformationstag ;113,386;OSO;2,462,796;WSW;12:51;213,316;2,56
01.11.2021;Montag;44;305;2459520;1;08:07;17:34;07:29;18:11;06:48;18:53;06:07;19:34;07:01;07:51;08:20;10:25;15:15;17:20;17:50;18:39;26;21;;02:56;16:48;0;Allerheiligen Weltvegantag ;1,138,662;OSO;2,458,025;WSW;12:51;211,935;2,58
02.11.2021;Dienstag;44;306;2459521;1;08:09;17:32;07:31;18:09;06:49;18:51;06:08;19:32;07:03;07:53;08:22;10:28;15:11;17:18;17:48;18:37;27;14;;04:21;17:00;1;Allerseelen ;1,144,433;OSO;2,452,281;WSW;12:51;208,809;2,62
03.11.2021;Mittwoch;44;307;2459522;1;08:11;17:30;07:33;18:08;06:51;18:50;06:10;19:30;07:05;07:55;08:24;10:32;15:08;17:16;17:46;18:36;28;7;;05:48;17:13;1;;1,150,148;OSO;2,446,537;WSW;12:51;205,725;2,66
04.11.2021;Donnerstag;44;308;2459523;1;08:13;17:28;07:35;18:06;06:53;18:48;06:12;19:29;07:07;07:56;08:26;10:35;15:04;17:14;17:44;18:34;29;0;;07:19;17:29;1;;1,155,807;OSO;2,440,795;WSW;12:51;202,683;2,71
05.11.2021;Freitag;44;309;2459524;1;08:14;17:26;07:37;18:04;06:54;18:46;06:13;19:27;07:08;07:58;08:28;10:39;15:01;17:12;17:42;18:32;0;0;Neumond;08:54;17:48;1;;115,94;OSO;2,435,055;WSW;12:51;199,685;2,75
06.11.2021;Samstag;44;310;2459525;1;08:16;17:24;07:38;18:02;06:56;18:45;06:15;19:26;07:10;08:00;08:30;10:43;14:57;17:10;17:40;18:31;1;7;;10:30;18:15;1;;1,164,943;OSO;2,429,318;WSW;12:51;196,731;2,8
07.11.2021;Sonntag;44;311;2459526;1;08:18;17:22;07:40;18:01;06:58;18:43;06:17;19:24;07:12;08:02;08:33;10:46;14:53;17:08;17:39;18:29;2;14;;12:02;18:55;1;;1,170,427;OSO;2,423,583;WSW;12:51;193,824;2,84
08.11.2021;Montag;45;312;2459527;1;08:20;17:21;07:42;17:59;07:00;18:41;06:18;19:23;07:14;08:04;08:35;10:50;14:50;17:06;17:37;18:27;3;21;;13:19;19:51;1;;1,175,851;OSO;2,419,857;WSW;12:51;190,963;2,89
09.11.2021;Dienstag;45;313;2459528;1;08:22;17:19;07:44;17:57;07:01;18:40;06:20;19:21;07:15;08:06;08:37;10:54;14:46;17:04;17:35;18:26;4;28;;14:16;21:04;1;;1,181,214;OSO;2,414,129;WSW;12:51;18,815;2,93
10.11.2021;Mittwoch;45;314;2459529;1;08:24;17:17;07:46;17:56;07:03;18:38;06:22;19:20;07:17;08:08;08:39;10:58;14:42;17:03;17:34;18:24;5;34;;14:54;22:27;1;;1,186,518;OSO;2,408,405;WSW;12:51;185,387;2,98
11.11.2021;Donnerstag;45;315;2459530;1;08:26;17:15;07:47;17:54;07:05;18:37;06:23;19:18;07:19;08:10;08:41;11:02;14:38;17:01;17:32;18:23;6;41;;15:20;23:51;1;Martinstag ;119,176;OSO;2,402,685;WSW;12:51;182,673;3,03
12.11.2021;Freitag;45;316;2459531;1;08:28;17:14;07:49;17:53;07:06;18:36;06:25;19:17;07:20;08:11;08:43;11:06;14:34;16:59;17:30;18:21;7;48;;15:38;01:00;1;;119,694;OSO;2,398,975;WSW;12:52;180,012;3,08
13.11.2021;Samstag;45;317;2459532;1;08:30;17:12;07:51;17:51;07:08;18:34;06:26;19:16;07:22;08:13;08:45;11:11;14:30;16:57;17:29;18:20;8;55;;15:52;01:13;1;;1,202,058;OSO;2,393,265;WSW;12:52;177,403;3,13
14.11.2021;Sonntag;45;318;2459533;1;08:32;17:10;07:53;17:50;07:09;18:33;06:28;19:14;07:24;08:15;08:47;11:15;14:26;16:56;17:27;18:19;9;62;;16:03;02:32;1;Volkstrauertag ;1,207,114;OSO;2,387,561;WSW;12:52;174,848;3,17
15.11.2021;Montag;46;319;2459534;1;08:34;17:09;07:54;17:48;07:11;18:32;06:30;19:13;07:25;08:17;08:49;11:19;14:22;16:54;17:26;18:17;10;69;;16:14;03:47;1;;1,212,108;OSO;2,383,868;WSW;12:52;172,347;3,22
16.11.2021;Dienstag;46;320;2459535;1;08:36;17:07;07:56;17:47;07:13;18:30;06:31;19:12;07:27;08:19;08:50;11:24;14:17;16:52;17:24;18:16;11;76;;16:24;05:01;1;;1,217,039;OSO;2,378,176;WSW;12:52;169,901;3,27
17.11.2021;Mittwoch;46;321;2459536;1;08:37;17:06;07:58;17:46;07:14;18:29;06:33;19:11;07:28;08:20;08:52;11:29;14:13;16:51;17:23;18:15;12;83;;16:36;06:15;1;Buss- und Bettag ;1,219,902;OSO;2,374,497;WSW;12:52;167,513;3,32
18.11.2021;Donnerstag;46;322;2459537;1;08:39;17:04;07:59;17:44;07:16;18:28;06:34;19:10;07:30;08:22;08:54;11:34;14:08;16:49;17:22;18:14;13;90;;16:49;07:28;1;;1,224,707;OSO;236,882;WSW;12:53;165,183;3,37
19.11.2021;Freitag;46;323;2459538;1;08:41;17:03;08:01;17:43;07:17;18:27;06:36;19:09;07:32;08:24;08:56;11:39;14:03;16:48;17:20;18:13;14;100;;17:06;08:43;1;;1,229,449;OSO;2,365,156;WSW;12:53;162,912;3,42
20.11.2021;Samstag;46;324;2459539;1;08:43;17:02;08:03;17:42;07:19;18:26;06:37;19:08;07:33;08:26;08:58;11:44;13:58;16:46;17:19;18:11;15;100;Vollmond;17:28;09:55;1;Weltkindertag UNESCO ;1,234,128;OSO;2,361,501;SW;12:53;16,07;3,47
21.11.2021;Sonntag;46;325;2459540;1;08:45;17:00;08:04;17:41;07:20;18:25;06:39;19:07;07:35;08:27;09:00;11:50;13:53;16:45;17:18;18:10;16;90;;17:59;11:04;1;Totensonntag ;1,238,744;SO;235,585;SW;12:53;158,548;3,52
22.11.2021;Montag;47;326;2459541;1;08:47;16:59;08:06;17:40;07:22;18:24;06:40;19:06;07:36;08:29;09:02;11:56;13:47;16:44;17:17;18:09;17;83;;18:41;12:06;1;;1,243,297;SO;2,352,214;SW;12:54;15,646;3,57
23.11.2021;Dienstag;47;327;2459542;1;08:48;16:58;08:08;17:39;07:23;18:23;06:41;19:05;07:38;08:31;09:04;12:03;13:41;16:42;17:15;18:08;18;76;;19:35;12:56;1;;1,245,784;SO;2,348,589;SW;12:54;154,434;3,62
24.11.2021;Mittwoch;47;328;2459543;1;08:50;16:57;08:09;17:38;07:25;18:22;06:43;19:04;07:39;08:33;09:06;12:10;13:33;16:41;17:14;18:08;19;69;;20:41;13:35;1;;1,250,212;SO;2,344,975;SW;12:54;152,472;3,67
25.11.2021;Donnerstag;47;329;2459544;1;08:52;16:56;08:11;17:37;07:26;18:21;06:44;19:03;07:41;08:34;09:07;12:19;13:25;16:40;17:13;18:07;20;62;;21:54;14:03;1;;1,254,578;SO;2,341,372;SW;12:55;150,575;3,72
26.11.2021;Freitag;47;330;2459545;1;08:54;16:54;08:12;17:36;07:28;18:20;06:46;19:03;07:42;08:36;09:09;12:29;13:12;16:39;17:12;18:06;21;55;;23:12;14:24;1;Black Friday ;1,258,882;SO;2,335,778;SW;12:55;148,743;3,77
27.11.2021;Samstag;47;331;2459546;1;08:55;16:53;08:14;17:35;07:29;18:20;06:47;19:02;07:44;08:37;09:11;12:50;00:00;16:38;17:11;18:05;22;48;;00:31;14:41;1;Kauf-nix-Tag ;1,261,122;SO;2,332,201;SW;12:55;146,978;3,81
28.11.2021;Sonntag;47;332;2459547;1;08:57;16:53;08:15;17:34;07:31;18:19;06:48;19:01;07:45;08:39;09:13;00:00;00:00;16:37;17:10;18:04;23;41;;01:00;14:54;1;1. Advent ;1,265,304;SO;2,330,644;SW;12:56;14,528;3,86
29.11.2021;Montag;48;333;2459548;1;08:58;16:52;08:17;17:33;07:32;18:18;06:50;19:01;07:47;08:41;09:14;00:00;00:00;16:36;17:10;18:04;24;34;;01:52;15:06;1;;1,267,422;SO;2,327,096;SW;12:56;143,651;3,9
30.11.2021;Dienstag;48;334;2459549;1;09:00;16:51;08:18;17:33;07:33;18:18;06:51;19:00;07:48;08:42;09:16;00:00;00:00;16:35;17:09;18:03;25;28;;03:15;15:18;1;;1,271,484;SO;2,323,564;SW;12:56;14,209;3,95
01.12.2021;Mittwoch;48;335;2459550;1;09:02;16:50;08:20;17:32;07:35;18:17;06:52;19:00;07:49;08:43;09:18;00:00;00:00;16:34;17:08;18:02;27;14;;04:43;15:32;1;Welt-AIDS-Tag ;1,275,466;SO;2,319,392;SW;12:57;13,997;4,01
02.12.2021;Donnerstag;48;336;2459551;1;09:03;16:49;08:21;17:31;07:36;18:17;06:53;18:59;07:51;08:45;09:19;00:00;00:00;16:33;17:07;18:02;28;7;;06:14;15:49;1;;1,277,383;SO;2,315,901;SW;12:57;138,581;4,05
03.12.2021;Freitag;48;337;2459552;1;09:05;16:49;08:22;17:31;07:37;18:16;06:54;18:59;07:52;08:46;09:21;00:00;00:00;16:32;17:07;18:01;29;0;;07:49;16:11;1;;1,281,243;SO;2,314,434;SW;12:58;137,264;4,09
04.12.2021;Samstag;48;338;2459553;1;09:06;16:48;08:24;17:30;07:38;18:16;06:56;18:59;07:53;08:48;09:22;00:00;00:00;16:32;17:06;18:01;0;0;Neumond;09:25;16:44;1;;1,283,045;SO;2,310,981;SW;12:58;136,019;4,13
05.12.2021;Sonntag;48;339;2459554;1;09:07;16:47;08:25;17:30;07:40;18:15;06:57;18:58;07:54;08:49;09:24;00:00;00:00;16:31;17:06;18:01;1;7;;10:53;17:32;1;2. Advent ;1,284,791;SO;2,307,547;SW;12:59;134,848;4,17
06.12.2021;Montag;49;340;2459555;1;09:09;16:47;08:26;17:30;07:41;18:15;06:58;18:58;07:55;08:50;09:25;00:00;00:00;16:30;17:05;18:00;2;14;;12:03;18:40;1;Nikolaus ;1,288,483;SO;2,306,141;SW;12:59;13,375;4,21
07.12.2021;Dienstag;49;341;2459556;1;09:10;16:46;08:27;17:29;07:42;18:15;06:59;18:58;07:57;08:52;09:27;00:00;00:00;16:30;17:05;18:00;3;21;;12:51;20:03;1;;1,290,119;SO;230,275;SW;12:59;132,725;4,24
08.12.2021;Mittwoch;49;342;2459557;1;09:11;16:46;08:28;17:29;07:43;18:15;07:00;18:58;07:58;08:53;09:28;00:00;00:00;16:29;17:05;18:00;4;28;;13:23;21:30;1;Mariae Empfaengnis ;1,291,703;SO;2,301,389;SW;13:00;131,777;4,27
09.12.2021;Donnerstag;49;343;2459558;1;09:13;16:46;08:30;17:29;07:44;18:15;07:01;18:57;07:59;08:54;09:29;00:00;00:00;16:29;17:04;18:00;5;34;;13:44;22:57;1;;1,295,235;SO;2,300,051;SW;13:00;130,902;4,3
10.12.2021;Freitag;49;344;2459559;1;09:14;16:45;08:31;17:29;07:45;18:14;07:02;18:57;08:00;08:55;09:31;00:00;00:00;16:29;17:04;18:00;6;41;;14:00;00:19;1;Welttag der Menschenrechte ;1,296,714;SO;2,296,732;SW;13:01;130,105;4,33
11.12.2021;Samstag;49;345;2459560;1;09:15;16:45;08:32;17:29;07:46;18:14;07:03;18:57;08:01;08:56;09:32;00:00;00:00;16:29;17:04;17:59;7;48;;14:12;01:00;1;;1,298,142;SO;2,295,446;SW;13:01;129,383;4,35
12.12.2021;Sonntag;49;346;2459561;1;09:16;16:45;08:33;17:28;07:47;18:14;07:04;18:57;08:02;08:57;09:33;00:00;00:00;16:28;17:04;17:59;8;55;;14:23;01:36;1;3. Advent ;1,299,522;SO;2,294,187;SW;13:02;128,738;4,38
13.12.2021;Montag;50;347;2459562;1;09:17;16:45;08:34;17:28;07:48;18:14;07:05;18:58;08:03;08:58;09:34;00:00;00:00;16:28;17:04;18:00;9;62;;14:34;02:51;1;;1,300,853;SO;2,292,956;SW;13:02;12,817;4,4
14.12.2021;Dienstag;50;348;2459563;1;09:18;16:45;08:35;17:29;07:49;18:15;07:05;18:58;08:04;08:59;09:35;00:00;00:00;16:28;17:04;18:00;10;69;;14:45;04:04;1;;1,302,136;SO;2,291,754;SW;13:03;12,768;4,41
15.12.2021;Mittwoch;50;349;2459564;1;09:19;16:45;08:35;17:29;07:49;18:15;07:06;18:58;08:04;09:00;09:36;00:00;00:00;16:28;17:04;18:00;11;76;;14:57;05:17;1;;1,303,374;SO;2,290,582;SW;13:03;127,266;4,43
16.12.2021;Donnerstag;50;350;2459565;1;09:20;16:45;08:36;17:29;07:50;18:15;07:07;18:58;08:05;09:01;09:37;00:00;00:00;16:28;17:04;18:00;12;83;;15:12;06:31;1;;1,304,567;SO;2,289,442;SW;13:04;126,931;4,44
17.12.2021;Freitag;50;351;2459566;1;09:21;16:45;08:37;17:29;07:51;18:15;07:08;18:58;08:06;09:02;09:38;00:00;00:00;16:28;17:04;18:00;13;90;;15:33;07:44;1;;1,305,715;SO;2,288,334;SW;13:04;126,674;4,45
18.12.2021;Samstag;50;352;2459567;1;09:22;16:46;08:38;17:29;07:52;18:15;07:08;18:59;08:07;09:03;09:38;00:00;00:00;16:29;17:05;18:00;14;100;;16:01;08:55;1;;1,306,821;SO;2,289,267;SW;13:05;126,496;4,46
19.12.2021;Sonntag;50;353;2459568;1;09:22;16:46;08:38;17:30;07:52;18:16;07:09;18:59;08:07;09:03;09:39;00:00;00:00;16:29;17:05;18:01;15;100;Vollmond;16:39;09:59;1;4. Advent ;1,305,883;SO;2,288,228;SW;13:05;126,395;4,46
20.12.2021;Montag;51;354;2459569;1;09:23;16:46;08:39;17:30;07:53;18:16;07:10;18:59;08:08;09:04;09:40;00:00;00:00;16:29;17:05;18:01;16;90;;17:29;10:54;1;Internationaler Tag der menschlichen Solidaritaet UNO ;1,306,907;SO;2,287,225;SW;13:06;126,373;4,46
21.12.2021;Dienstag;51;355;2459570;1;09:23;16:47;08:40;17:31;07:54;18:17;07:10;19:00;08:08;09:04;09:40;00:00;00:00;16:30;17:06;18:02;17;83;;18:32;11:35;1;Winteranfang ;1,305,888;SO;2,288,267;SW;13:06;126,429;4,46
22.12.2021;Mittwoch;51;356;2459571;1;09:24;16:47;08:40;17:31;07:54;18:17;07:11;19:00;08:09;09:05;09:41;00:00;00:00;16:30;17:06;18:02;18;76;;19:43;12:07;1;;1,306,834;SO;2,287,338;SW;13:07;126,565;4,45
23.12.2021;Donnerstag;51;357;2459572;1;09:24;16:48;08:41;17:32;07:54;18:18;07:11;19:01;08:09;09:05;09:41;00:00;00:00;16:31;17:07;18:03;19;69;;20:59;12:30;1;;1,305,741;SO;2,288,458;SW;13:07;126,778;4,45
24.12.2021;Freitag;51;358;2459573;1;09:25;16:48;08:41;17:32;07:55;18:18;07:12;19:02;08:10;09:06;09:42;00:00;00:00;16:31;17:07;18:03;20;62;;22:17;12:47;0;Heiliger Abend ;1,306,614;SO;228,761;SW;13:08;127,071;4,43
25.12.2021;Samstag;51;359;2459574;1;09:25;16:49;08:41;17:33;07:55;18:19;07:12;19:02;08:10;09:06;09:42;00:00;00:00;16:32;17:08;18:04;21;55;;23:35;13:01;0;1. Weihnachtstag ;1,305,449;SO;2,288,812;SW;13:08;127,441;4,42
26.12.2021;Sonntag;51;360;2459575;1;09:25;16:50;08:42;17:34;07:56;18:20;07:12;19:03;08:11;09:07;09:42;00:00;00:00;16:33;17:09;18:05;22;48;;00:55;13:13;0;2. Weihnachtstag ;1,304,251;SO;2,290,057;SW;13:09;12,789;4,41
27.12.2021;Montag;52;361;2459576;1;09:26;16:51;08:42;17:34;07:56;18:20;07:13;19:04;08:11;09:07;09:43;00:00;00:00;16:34;17:10;18:05;23;41;;01:00;13:25;1;;1,305,024;SO;2,291,347;SW;13:09;128,416;4,39
28.12.2021;Dienstag;52;362;2459577;1;09:26;16:52;08:42;17:35;07:56;18:21;07:13;19:04;08:11;09:07;09:43;00:00;00:00;16:35;17:10;18:06;24;34;;02:17;13:37;1;;1,303,762;SO;2,292,681;SW;13:10;12,902;4,37
29.12.2021;Mittwoch;52;363;2459578;1;09:26;16:52;08:42;17:36;07:56;18:22;07:13;19:05;08:11;09:07;09:43;00:00;00:00;16:36;17:11;18:07;25;28;;03:42;13:51;1;;1,302,469;SO;2,292,052;SW;13:10;129,701;4,34
30.12.2021;Donnerstag;52;364;2459579;1;09:26;16:53;08:42;17:37;07:56;18:23;07:13;19:06;08:11;09:07;09:43;00:00;00:00;16:37;17:12;18:08;26;21;;05:12;14:10;1;;1,301,147;SO;229,348;SW;13:11;13,046;4,32
31.12.2021;Freitag;52;365;2459580;1;09:26;16:54;08:42;17:38;07:57;18:24;07:13;19:07;08:11;09:07;09:43;00:00;00:00;16:38;17:13;18:09;27;14;;06:47;14:36;0;Silvester ;1,299,797;SO;2,294,957;SW;13:11;131,295;4,29
