﻿Year;Month;Market period start;Market period stop;AuctionId;Border;TimeTable;OfferedCapacity (MW);Return (MW);ATC (MW);Total requested capacity (MW);Price;Total allocated capacity (MW);Number of participants;Awarded participants
2021;Aug;01.08.2021;02.08.2021;BDL-NL-GB-D-DAILY--210801-01;BDL-NL-GB;00:00;112;0;112;704;48.82;112;11;4
2021;Aug;01.08.2021;02.08.2021;BDL-NL-GB-D-DAILY--210801-01;BDL-NL-GB;01:00;112;0;112;704;40.93;112;11;4
2021;Aug;01.08.2021;02.08.2021;BDL-NL-GB-D-DAILY--210801-01;BDL-NL-GB;02:00;112;0;112;704;38.14;112;11;4
2021;Aug;01.08.2021;02.08.2021;BDL-NL-GB-D-DAILY--210801-01;BDL-NL-GB;03:00;112;0;112;712;38.6;112;11;4
2021;Aug;01.08.2021;02.08.2021;BDL-NL-GB-D-DAILY--210801-01;BDL-NL-GB;04:00;112;0;112;712;35.95;112;11;4
2021;Aug;01.08.2021;02.08.2021;BDL-NL-GB-D-DAILY--210801-01;BDL-NL-GB;05:00;112;0;112;750;38.54;112;11;5
2021;Aug;01.08.2021;02.08.2021;BDL-NL-GB-D-DAILY--210801-01;BDL-NL-GB;06:00;112;0;112;750;36.41;112;11;6
2021;Aug;01.08.2021;02.08.2021;BDL-NL-GB-D-DAILY--210801-01;BDL-NL-GB;07:00;112;0;112;750;37.1;112;11;6
2021;Aug;01.08.2021;02.08.2021;BDL-NL-GB-D-DAILY--210801-01;BDL-NL-GB;08:00;112;0;112;750;25.97;112;11;7
2021;Aug;01.08.2021;02.08.2021;BDL-NL-GB-D-DAILY--210801-01;BDL-NL-GB;09:00;112;0;112;750;37.96;112;11;6
2021;Aug;01.08.2021;02.08.2021;BDL-NL-GB-D-DAILY--210801-01;BDL-NL-GB;10:00;112;0;112;750;47.96;112;11;7
2021;Aug;01.08.2021;02.08.2021;BDL-NL-GB-D-DAILY--210801-01;BDL-NL-GB;11:00;112;0;112;750;60.08;112;11;5
2021;Aug;01.08.2021;02.08.2021;BDL-NL-GB-D-DAILY--210801-01;BDL-NL-GB;12:00;112;0;112;750;68.07;112;11;4
2021;Aug;01.08.2021;02.08.2021;BDL-NL-GB-D-DAILY--210801-01;BDL-NL-GB;13:00;112;0;112;750;71.99;112;11;4
2021;Aug;01.08.2021;02.08.2021;BDL-NL-GB-D-DAILY--210801-01;BDL-NL-GB;14:00;112;0;112;750;61.32;112;11;4
2021;Aug;01.08.2021;02.08.2021;BDL-NL-GB-D-DAILY--210801-01;BDL-NL-GB;15:00;112;0;112;750;61.88;112;11;4
2021;Aug;01.08.2021;02.08.2021;BDL-NL-GB-D-DAILY--210801-01;BDL-NL-GB;16:00;112;0;112;750;58.16;112;11;4
2021;Aug;01.08.2021;02.08.2021;BDL-NL-GB-D-DAILY--210801-01;BDL-NL-GB;17:00;112;0;112;750;50.39;112;11;5
2021;Aug;01.08.2021;02.08.2021;BDL-NL-GB-D-DAILY--210801-01;BDL-NL-GB;18:00;112;0;112;750;55.56;112;11;4
2021;Aug;01.08.2021;02.08.2021;BDL-NL-GB-D-DAILY--210801-01;BDL-NL-GB;19:00;112;0;112;704;53.97;112;11;6
2021;Aug;01.08.2021;02.08.2021;BDL-NL-GB-D-DAILY--210801-01;BDL-NL-GB;20:00;112;0;112;688;49.38;112;11;5
2021;Aug;01.08.2021;02.08.2021;BDL-NL-GB-D-DAILY--210801-01;BDL-NL-GB;21:00;112;0;112;704;42.53;112;11;6
2021;Aug;01.08.2021;02.08.2021;BDL-NL-GB-D-DAILY--210801-01;BDL-NL-GB;22:00;112;0;112;704;42.92;112;11;6
2021;Aug;01.08.2021;02.08.2021;BDL-NL-GB-D-DAILY--210801-01;BDL-NL-GB;23:00;112;0;112;704;22.23;112;11;5
2021;Aug;02.08.2021;03.08.2021;BDL-NL-GB-D-DAILY--210802-01;BDL-NL-GB;00:00;137;0;137;663;26.12;137;11;5
2021;Aug;02.08.2021;03.08.2021;BDL-NL-GB-D-DAILY--210802-01;BDL-NL-GB;01:00;137;0;137;728;29.97;137;11;6
2021;Aug;02.08.2021;03.08.2021;BDL-NL-GB-D-DAILY--210802-01;BDL-NL-GB;02:00;137;0;137;728;28.88;137;11;5
2021;Aug;02.08.2021;03.08.2021;BDL-NL-GB-D-DAILY--210802-01;BDL-NL-GB;03:00;137;0;137;718;24.22;137;11;5
2021;Aug;02.08.2021;03.08.2021;BDL-NL-GB-D-DAILY--210802-01;BDL-NL-GB;04:00;137;0;137;718;18.55;137;11;5
2021;Aug;02.08.2021;03.08.2021;BDL-NL-GB-D-DAILY--210802-01;BDL-NL-GB;05:00;137;0;137;739;17.03;137;11;5
2021;Aug;02.08.2021;03.08.2021;BDL-NL-GB-D-DAILY--210802-01;BDL-NL-GB;06:00;137;0;137;703;10.02;137;11;5
2021;Aug;02.08.2021;03.08.2021;BDL-NL-GB-D-DAILY--210802-01;BDL-NL-GB;07:00;137;0;137;687;4.15;137;11;4
2021;Aug;02.08.2021;03.08.2021;BDL-NL-GB-D-DAILY--210802-01;BDL-NL-GB;08:00;137;0;137;737;16.89;137;11;4
2021;Aug;02.08.2021;03.08.2021;BDL-NL-GB-D-DAILY--210802-01;BDL-NL-GB;09:00;137;0;137;655;46.51;137;11;4
2021;Aug;02.08.2021;03.08.2021;BDL-NL-GB-D-DAILY--210802-01;BDL-NL-GB;10:00;137;0;137;773;56.96;137;11;5
2021;Aug;02.08.2021;03.08.2021;BDL-NL-GB-D-DAILY--210802-01;BDL-NL-GB;11:00;137;0;137;789;55.55;137;11;6
2021;Aug;02.08.2021;03.08.2021;BDL-NL-GB-D-DAILY--210802-01;BDL-NL-GB;12:00;137;0;137;789;60.51;137;11;6
2021;Aug;02.08.2021;03.08.2021;BDL-NL-GB-D-DAILY--210802-01;BDL-NL-GB;13:00;137;0;137;789;64;137;11;6
2021;Aug;02.08.2021;03.08.2021;BDL-NL-GB-D-DAILY--210802-01;BDL-NL-GB;14:00;137;0;137;789;55.94;137;11;5
2021;Aug;02.08.2021;03.08.2021;BDL-NL-GB-D-DAILY--210802-01;BDL-NL-GB;15:00;137;0;137;789;48.12;137;11;5
2021;Aug;02.08.2021;03.08.2021;BDL-NL-GB-D-DAILY--210802-01;BDL-NL-GB;16:00;137;0;137;789;48.03;137;11;5
2021;Aug;02.08.2021;03.08.2021;BDL-NL-GB-D-DAILY--210802-01;BDL-NL-GB;17:00;137;0;137;749;54.21;137;11;5
2021;Aug;02.08.2021;03.08.2021;BDL-NL-GB-D-DAILY--210802-01;BDL-NL-GB;18:00;137;0;137;733;67.94;137;11;6
2021;Aug;02.08.2021;03.08.2021;BDL-NL-GB-D-DAILY--210802-01;BDL-NL-GB;19:00;137;0;137;733;64.81;137;11;5
2021;Aug;02.08.2021;03.08.2021;BDL-NL-GB-D-DAILY--210802-01;BDL-NL-GB;20:00;137;0;137;733;43.08;137;11;5
2021;Aug;02.08.2021;03.08.2021;BDL-NL-GB-D-DAILY--210802-01;BDL-NL-GB;21:00;137;0;137;733;34.46;137;11;5
2021;Aug;02.08.2021;03.08.2021;BDL-NL-GB-D-DAILY--210802-01;BDL-NL-GB;22:00;137;0;137;712;25.14;137;11;6
2021;Aug;02.08.2021;03.08.2021;BDL-NL-GB-D-DAILY--210802-01;BDL-NL-GB;23:00;137;0;137;712;9.5;137;11;6
2021;Aug;03.08.2021;04.08.2021;BDL-NL-GB-D-DAILY--210803-01;BDL-NL-GB;00:00;137;0;137;917;35.1;137;11;7
2021;Aug;03.08.2021;04.08.2021;BDL-NL-GB-D-DAILY--210803-01;BDL-NL-GB;01:00;137;0;137;917;29.3;137;11;6
2021;Aug;03.08.2021;04.08.2021;BDL-NL-GB-D-DAILY--210803-01;BDL-NL-GB;02:00;137;0;137;917;28.39;137;11;7
2021;Aug;03.08.2021;04.08.2021;BDL-NL-GB-D-DAILY--210803-01;BDL-NL-GB;03:00;137;0;137;917;26.95;137;11;6
2021;Aug;03.08.2021;04.08.2021;BDL-NL-GB-D-DAILY--210803-01;BDL-NL-GB;04:00;137;0;137;917;24.48;137;11;6
2021;Aug;03.08.2021;04.08.2021;BDL-NL-GB-D-DAILY--210803-01;BDL-NL-GB;05:00;137;0;137;901;17.8;137;11;6
2021;Aug;03.08.2021;04.08.2021;BDL-NL-GB-D-DAILY--210803-01;BDL-NL-GB;06:00;137;0;137;901;4.68;137;11;4
2021;Aug;03.08.2021;04.08.2021;BDL-NL-GB-D-DAILY--210803-01;BDL-NL-GB;07:00;137;0;137;865;3.64;137;11;4
2021;Aug;03.08.2021;04.08.2021;BDL-NL-GB-D-DAILY--210803-01;BDL-NL-GB;08:00;137;0;137;901;11.86;137;11;4
2021;Aug;03.08.2021;04.08.2021;BDL-NL-GB-D-DAILY--210803-01;BDL-NL-GB;09:00;137;0;137;901;38.38;137;11;6
2021;Aug;03.08.2021;04.08.2021;BDL-NL-GB-D-DAILY--210803-01;BDL-NL-GB;10:00;137;0;137;917;50.62;137;11;7
2021;Aug;03.08.2021;04.08.2021;BDL-NL-GB-D-DAILY--210803-01;BDL-NL-GB;11:00;137;0;137;917;44.96;137;11;6
2021;Aug;03.08.2021;04.08.2021;BDL-NL-GB-D-DAILY--210803-01;BDL-NL-GB;12:00;137;0;137;917;47.57;137;11;6
2021;Aug;03.08.2021;04.08.2021;BDL-NL-GB-D-DAILY--210803-01;BDL-NL-GB;13:00;137;0;137;917;56.65;137;11;5
2021;Aug;03.08.2021;04.08.2021;BDL-NL-GB-D-DAILY--210803-01;BDL-NL-GB;14:00;137;0;137;917;41.6;137;11;5
2021;Aug;03.08.2021;04.08.2021;BDL-NL-GB-D-DAILY--210803-01;BDL-NL-GB;15:00;137;0;137;917;25.91;137;11;5
2021;Aug;03.08.2021;04.08.2021;BDL-NL-GB-D-DAILY--210803-01;BDL-NL-GB;16:00;137;0;137;917;34.47;137;11;6
2021;Aug;03.08.2021;04.08.2021;BDL-NL-GB-D-DAILY--210803-01;BDL-NL-GB;17:00;137;0;137;917;56.3;137;11;6
2021;Aug;03.08.2021;04.08.2021;BDL-NL-GB-D-DAILY--210803-01;BDL-NL-GB;18:00;137;0;137;917;72;137;11;6
2021;Aug;03.08.2021;04.08.2021;BDL-NL-GB-D-DAILY--210803-01;BDL-NL-GB;19:00;137;0;137;901;74.8;137;11;6
2021;Aug;03.08.2021;04.08.2021;BDL-NL-GB-D-DAILY--210803-01;BDL-NL-GB;20:00;137;0;137;908;60.69;137;11;5
2021;Aug;03.08.2021;04.08.2021;BDL-NL-GB-D-DAILY--210803-01;BDL-NL-GB;21:00;137;0;137;901;31.98;137;11;6
2021;Aug;03.08.2021;04.08.2021;BDL-NL-GB-D-DAILY--210803-01;BDL-NL-GB;22:00;137;0;137;917;41.29;137;11;5
2021;Aug;03.08.2021;04.08.2021;BDL-NL-GB-D-DAILY--210803-01;BDL-NL-GB;23:00;137;0;137;917;20.77;137;11;7
2021;Aug;04.08.2021;05.08.2021;BDL-NL-GB-D-DAILY--210804-01;BDL-NL-GB;00:00;157;0;157;1136;36.73;157;12;6
2021;Aug;04.08.2021;05.08.2021;BDL-NL-GB-D-DAILY--210804-01;BDL-NL-GB;01:00;157;0;157;1136;31.02;157;12;6
2021;Aug;04.08.2021;05.08.2021;BDL-NL-GB-D-DAILY--210804-01;BDL-NL-GB;02:00;157;0;157;1136;29.6;157;12;6
2021;Aug;04.08.2021;05.08.2021;BDL-NL-GB-D-DAILY--210804-01;BDL-NL-GB;03:00;157;0;157;1136;26.95;157;12;6
2021;Aug;04.08.2021;05.08.2021;BDL-NL-GB-D-DAILY--210804-01;BDL-NL-GB;04:00;157;0;157;1136;26.1;157;12;5
2021;Aug;04.08.2021;05.08.2021;BDL-NL-GB-D-DAILY--210804-01;BDL-NL-GB;05:00;157;0;157;1136;20.4;157;12;5
2021;Aug;04.08.2021;05.08.2021;BDL-NL-GB-D-DAILY--210804-01;BDL-NL-GB;06:00;157;0;157;1063;0.69;157;12;5
2021;Aug;04.08.2021;05.08.2021;BDL-NL-GB-D-DAILY--210804-01;BDL-NL-GB;07:00;157;0;157;1055;0.37;156;12;4
2021;Aug;04.08.2021;05.08.2021;BDL-NL-GB-D-DAILY--210804-01;BDL-NL-GB;08:00;157;0;157;1066;4.54;157;12;2
2021;Aug;04.08.2021;05.08.2021;BDL-NL-GB-D-DAILY--210804-01;BDL-NL-GB;09:00;157;0;157;1120;32.86;157;12;5
2021;Aug;04.08.2021;05.08.2021;BDL-NL-GB-D-DAILY--210804-01;BDL-NL-GB;10:00;157;0;157;1120;43.35;157;12;6
2021;Aug;04.08.2021;05.08.2021;BDL-NL-GB-D-DAILY--210804-01;BDL-NL-GB;11:00;157;0;157;1120;35;157;12;4
2021;Aug;04.08.2021;05.08.2021;BDL-NL-GB-D-DAILY--210804-01;BDL-NL-GB;12:00;157;0;157;1136;29.3;157;12;6
2021;Aug;04.08.2021;05.08.2021;BDL-NL-GB-D-DAILY--210804-01;BDL-NL-GB;13:00;157;0;157;1085;28.04;157;12;7
2021;Aug;04.08.2021;05.08.2021;BDL-NL-GB-D-DAILY--210804-01;BDL-NL-GB;14:00;157;0;157;1136;19.15;157;12;7
2021;Aug;04.08.2021;05.08.2021;BDL-NL-GB-D-DAILY--210804-01;BDL-NL-GB;15:00;157;0;157;1136;14.72;157;12;7
2021;Aug;04.08.2021;05.08.2021;BDL-NL-GB-D-DAILY--210804-01;BDL-NL-GB;16:00;157;0;157;1136;16.61;157;12;5
2021;Aug;04.08.2021;05.08.2021;BDL-NL-GB-D-DAILY--210804-01;BDL-NL-GB;17:00;157;0;157;1136;31.71;157;12;5
2021;Aug;04.08.2021;05.08.2021;BDL-NL-GB-D-DAILY--210804-01;BDL-NL-GB;18:00;157;0;157;1136;30.28;157;12;9
2021;Aug;04.08.2021;05.08.2021;BDL-NL-GB-D-DAILY--210804-01;BDL-NL-GB;19:00;157;0;157;1120;32.1;157;12;5
2021;Aug;04.08.2021;05.08.2021;BDL-NL-GB-D-DAILY--210804-01;BDL-NL-GB;20:00;157;0;157;1120;28.72;157;12;6
2021;Aug;04.08.2021;05.08.2021;BDL-NL-GB-D-DAILY--210804-01;BDL-NL-GB;21:00;157;0;157;1120;26.06;157;12;5
2021;Aug;04.08.2021;05.08.2021;BDL-NL-GB-D-DAILY--210804-01;BDL-NL-GB;22:00;157;0;157;1120;27.08;157;12;5
2021;Aug;04.08.2021;05.08.2021;BDL-NL-GB-D-DAILY--210804-01;BDL-NL-GB;23:00;157;0;157;1001;13.12;157;12;5
2021;Aug;05.08.2021;06.08.2021;BDL-NL-GB-D-DAILY--210805-01;BDL-NL-GB;00:00;157;0;157;1103;38.28;157;12;7
2021;Aug;05.08.2021;06.08.2021;BDL-NL-GB-D-DAILY--210805-01;BDL-NL-GB;01:00;157;0;157;1103;31.93;157;12;5
2021;Aug;05.08.2021;06.08.2021;BDL-NL-GB-D-DAILY--210805-01;BDL-NL-GB;02:00;157;0;157;1103;32.03;157;12;6
2021;Aug;05.08.2021;06.08.2021;BDL-NL-GB-D-DAILY--210805-01;BDL-NL-GB;03:00;157;0;157;1103;28.42;157;12;6
2021;Aug;05.08.2021;06.08.2021;BDL-NL-GB-D-DAILY--210805-01;BDL-NL-GB;04:00;157;0;157;1090;20.18;157;12;6
2021;Aug;05.08.2021;06.08.2021;BDL-NL-GB-D-DAILY--210805-01;BDL-NL-GB;05:00;157;0;157;1090;13.14;157;12;7
2021;Aug;05.08.2021;06.08.2021;BDL-NL-GB-D-DAILY--210805-01;BDL-NL-GB;06:00;157;0;157;909;1.04;157;12;6
2021;Aug;05.08.2021;06.08.2021;BDL-NL-GB-D-DAILY--210805-01;BDL-NL-GB;07:00;157;0;157;952;2.28;157;12;5
2021;Aug;05.08.2021;06.08.2021;BDL-NL-GB-D-DAILY--210805-01;BDL-NL-GB;08:00;157;0;157;1100;2.64;157;12;5
2021;Aug;05.08.2021;06.08.2021;BDL-NL-GB-D-DAILY--210805-01;BDL-NL-GB;09:00;157;0;157;1087;32.99;157;12;5
2021;Aug;05.08.2021;06.08.2021;BDL-NL-GB-D-DAILY--210805-01;BDL-NL-GB;10:00;157;0;157;1103;43.06;157;12;6
2021;Aug;05.08.2021;06.08.2021;BDL-NL-GB-D-DAILY--210805-01;BDL-NL-GB;11:00;157;0;157;1103;29.91;157;12;7
2021;Aug;05.08.2021;06.08.2021;BDL-NL-GB-D-DAILY--210805-01;BDL-NL-GB;12:00;157;0;157;1103;23.74;157;12;7
2021;Aug;05.08.2021;06.08.2021;BDL-NL-GB-D-DAILY--210805-01;BDL-NL-GB;13:00;157;0;157;1103;27.54;157;12;7
2021;Aug;05.08.2021;06.08.2021;BDL-NL-GB-D-DAILY--210805-01;BDL-NL-GB;14:00;157;0;157;1103;18.42;157;12;5
2021;Aug;05.08.2021;06.08.2021;BDL-NL-GB-D-DAILY--210805-01;BDL-NL-GB;15:00;157;0;157;1103;15.22;157;12;5
2021;Aug;05.08.2021;06.08.2021;BDL-NL-GB-D-DAILY--210805-01;BDL-NL-GB;16:00;157;0;157;1018;20.47;157;12;3
2021;Aug;05.08.2021;06.08.2021;BDL-NL-GB-D-DAILY--210805-01;BDL-NL-GB;17:00;157;0;157;1007;13;157;12;5
2021;Aug;05.08.2021;06.08.2021;BDL-NL-GB-D-DAILY--210805-01;BDL-NL-GB;18:00;157;0;157;1087;30;157;12;3
2021;Aug;05.08.2021;06.08.2021;BDL-NL-GB-D-DAILY--210805-01;BDL-NL-GB;19:00;157;0;157;1071;20.42;157;12;5
2021;Aug;05.08.2021;06.08.2021;BDL-NL-GB-D-DAILY--210805-01;BDL-NL-GB;20:00;157;0;157;1071;15.11;157;12;5
2021;Aug;05.08.2021;06.08.2021;BDL-NL-GB-D-DAILY--210805-01;BDL-NL-GB;21:00;157;0;157;1071;14.02;157;12;5
2021;Aug;05.08.2021;06.08.2021;BDL-NL-GB-D-DAILY--210805-01;BDL-NL-GB;22:00;157;0;157;1087;15.54;157;12;5
2021;Aug;05.08.2021;06.08.2021;BDL-NL-GB-D-DAILY--210805-01;BDL-NL-GB;23:00;157;0;157;1103;14.87;157;12;6
2021;Aug;06.08.2021;07.08.2021;BDL-NL-GB-D-DAILY--210806-01;BDL-NL-GB;00:00;157;0;157;1086;31.5;157;12;5
2021;Aug;06.08.2021;07.08.2021;BDL-NL-GB-D-DAILY--210806-01;BDL-NL-GB;01:00;157;0;157;983;29.47;157;12;6
2021;Aug;06.08.2021;07.08.2021;BDL-NL-GB-D-DAILY--210806-01;BDL-NL-GB;02:00;157;0;157;983;23.74;157;12;6
2021;Aug;06.08.2021;07.08.2021;BDL-NL-GB-D-DAILY--210806-01;BDL-NL-GB;03:00;157;0;157;961;21.3;157;12;6
2021;Aug;06.08.2021;07.08.2021;BDL-NL-GB-D-DAILY--210806-01;BDL-NL-GB;04:00;157;0;157;961;17.62;157;12;5
2021;Aug;06.08.2021;07.08.2021;BDL-NL-GB-D-DAILY--210806-01;BDL-NL-GB;05:00;157;0;157;945;12.62;157;12;6
2021;Aug;06.08.2021;07.08.2021;BDL-NL-GB-D-DAILY--210806-01;BDL-NL-GB;06:00;157;0;157;1064;11.83;157;12;3
2021;Aug;06.08.2021;07.08.2021;BDL-NL-GB-D-DAILY--210806-01;BDL-NL-GB;07:00;157;0;157;1064;15.92;157;12;4
2021;Aug;06.08.2021;07.08.2021;BDL-NL-GB-D-DAILY--210806-01;BDL-NL-GB;08:00;157;0;157;1064;15.57;157;12;5
2021;Aug;06.08.2021;07.08.2021;BDL-NL-GB-D-DAILY--210806-01;BDL-NL-GB;09:00;157;0;157;1110;53.34;157;12;5
2021;Aug;06.08.2021;07.08.2021;BDL-NL-GB-D-DAILY--210806-01;BDL-NL-GB;10:00;157;0;157;1110;65;157;12;6
2021;Aug;06.08.2021;07.08.2021;BDL-NL-GB-D-DAILY--210806-01;BDL-NL-GB;11:00;157;0;157;1126;60.16;157;12;4
2021;Aug;06.08.2021;07.08.2021;BDL-NL-GB-D-DAILY--210806-01;BDL-NL-GB;12:00;157;0;157;1126;64.75;157;12;4
2021;Aug;06.08.2021;07.08.2021;BDL-NL-GB-D-DAILY--210806-01;BDL-NL-GB;13:00;157;0;157;1126;65.09;157;12;5
2021;Aug;06.08.2021;07.08.2021;BDL-NL-GB-D-DAILY--210806-01;BDL-NL-GB;14:00;157;0;157;1126;53.56;157;12;5
2021;Aug;06.08.2021;07.08.2021;BDL-NL-GB-D-DAILY--210806-01;BDL-NL-GB;15:00;157;0;157;1126;48.87;157;12;6
2021;Aug;06.08.2021;07.08.2021;BDL-NL-GB-D-DAILY--210806-01;BDL-NL-GB;16:00;157;0;157;1126;42.71;157;12;5
2021;Aug;06.08.2021;07.08.2021;BDL-NL-GB-D-DAILY--210806-01;BDL-NL-GB;17:00;157;0;157;1126;34.19;157;12;7
2021;Aug;06.08.2021;07.08.2021;BDL-NL-GB-D-DAILY--210806-01;BDL-NL-GB;18:00;157;0;157;1106;51.06;157;12;5
2021;Aug;06.08.2021;07.08.2021;BDL-NL-GB-D-DAILY--210806-01;BDL-NL-GB;19:00;157;0;157;1090;49.37;157;12;5
2021;Aug;06.08.2021;07.08.2021;BDL-NL-GB-D-DAILY--210806-01;BDL-NL-GB;20:00;157;0;157;1090;36.95;157;12;5
2021;Aug;06.08.2021;07.08.2021;BDL-NL-GB-D-DAILY--210806-01;BDL-NL-GB;21:00;157;0;157;1106;26.69;157;12;8
2021;Aug;06.08.2021;07.08.2021;BDL-NL-GB-D-DAILY--210806-01;BDL-NL-GB;22:00;157;0;157;1106;25.24;157;12;7
2021;Aug;06.08.2021;07.08.2021;BDL-NL-GB-D-DAILY--210806-01;BDL-NL-GB;23:00;157;0;157;1034;23.59;157;12;7
2021;Aug;07.08.2021;08.08.2021;BDL-NL-GB-D-DAILY--210807-01;BDL-NL-GB;00:00;132;0;132;962;45.11;132;13;7
2021;Aug;07.08.2021;08.08.2021;BDL-NL-GB-D-DAILY--210807-01;BDL-NL-GB;01:00;132;0;132;962;36.31;132;13;7
2021;Aug;07.08.2021;08.08.2021;BDL-NL-GB-D-DAILY--210807-01;BDL-NL-GB;02:00;132;0;132;962;26.82;132;13;8
2021;Aug;07.08.2021;08.08.2021;BDL-NL-GB-D-DAILY--210807-01;BDL-NL-GB;03:00;132;0;132;962;28.67;132;13;7
2021;Aug;07.08.2021;08.08.2021;BDL-NL-GB-D-DAILY--210807-01;BDL-NL-GB;04:00;132;0;132;962;28.5;132;13;8
2021;Aug;07.08.2021;08.08.2021;BDL-NL-GB-D-DAILY--210807-01;BDL-NL-GB;05:00;132;0;132;962;17.38;132;13;6
2021;Aug;07.08.2021;08.08.2021;BDL-NL-GB-D-DAILY--210807-01;BDL-NL-GB;06:00;132;0;132;956;17.69;132;13;7
2021;Aug;07.08.2021;08.08.2021;BDL-NL-GB-D-DAILY--210807-01;BDL-NL-GB;07:00;132;0;132;956;37.21;132;13;6
2021;Aug;07.08.2021;08.08.2021;BDL-NL-GB-D-DAILY--210807-01;BDL-NL-GB;08:00;132;0;132;984;44.02;132;13;5
2021;Aug;07.08.2021;08.08.2021;BDL-NL-GB-D-DAILY--210807-01;BDL-NL-GB;09:00;132;0;132;988;70;132;13;4
2021;Aug;07.08.2021;08.08.2021;BDL-NL-GB-D-DAILY--210807-01;BDL-NL-GB;10:00;132;0;132;988;86;132;13;5
2021;Aug;07.08.2021;08.08.2021;BDL-NL-GB-D-DAILY--210807-01;BDL-NL-GB;11:00;132;0;132;988;77;132;13;8
2021;Aug;07.08.2021;08.08.2021;BDL-NL-GB-D-DAILY--210807-01;BDL-NL-GB;12:00;132;0;132;988;77.84;132;13;8
2021;Aug;07.08.2021;08.08.2021;BDL-NL-GB-D-DAILY--210807-01;BDL-NL-GB;13:00;132;0;132;988;81.23;132;13;5
2021;Aug;07.08.2021;08.08.2021;BDL-NL-GB-D-DAILY--210807-01;BDL-NL-GB;14:00;132;0;132;988;72.39;132;13;5
2021;Aug;07.08.2021;08.08.2021;BDL-NL-GB-D-DAILY--210807-01;BDL-NL-GB;15:00;132;0;132;988;53.83;132;13;5
2021;Aug;07.08.2021;08.08.2021;BDL-NL-GB-D-DAILY--210807-01;BDL-NL-GB;16:00;132;0;132;990;52.52;132;13;4
2021;Aug;07.08.2021;08.08.2021;BDL-NL-GB-D-DAILY--210807-01;BDL-NL-GB;17:00;132;0;132;990;55.15;132;13;5
2021;Aug;07.08.2021;08.08.2021;BDL-NL-GB-D-DAILY--210807-01;BDL-NL-GB;18:00;132;0;132;990;55;132;13;5
2021;Aug;07.08.2021;08.08.2021;BDL-NL-GB-D-DAILY--210807-01;BDL-NL-GB;19:00;132;0;132;990;58;132;13;6
2021;Aug;07.08.2021;08.08.2021;BDL-NL-GB-D-DAILY--210807-01;BDL-NL-GB;20:00;132;0;132;940;58.19;132;13;6
2021;Aug;07.08.2021;08.08.2021;BDL-NL-GB-D-DAILY--210807-01;BDL-NL-GB;21:00;132;0;132;956;48.62;132;13;5
2021;Aug;07.08.2021;08.08.2021;BDL-NL-GB-D-DAILY--210807-01;BDL-NL-GB;22:00;132;0;132;940;33.53;132;13;7
2021;Aug;07.08.2021;08.08.2021;BDL-NL-GB-D-DAILY--210807-01;BDL-NL-GB;23:00;132;0;132;956;28;132;13;7
2021;Aug;08.08.2021;09.08.2021;BDL-NL-GB-D-DAILY--210808-01;BDL-NL-GB;00:00;132;0;132;596;66.07;132;11;6
2021;Aug;08.08.2021;09.08.2021;BDL-NL-GB-D-DAILY--210808-01;BDL-NL-GB;01:00;132;0;132;596;45.9;132;11;6
2021;Aug;08.08.2021;09.08.2021;BDL-NL-GB-D-DAILY--210808-01;BDL-NL-GB;02:00;132;0;132;592;39;132;11;5
2021;Aug;08.08.2021;09.08.2021;BDL-NL-GB-D-DAILY--210808-01;BDL-NL-GB;03:00;132;0;132;588;28.82;132;11;6
2021;Aug;08.08.2021;09.08.2021;BDL-NL-GB-D-DAILY--210808-01;BDL-NL-GB;04:00;132;0;132;588;20.99;132;11;7
2021;Aug;08.08.2021;09.08.2021;BDL-NL-GB-D-DAILY--210808-01;BDL-NL-GB;05:00;132;0;132;588;17.72;132;11;8
2021;Aug;08.08.2021;09.08.2021;BDL-NL-GB-D-DAILY--210808-01;BDL-NL-GB;06:00;132;0;132;588;18.94;132;11;7
2021;Aug;08.08.2021;09.08.2021;BDL-NL-GB-D-DAILY--210808-01;BDL-NL-GB;07:00;132;0;132;588;30.96;132;11;7
2021;Aug;08.08.2021;09.08.2021;BDL-NL-GB-D-DAILY--210808-01;BDL-NL-GB;08:00;132;0;132;588;49.45;132;11;7
2021;Aug;08.08.2021;09.08.2021;BDL-NL-GB-D-DAILY--210808-01;BDL-NL-GB;09:00;132;0;132;590;87.67;132;11;6
2021;Aug;08.08.2021;09.08.2021;BDL-NL-GB-D-DAILY--210808-01;BDL-NL-GB;10:00;132;0;132;592;120.01;132;11;7
2021;Aug;08.08.2021;09.08.2021;BDL-NL-GB-D-DAILY--210808-01;BDL-NL-GB;11:00;132;0;132;594;132.36;132;11;5
2021;Aug;08.08.2021;09.08.2021;BDL-NL-GB-D-DAILY--210808-01;BDL-NL-GB;12:00;132;0;132;594;139.56;132;11;6
2021;Aug;08.08.2021;09.08.2021;BDL-NL-GB-D-DAILY--210808-01;BDL-NL-GB;13:00;132;0;132;594;141.23;132;11;5
2021;Aug;08.08.2021;09.08.2021;BDL-NL-GB-D-DAILY--210808-01;BDL-NL-GB;14:00;132;0;132;594;133.42;132;11;6
2021;Aug;08.08.2021;09.08.2021;BDL-NL-GB-D-DAILY--210808-01;BDL-NL-GB;15:00;132;0;132;594;111.17;132;11;5
2021;Aug;08.08.2021;09.08.2021;BDL-NL-GB-D-DAILY--210808-01;BDL-NL-GB;16:00;132;0;132;594;97.5;132;11;6
2021;Aug;08.08.2021;09.08.2021;BDL-NL-GB-D-DAILY--210808-01;BDL-NL-GB;17:00;132;0;132;594;100;132;11;6
2021;Aug;08.08.2021;09.08.2021;BDL-NL-GB-D-DAILY--210808-01;BDL-NL-GB;18:00;132;0;132;592;73.61;132;11;9
2021;Aug;08.08.2021;09.08.2021;BDL-NL-GB-D-DAILY--210808-01;BDL-NL-GB;19:00;132;0;132;592;63.77;132;11;7
2021;Aug;08.08.2021;09.08.2021;BDL-NL-GB-D-DAILY--210808-01;BDL-NL-GB;20:00;132;0;132;590;68.5;132;11;7
2021;Aug;08.08.2021;09.08.2021;BDL-NL-GB-D-DAILY--210808-01;BDL-NL-GB;21:00;132;0;132;590;55.06;132;11;7
2021;Aug;08.08.2021;09.08.2021;BDL-NL-GB-D-DAILY--210808-01;BDL-NL-GB;22:00;132;0;132;590;53.27;132;11;7
2021;Aug;08.08.2021;09.08.2021;BDL-NL-GB-D-DAILY--210808-01;BDL-NL-GB;23:00;132;0;132;590;43.25;132;11;8
2021;Aug;09.08.2021;10.08.2021;BDL-NL-GB-D-DAILY--210809-01;BDL-NL-GB;00:00;157;0;157;700;71.58;157;10;6
2021;Aug;09.08.2021;10.08.2021;BDL-NL-GB-D-DAILY--210809-01;BDL-NL-GB;01:00;157;0;157;700;59.65;157;10;5
2021;Aug;09.08.2021;10.08.2021;BDL-NL-GB-D-DAILY--210809-01;BDL-NL-GB;02:00;157;0;157;700;54.09;157;10;7
2021;Aug;09.08.2021;10.08.2021;BDL-NL-GB-D-DAILY--210809-01;BDL-NL-GB;03:00;157;0;157;700;51.13;157;10;6
2021;Aug;09.08.2021;10.08.2021;BDL-NL-GB-D-DAILY--210809-01;BDL-NL-GB;04:00;157;0;157;700;47.24;157;10;7
2021;Aug;09.08.2021;10.08.2021;BDL-NL-GB-D-DAILY--210809-01;BDL-NL-GB;05:00;157;0;157;700;39.4;157;10;7
2021;Aug;09.08.2021;10.08.2021;BDL-NL-GB-D-DAILY--210809-01;BDL-NL-GB;06:00;157;0;157;700;26.73;157;10;6
2021;Aug;09.08.2021;10.08.2021;BDL-NL-GB-D-DAILY--210809-01;BDL-NL-GB;07:00;157;0;157;700;28.61;157;10;5
2021;Aug;09.08.2021;10.08.2021;BDL-NL-GB-D-DAILY--210809-01;BDL-NL-GB;08:00;157;0;157;703;16.52;157;10;5
2021;Aug;09.08.2021;10.08.2021;BDL-NL-GB-D-DAILY--210809-01;BDL-NL-GB;09:00;157;0;157;697;58;157;10;5
2021;Aug;09.08.2021;10.08.2021;BDL-NL-GB-D-DAILY--210809-01;BDL-NL-GB;10:00;157;0;157;697;69.12;157;10;5
2021;Aug;09.08.2021;10.08.2021;BDL-NL-GB-D-DAILY--210809-01;BDL-NL-GB;11:00;157;0;157;697;66.61;157;10;6
2021;Aug;09.08.2021;10.08.2021;BDL-NL-GB-D-DAILY--210809-01;BDL-NL-GB;12:00;157;0;157;697;60.68;157;10;5
2021;Aug;09.08.2021;10.08.2021;BDL-NL-GB-D-DAILY--210809-01;BDL-NL-GB;13:00;157;0;157;697;60.22;157;10;6
2021;Aug;09.08.2021;10.08.2021;BDL-NL-GB-D-DAILY--210809-01;BDL-NL-GB;14:00;157;0;157;697;47.03;157;10;7
2021;Aug;09.08.2021;10.08.2021;BDL-NL-GB-D-DAILY--210809-01;BDL-NL-GB;15:00;157;0;157;697;36.14;157;10;7
2021;Aug;09.08.2021;10.08.2021;BDL-NL-GB-D-DAILY--210809-01;BDL-NL-GB;16:00;157;0;157;703;30;157;10;7
2021;Aug;09.08.2021;10.08.2021;BDL-NL-GB-D-DAILY--210809-01;BDL-NL-GB;17:00;157;0;157;703;31.37;157;10;7
2021;Aug;09.08.2021;10.08.2021;BDL-NL-GB-D-DAILY--210809-01;BDL-NL-GB;18:00;157;0;157;703;39;157;10;6
2021;Aug;09.08.2021;10.08.2021;BDL-NL-GB-D-DAILY--210809-01;BDL-NL-GB;19:00;157;0;157;703;41.53;157;10;4
2021;Aug;09.08.2021;10.08.2021;BDL-NL-GB-D-DAILY--210809-01;BDL-NL-GB;20:00;157;0;157;703;37.11;157;10;4
2021;Aug;09.08.2021;10.08.2021;BDL-NL-GB-D-DAILY--210809-01;BDL-NL-GB;21:00;157;0;157;687;26.93;157;10;4
2021;Aug;09.08.2021;10.08.2021;BDL-NL-GB-D-DAILY--210809-01;BDL-NL-GB;22:00;157;0;157;703;26;157;10;5
2021;Aug;09.08.2021;10.08.2021;BDL-NL-GB-D-DAILY--210809-01;BDL-NL-GB;23:00;157;0;157;703;20.4;157;10;6
2021;Aug;10.08.2021;11.08.2021;BDL-NL-GB-D-DAILY--210810-01;BDL-NL-GB;00:00;157;0;157;1101;53.56;157;12;7
2021;Aug;10.08.2021;11.08.2021;BDL-NL-GB-D-DAILY--210810-01;BDL-NL-GB;01:00;157;0;157;1101;48.59;157;12;6
2021;Aug;10.08.2021;11.08.2021;BDL-NL-GB-D-DAILY--210810-01;BDL-NL-GB;02:00;157;0;157;1101;47.45;157;12;6
2021;Aug;10.08.2021;11.08.2021;BDL-NL-GB-D-DAILY--210810-01;BDL-NL-GB;03:00;157;0;157;1101;44.23;157;12;6
2021;Aug;10.08.2021;11.08.2021;BDL-NL-GB-D-DAILY--210810-01;BDL-NL-GB;04:00;157;0;157;1101;40.03;157;12;6
2021;Aug;10.08.2021;11.08.2021;BDL-NL-GB-D-DAILY--210810-01;BDL-NL-GB;05:00;157;0;157;1101;34.27;157;12;6
2021;Aug;10.08.2021;11.08.2021;BDL-NL-GB-D-DAILY--210810-01;BDL-NL-GB;06:00;157;0;157;1101;17.7;157;12;6
2021;Aug;10.08.2021;11.08.2021;BDL-NL-GB-D-DAILY--210810-01;BDL-NL-GB;07:00;157;0;157;1101;15.61;157;12;6
2021;Aug;10.08.2021;11.08.2021;BDL-NL-GB-D-DAILY--210810-01;BDL-NL-GB;08:00;157;0;157;1009;13.91;157;12;5
2021;Aug;10.08.2021;11.08.2021;BDL-NL-GB-D-DAILY--210810-01;BDL-NL-GB;09:00;157;0;157;1101;40.85;157;12;7
2021;Aug;10.08.2021;11.08.2021;BDL-NL-GB-D-DAILY--210810-01;BDL-NL-GB;10:00;157;0;157;1101;52.99;157;12;8
2021;Aug;10.08.2021;11.08.2021;BDL-NL-GB-D-DAILY--210810-01;BDL-NL-GB;11:00;157;0;157;1101;47.16;157;12;8
2021;Aug;10.08.2021;11.08.2021;BDL-NL-GB-D-DAILY--210810-01;BDL-NL-GB;12:00;157;0;157;1101;46.23;157;12;7
2021;Aug;10.08.2021;11.08.2021;BDL-NL-GB-D-DAILY--210810-01;BDL-NL-GB;13:00;157;0;157;1101;51.49;157;12;6
2021;Aug;10.08.2021;11.08.2021;BDL-NL-GB-D-DAILY--210810-01;BDL-NL-GB;14:00;157;0;157;1101;42.51;157;12;7
2021;Aug;10.08.2021;11.08.2021;BDL-NL-GB-D-DAILY--210810-01;BDL-NL-GB;15:00;157;0;157;1101;31.56;157;12;6
2021;Aug;10.08.2021;11.08.2021;BDL-NL-GB-D-DAILY--210810-01;BDL-NL-GB;16:00;157;0;157;1101;31.77;157;12;5
2021;Aug;10.08.2021;11.08.2021;BDL-NL-GB-D-DAILY--210810-01;BDL-NL-GB;17:00;157;0;157;1101;55.64;157;12;5
2021;Aug;10.08.2021;11.08.2021;BDL-NL-GB-D-DAILY--210810-01;BDL-NL-GB;18:00;157;0;157;1101;61.81;157;12;5
2021;Aug;10.08.2021;11.08.2021;BDL-NL-GB-D-DAILY--210810-01;BDL-NL-GB;19:00;157;0;157;1101;59.74;157;12;6
2021;Aug;10.08.2021;11.08.2021;BDL-NL-GB-D-DAILY--210810-01;BDL-NL-GB;20:00;157;0;157;1085;48.14;157;12;5
2021;Aug;10.08.2021;11.08.2021;BDL-NL-GB-D-DAILY--210810-01;BDL-NL-GB;21:00;157;0;157;1101;47.12;157;12;4
2021;Aug;10.08.2021;11.08.2021;BDL-NL-GB-D-DAILY--210810-01;BDL-NL-GB;22:00;157;0;157;1101;51.56;157;12;3
2021;Aug;10.08.2021;11.08.2021;BDL-NL-GB-D-DAILY--210810-01;BDL-NL-GB;23:00;157;0;157;1101;24.84;157;12;6
2021;Aug;11.08.2021;12.08.2021;BDL-NL-GB-D-DAILY--210811-01;BDL-NL-GB;00:00;157;0;157;1182;38.38;157;12;4
2021;Aug;11.08.2021;12.08.2021;BDL-NL-GB-D-DAILY--210811-01;BDL-NL-GB;01:00;157;0;157;1198;33.13;157;12;5
2021;Aug;11.08.2021;12.08.2021;BDL-NL-GB-D-DAILY--210811-01;BDL-NL-GB;02:00;157;0;157;1198;30.3;157;12;4
2021;Aug;11.08.2021;12.08.2021;BDL-NL-GB-D-DAILY--210811-01;BDL-NL-GB;03:00;157;0;157;1203;28.32;157;12;5
2021;Aug;11.08.2021;12.08.2021;BDL-NL-GB-D-DAILY--210811-01;BDL-NL-GB;04:00;157;0;157;1203;26.39;157;12;5
2021;Aug;11.08.2021;12.08.2021;BDL-NL-GB-D-DAILY--210811-01;BDL-NL-GB;05:00;157;0;157;1187;18.51;157;12;3
2021;Aug;11.08.2021;12.08.2021;BDL-NL-GB-D-DAILY--210811-01;BDL-NL-GB;06:00;157;0;157;1067;7.33;157;12;2
2021;Aug;11.08.2021;12.08.2021;BDL-NL-GB-D-DAILY--210811-01;BDL-NL-GB;07:00;157;0;157;1086;2.34;157;12;4
2021;Aug;11.08.2021;12.08.2021;BDL-NL-GB-D-DAILY--210811-01;BDL-NL-GB;08:00;157;0;157;1065;1.27;157;12;4
2021;Aug;11.08.2021;12.08.2021;BDL-NL-GB-D-DAILY--210811-01;BDL-NL-GB;09:00;157;0;157;1182;33.49;157;12;7
2021;Aug;11.08.2021;12.08.2021;BDL-NL-GB-D-DAILY--210811-01;BDL-NL-GB;10:00;157;0;157;1182;48.5;157;12;5
2021;Aug;11.08.2021;12.08.2021;BDL-NL-GB-D-DAILY--210811-01;BDL-NL-GB;11:00;157;0;157;1182;45.75;157;12;5
2021;Aug;11.08.2021;12.08.2021;BDL-NL-GB-D-DAILY--210811-01;BDL-NL-GB;12:00;157;0;157;1198;37.33;157;12;6
2021;Aug;11.08.2021;12.08.2021;BDL-NL-GB-D-DAILY--210811-01;BDL-NL-GB;13:00;157;0;157;1198;43.93;157;12;6
2021;Aug;11.08.2021;12.08.2021;BDL-NL-GB-D-DAILY--210811-01;BDL-NL-GB;14:00;157;0;157;1198;31.72;157;12;5
2021;Aug;11.08.2021;12.08.2021;BDL-NL-GB-D-DAILY--210811-01;BDL-NL-GB;15:00;157;0;157;1147;24.94;157;12;5
2021;Aug;11.08.2021;12.08.2021;BDL-NL-GB-D-DAILY--210811-01;BDL-NL-GB;16:00;157;0;157;1124;17.79;157;12;5
2021;Aug;11.08.2021;12.08.2021;BDL-NL-GB-D-DAILY--210811-01;BDL-NL-GB;17:00;157;0;157;1182;16.13;157;12;5
2021;Aug;11.08.2021;12.08.2021;BDL-NL-GB-D-DAILY--210811-01;BDL-NL-GB;18:00;157;0;157;1182;22.5;157;12;6
2021;Aug;11.08.2021;12.08.2021;BDL-NL-GB-D-DAILY--210811-01;BDL-NL-GB;19:00;157;0;157;1182;13.72;157;12;6
2021;Aug;11.08.2021;12.08.2021;BDL-NL-GB-D-DAILY--210811-01;BDL-NL-GB;20:00;157;0;157;986;6.59;157;12;5
2021;Aug;11.08.2021;12.08.2021;BDL-NL-GB-D-DAILY--210811-01;BDL-NL-GB;21:00;157;0;157;986;7.96;157;12;5
2021;Aug;11.08.2021;12.08.2021;BDL-NL-GB-D-DAILY--210811-01;BDL-NL-GB;22:00;157;0;157;1108;14.3;157;12;4
2021;Aug;11.08.2021;12.08.2021;BDL-NL-GB-D-DAILY--210811-01;BDL-NL-GB;23:00;157;0;157;1067;21.58;157;12;3
2021;Aug;12.08.2021;13.08.2021;BDL-NL-GB-D-DAILY--210812-01;BDL-NL-GB;00:00;157;0;157;1145;36.02;157;12;7
2021;Aug;12.08.2021;13.08.2021;BDL-NL-GB-D-DAILY--210812-01;BDL-NL-GB;01:00;157;0;157;1161;31.67;157;12;6
2021;Aug;12.08.2021;13.08.2021;BDL-NL-GB-D-DAILY--210812-01;BDL-NL-GB;02:00;157;0;157;1166;28.35;157;12;5
2021;Aug;12.08.2021;13.08.2021;BDL-NL-GB-D-DAILY--210812-01;BDL-NL-GB;03:00;157;0;157;1166;22.59;157;12;5
2021;Aug;12.08.2021;13.08.2021;BDL-NL-GB-D-DAILY--210812-01;BDL-NL-GB;04:00;157;0;157;1166;20.72;157;12;5
2021;Aug;12.08.2021;13.08.2021;BDL-NL-GB-D-DAILY--210812-01;BDL-NL-GB;05:00;157;0;157;1145;17.09;157;12;5
2021;Aug;12.08.2021;13.08.2021;BDL-NL-GB-D-DAILY--210812-01;BDL-NL-GB;06:00;157;0;157;1019;3.52;157;12;3
2021;Aug;12.08.2021;13.08.2021;BDL-NL-GB-D-DAILY--210812-01;BDL-NL-GB;07:00;157;0;157;1049;1.1;157;12;4
2021;Aug;12.08.2021;13.08.2021;BDL-NL-GB-D-DAILY--210812-01;BDL-NL-GB;08:00;157;0;157;1145;8.22;157;12;4
2021;Aug;12.08.2021;13.08.2021;BDL-NL-GB-D-DAILY--210812-01;BDL-NL-GB;09:00;157;0;157;1135;49.56;157;12;5
2021;Aug;12.08.2021;13.08.2021;BDL-NL-GB-D-DAILY--210812-01;BDL-NL-GB;10:00;157;0;157;1135;63.28;157;12;5
2021;Aug;12.08.2021;13.08.2021;BDL-NL-GB-D-DAILY--210812-01;BDL-NL-GB;11:00;157;0;157;1140;57.17;157;12;5
2021;Aug;12.08.2021;13.08.2021;BDL-NL-GB-D-DAILY--210812-01;BDL-NL-GB;12:00;157;0;157;1140;46.91;157;12;5
2021;Aug;12.08.2021;13.08.2021;BDL-NL-GB-D-DAILY--210812-01;BDL-NL-GB;13:00;157;0;157;1166;33.14;157;12;5
2021;Aug;12.08.2021;13.08.2021;BDL-NL-GB-D-DAILY--210812-01;BDL-NL-GB;14:00;157;0;157;1166;25.09;157;12;6
2021;Aug;12.08.2021;13.08.2021;BDL-NL-GB-D-DAILY--210812-01;BDL-NL-GB;15:00;157;0;157;1161;12.09;157;12;7
2021;Aug;12.08.2021;13.08.2021;BDL-NL-GB-D-DAILY--210812-01;BDL-NL-GB;16:00;157;0;157;1161;6.84;157;12;6
2021;Aug;12.08.2021;13.08.2021;BDL-NL-GB-D-DAILY--210812-01;BDL-NL-GB;17:00;157;0;157;1139;3.65;157;12;5
2021;Aug;12.08.2021;13.08.2021;BDL-NL-GB-D-DAILY--210812-01;BDL-NL-GB;18:00;157;0;157;1071;6.41;157;12;7
2021;Aug;12.08.2021;13.08.2021;BDL-NL-GB-D-DAILY--210812-01;BDL-NL-GB;19:00;157;0;157;1071;9.72;157;12;4
2021;Aug;12.08.2021;13.08.2021;BDL-NL-GB-D-DAILY--210812-01;BDL-NL-GB;20:00;157;0;157;1139;2.51;157;12;4
2021;Aug;12.08.2021;13.08.2021;BDL-NL-GB-D-DAILY--210812-01;BDL-NL-GB;21:00;157;0;157;1139;6.68;157;12;4
2021;Aug;12.08.2021;13.08.2021;BDL-NL-GB-D-DAILY--210812-01;BDL-NL-GB;22:00;157;0;157;1139;7.25;157;12;5
2021;Aug;12.08.2021;13.08.2021;BDL-NL-GB-D-DAILY--210812-01;BDL-NL-GB;23:00;157;0;157;1128;7;157;12;4
2021;Aug;13.08.2021;14.08.2021;BDL-NL-GB-D-DAILY--210813-01;BDL-NL-GB;00:00;157;0;157;1161;32.14;157;12;5
2021;Aug;13.08.2021;14.08.2021;BDL-NL-GB-D-DAILY--210813-01;BDL-NL-GB;01:00;157;0;157;1161;19.64;156;12;6
2021;Aug;13.08.2021;14.08.2021;BDL-NL-GB-D-DAILY--210813-01;BDL-NL-GB;02:00;157;0;157;1166;11.73;157;12;5
2021;Aug;13.08.2021;14.08.2021;BDL-NL-GB-D-DAILY--210813-01;BDL-NL-GB;03:00;157;0;157;1110;4.5;157;12;5
2021;Aug;13.08.2021;14.08.2021;BDL-NL-GB-D-DAILY--210813-01;BDL-NL-GB;04:00;157;0;157;1110;2.42;157;12;4
2021;Aug;13.08.2021;14.08.2021;BDL-NL-GB-D-DAILY--210813-01;BDL-NL-GB;05:00;157;0;157;1105;2.01;157;12;5
2021;Aug;13.08.2021;14.08.2021;BDL-NL-GB-D-DAILY--210813-01;BDL-NL-GB;06:00;157;0;157;1089;0.82;157;12;4
2021;Aug;13.08.2021;14.08.2021;BDL-NL-GB-D-DAILY--210813-01;BDL-NL-GB;07:00;157;0;157;1089;0.5;157;12;6
2021;Aug;13.08.2021;14.08.2021;BDL-NL-GB-D-DAILY--210813-01;BDL-NL-GB;08:00;157;0;157;1089;5.06;157;12;3
2021;Aug;13.08.2021;14.08.2021;BDL-NL-GB-D-DAILY--210813-01;BDL-NL-GB;09:00;157;0;157;1145;33.85;157;12;5
2021;Aug;13.08.2021;14.08.2021;BDL-NL-GB-D-DAILY--210813-01;BDL-NL-GB;10:00;157;0;157;1145;40.7;157;12;6
2021;Aug;13.08.2021;14.08.2021;BDL-NL-GB-D-DAILY--210813-01;BDL-NL-GB;11:00;157;0;157;1161;40.99;157;12;5
2021;Aug;13.08.2021;14.08.2021;BDL-NL-GB-D-DAILY--210813-01;BDL-NL-GB;12:00;157;0;157;1161;36.44;157;12;5
2021;Aug;13.08.2021;14.08.2021;BDL-NL-GB-D-DAILY--210813-01;BDL-NL-GB;13:00;157;0;157;1161;33.17;157;12;6
2021;Aug;13.08.2021;14.08.2021;BDL-NL-GB-D-DAILY--210813-01;BDL-NL-GB;14:00;157;0;157;1161;29.47;157;12;6
2021;Aug;13.08.2021;14.08.2021;BDL-NL-GB-D-DAILY--210813-01;BDL-NL-GB;15:00;157;0;157;1166;22.68;157;12;6
2021;Aug;13.08.2021;14.08.2021;BDL-NL-GB-D-DAILY--210813-01;BDL-NL-GB;16:00;157;0;157;1166;24.76;157;12;5
2021;Aug;13.08.2021;14.08.2021;BDL-NL-GB-D-DAILY--210813-01;BDL-NL-GB;17:00;157;0;157;1104;17.08;156;12;5
2021;Aug;13.08.2021;14.08.2021;BDL-NL-GB-D-DAILY--210813-01;BDL-NL-GB;18:00;157;0;157;1161;24.13;157;12;6
2021;Aug;13.08.2021;14.08.2021;BDL-NL-GB-D-DAILY--210813-01;BDL-NL-GB;19:00;157;0;157;1145;28.97;157;12;4
2021;Aug;13.08.2021;14.08.2021;BDL-NL-GB-D-DAILY--210813-01;BDL-NL-GB;20:00;157;0;157;1065;29.87;157;12;3
2021;Aug;13.08.2021;14.08.2021;BDL-NL-GB-D-DAILY--210813-01;BDL-NL-GB;21:00;157;0;157;1145;31.86;157;12;5
2021;Aug;13.08.2021;14.08.2021;BDL-NL-GB-D-DAILY--210813-01;BDL-NL-GB;22:00;157;0;157;1091;33.61;157;12;4
2021;Aug;13.08.2021;14.08.2021;BDL-NL-GB-D-DAILY--210813-01;BDL-NL-GB;23:00;157;0;157;1091;32.71;157;12;3
2021;Aug;14.08.2021;15.08.2021;BDL-NL-GB-D-DAILY--210814-01;BDL-NL-GB;00:00;144;0;144;965;43.22;144;12;6
2021;Aug;14.08.2021;15.08.2021;BDL-NL-GB-D-DAILY--210814-01;BDL-NL-GB;01:00;144;0;144;965;30.23;144;12;7
2021;Aug;14.08.2021;15.08.2021;BDL-NL-GB-D-DAILY--210814-01;BDL-NL-GB;02:00;144;0;144;903;16.62;144;12;7
2021;Aug;14.08.2021;15.08.2021;BDL-NL-GB-D-DAILY--210814-01;BDL-NL-GB;03:00;144;0;144;967;8.43;144;12;7
2021;Aug;14.08.2021;15.08.2021;BDL-NL-GB-D-DAILY--210814-01;BDL-NL-GB;04:00;144;0;144;967;6.29;144;12;5
2021;Aug;14.08.2021;15.08.2021;BDL-NL-GB-D-DAILY--210814-01;BDL-NL-GB;05:00;144;0;144;962;5.16;144;12;6
2021;Aug;14.08.2021;15.08.2021;BDL-NL-GB-D-DAILY--210814-01;BDL-NL-GB;06:00;144;0;144;898;11.07;144;12;7
2021;Aug;14.08.2021;15.08.2021;BDL-NL-GB-D-DAILY--210814-01;BDL-NL-GB;07:00;144;0;144;965;47.65;144;12;4
2021;Aug;14.08.2021;15.08.2021;BDL-NL-GB-D-DAILY--210814-01;BDL-NL-GB;08:00;144;0;144;949;35.18;144;12;5
2021;Aug;14.08.2021;15.08.2021;BDL-NL-GB-D-DAILY--210814-01;BDL-NL-GB;09:00;144;0;144;965;63.5;144;12;4
2021;Aug;14.08.2021;15.08.2021;BDL-NL-GB-D-DAILY--210814-01;BDL-NL-GB;10:00;144;0;144;965;84.36;144;12;4
2021;Aug;14.08.2021;15.08.2021;BDL-NL-GB-D-DAILY--210814-01;BDL-NL-GB;11:00;144;0;144;965;90.8;144;12;5
2021;Aug;14.08.2021;15.08.2021;BDL-NL-GB-D-DAILY--210814-01;BDL-NL-GB;12:00;144;0;144;970;102.65;144;12;5
2021;Aug;14.08.2021;15.08.2021;BDL-NL-GB-D-DAILY--210814-01;BDL-NL-GB;13:00;144;0;144;970;110.28;144;12;6
2021;Aug;14.08.2021;15.08.2021;BDL-NL-GB-D-DAILY--210814-01;BDL-NL-GB;14:00;144;0;144;970;113.93;144;12;6
2021;Aug;14.08.2021;15.08.2021;BDL-NL-GB-D-DAILY--210814-01;BDL-NL-GB;15:00;144;0;144;970;95.58;144;12;6
2021;Aug;14.08.2021;15.08.2021;BDL-NL-GB-D-DAILY--210814-01;BDL-NL-GB;16:00;144;0;144;965;92.69;144;12;5
2021;Aug;14.08.2021;15.08.2021;BDL-NL-GB-D-DAILY--210814-01;BDL-NL-GB;17:00;144;0;144;965;75.56;144;12;4
2021;Aug;14.08.2021;15.08.2021;BDL-NL-GB-D-DAILY--210814-01;BDL-NL-GB;18:00;144;0;144;965;69.28;144;12;4
2021;Aug;14.08.2021;15.08.2021;BDL-NL-GB-D-DAILY--210814-01;BDL-NL-GB;19:00;144;0;144;949;69.75;144;12;4
2021;Aug;14.08.2021;15.08.2021;BDL-NL-GB-D-DAILY--210814-01;BDL-NL-GB;20:00;144;0;144;949;58.01;144;12;4
2021;Aug;14.08.2021;15.08.2021;BDL-NL-GB-D-DAILY--210814-01;BDL-NL-GB;21:00;144;0;144;949;63.6;144;12;4
2021;Aug;14.08.2021;15.08.2021;BDL-NL-GB-D-DAILY--210814-01;BDL-NL-GB;22:00;144;0;144;949;41.38;144;12;4
2021;Aug;14.08.2021;15.08.2021;BDL-NL-GB-D-DAILY--210814-01;BDL-NL-GB;23:00;144;0;144;949;33.44;144;12;6
2021;Aug;15.08.2021;16.08.2021;BDL-NL-GB-D-DAILY--210815-01;BDL-NL-GB;00:00;144;0;144;771;52.95;144;11;8
2021;Aug;15.08.2021;16.08.2021;BDL-NL-GB-D-DAILY--210815-01;BDL-NL-GB;01:00;144;0;144;771;47;144;11;5
2021;Aug;15.08.2021;16.08.2021;BDL-NL-GB-D-DAILY--210815-01;BDL-NL-GB;02:00;144;0;144;771;49.47;144;11;5
2021;Aug;15.08.2021;16.08.2021;BDL-NL-GB-D-DAILY--210815-01;BDL-NL-GB;03:00;144;0;144;771;43.99;144;11;7
2021;Aug;15.08.2021;16.08.2021;BDL-NL-GB-D-DAILY--210815-01;BDL-NL-GB;04:00;144;0;144;771;40.16;144;11;6
2021;Aug;15.08.2021;16.08.2021;BDL-NL-GB-D-DAILY--210815-01;BDL-NL-GB;05:00;144;0;144;771;40.98;144;11;6
2021;Aug;15.08.2021;16.08.2021;BDL-NL-GB-D-DAILY--210815-01;BDL-NL-GB;06:00;144;0;144;771;43.45;144;11;7
2021;Aug;15.08.2021;16.08.2021;BDL-NL-GB-D-DAILY--210815-01;BDL-NL-GB;07:00;144;0;144;720;45.5;144;11;7
2021;Aug;15.08.2021;16.08.2021;BDL-NL-GB-D-DAILY--210815-01;BDL-NL-GB;08:00;144;0;144;720;43.47;144;11;6
2021;Aug;15.08.2021;16.08.2021;BDL-NL-GB-D-DAILY--210815-01;BDL-NL-GB;09:00;144;0;144;720;57.45;144;11;5
2021;Aug;15.08.2021;16.08.2021;BDL-NL-GB-D-DAILY--210815-01;BDL-NL-GB;10:00;144;0;144;720;69.43;144;11;7
2021;Aug;15.08.2021;16.08.2021;BDL-NL-GB-D-DAILY--210815-01;BDL-NL-GB;11:00;144;0;144;720;80.5;144;11;6
2021;Aug;15.08.2021;16.08.2021;BDL-NL-GB-D-DAILY--210815-01;BDL-NL-GB;12:00;144;0;144;720;92.95;144;11;5
2021;Aug;15.08.2021;16.08.2021;BDL-NL-GB-D-DAILY--210815-01;BDL-NL-GB;13:00;144;0;144;720;113;144;11;5
2021;Aug;15.08.2021;16.08.2021;BDL-NL-GB-D-DAILY--210815-01;BDL-NL-GB;14:00;144;0;144;720;96.24;144;11;5
2021;Aug;15.08.2021;16.08.2021;BDL-NL-GB-D-DAILY--210815-01;BDL-NL-GB;15:00;144;0;144;720;90.88;144;11;4
2021;Aug;15.08.2021;16.08.2021;BDL-NL-GB-D-DAILY--210815-01;BDL-NL-GB;16:00;144;0;144;720;64.83;144;11;4
2021;Aug;15.08.2021;16.08.2021;BDL-NL-GB-D-DAILY--210815-01;BDL-NL-GB;17:00;144;0;144;720;55.5;144;11;5
2021;Aug;15.08.2021;16.08.2021;BDL-NL-GB-D-DAILY--210815-01;BDL-NL-GB;18:00;144;0;144;720;49.66;144;11;5
2021;Aug;15.08.2021;16.08.2021;BDL-NL-GB-D-DAILY--210815-01;BDL-NL-GB;19:00;144;0;144;720;47.91;144;11;5
2021;Aug;15.08.2021;16.08.2021;BDL-NL-GB-D-DAILY--210815-01;BDL-NL-GB;20:00;144;0;144;720;24.8;144;11;6
2021;Aug;15.08.2021;16.08.2021;BDL-NL-GB-D-DAILY--210815-01;BDL-NL-GB;21:00;144;0;144;720;15.48;144;11;6
2021;Aug;15.08.2021;16.08.2021;BDL-NL-GB-D-DAILY--210815-01;BDL-NL-GB;22:00;144;0;144;720;30.71;144;11;7
2021;Aug;15.08.2021;16.08.2021;BDL-NL-GB-D-DAILY--210815-01;BDL-NL-GB;23:00;144;0;144;720;31.48;144;11;7
2021;Aug;16.08.2021;17.08.2021;BDL-NL-GB-D-DAILY--210816-01;BDL-NL-GB;00:00;167;0;167;781;43.29;167;10;4
2021;Aug;16.08.2021;17.08.2021;BDL-NL-GB-D-DAILY--210816-01;BDL-NL-GB;01:00;167;0;167;775;29.75;167;10;4
2021;Aug;16.08.2021;17.08.2021;BDL-NL-GB-D-DAILY--210816-01;BDL-NL-GB;02:00;167;0;167;775;8.87;167;10;5
2021;Aug;16.08.2021;17.08.2021;BDL-NL-GB-D-DAILY--210816-01;BDL-NL-GB;03:00;167;0;167;789;11.77;167;10;4
2021;Aug;16.08.2021;17.08.2021;BDL-NL-GB-D-DAILY--210816-01;BDL-NL-GB;04:00;167;0;167;739;8.64;167;10;4
2021;Aug;16.08.2021;17.08.2021;BDL-NL-GB-D-DAILY--210816-01;BDL-NL-GB;05:00;167;0;167;739;12.02;167;10;4
2021;Aug;16.08.2021;17.08.2021;BDL-NL-GB-D-DAILY--210816-01;BDL-NL-GB;06:00;167;0;167;693;13.73;167;10;2
2021;Aug;16.08.2021;17.08.2021;BDL-NL-GB-D-DAILY--210816-01;BDL-NL-GB;07:00;167;0;167;764;20.18;167;10;4
2021;Aug;16.08.2021;17.08.2021;BDL-NL-GB-D-DAILY--210816-01;BDL-NL-GB;08:00;167;0;167;764;23.93;167;10;4
2021;Aug;16.08.2021;17.08.2021;BDL-NL-GB-D-DAILY--210816-01;BDL-NL-GB;09:00;167;0;167;759;51.57;167;10;4
2021;Aug;16.08.2021;17.08.2021;BDL-NL-GB-D-DAILY--210816-01;BDL-NL-GB;10:00;167;0;167;775;67;167;10;5
2021;Aug;16.08.2021;17.08.2021;BDL-NL-GB-D-DAILY--210816-01;BDL-NL-GB;11:00;167;0;167;775;71.83;167;10;6
2021;Aug;16.08.2021;17.08.2021;BDL-NL-GB-D-DAILY--210816-01;BDL-NL-GB;12:00;167;0;167;775;81.6;167;10;4
2021;Aug;16.08.2021;17.08.2021;BDL-NL-GB-D-DAILY--210816-01;BDL-NL-GB;13:00;167;0;167;775;89.85;167;10;5
2021;Aug;16.08.2021;17.08.2021;BDL-NL-GB-D-DAILY--210816-01;BDL-NL-GB;14:00;167;0;167;775;82.5;167;10;5
2021;Aug;16.08.2021;17.08.2021;BDL-NL-GB-D-DAILY--210816-01;BDL-NL-GB;15:00;167;0;167;775;70.83;167;10;5
2021;Aug;16.08.2021;17.08.2021;BDL-NL-GB-D-DAILY--210816-01;BDL-NL-GB;16:00;167;0;167;775;62.2;167;10;4
2021;Aug;16.08.2021;17.08.2021;BDL-NL-GB-D-DAILY--210816-01;BDL-NL-GB;17:00;167;0;167;775;63.72;167;10;4
2021;Aug;16.08.2021;17.08.2021;BDL-NL-GB-D-DAILY--210816-01;BDL-NL-GB;18:00;167;0;167;775;64.14;167;10;4
2021;Aug;16.08.2021;17.08.2021;BDL-NL-GB-D-DAILY--210816-01;BDL-NL-GB;19:00;167;0;167;770;62.99;167;10;5
2021;Aug;16.08.2021;17.08.2021;BDL-NL-GB-D-DAILY--210816-01;BDL-NL-GB;20:00;167;0;167;754;63.09;167;10;4
2021;Aug;16.08.2021;17.08.2021;BDL-NL-GB-D-DAILY--210816-01;BDL-NL-GB;21:00;167;0;167;754;60.79;167;10;4
2021;Aug;16.08.2021;17.08.2021;BDL-NL-GB-D-DAILY--210816-01;BDL-NL-GB;22:00;167;0;167;770;60.41;167;10;5
2021;Aug;16.08.2021;17.08.2021;BDL-NL-GB-D-DAILY--210816-01;BDL-NL-GB;23:00;167;0;167;785;44.15;167;10;5
2021;Aug;17.08.2021;18.08.2021;BDL-NL-GB-D-DAILY--210817-01;BDL-NL-GB;00:00;167;0;167;1041;77.05;167;11;4
2021;Aug;17.08.2021;18.08.2021;BDL-NL-GB-D-DAILY--210817-01;BDL-NL-GB;01:00;167;0;167;1041;58.56;167;11;5
2021;Aug;17.08.2021;18.08.2021;BDL-NL-GB-D-DAILY--210817-01;BDL-NL-GB;02:00;167;0;167;1046;41.56;167;11;6
2021;Aug;17.08.2021;18.08.2021;BDL-NL-GB-D-DAILY--210817-01;BDL-NL-GB;03:00;167;0;167;965;36.31;167;11;5
2021;Aug;17.08.2021;18.08.2021;BDL-NL-GB-D-DAILY--210817-01;BDL-NL-GB;04:00;167;0;167;965;25.08;167;11;5
2021;Aug;17.08.2021;18.08.2021;BDL-NL-GB-D-DAILY--210817-01;BDL-NL-GB;05:00;167;0;167;935;33.71;167;11;5
2021;Aug;17.08.2021;18.08.2021;BDL-NL-GB-D-DAILY--210817-01;BDL-NL-GB;06:00;167;0;167;935;17.6;167;11;6
2021;Aug;17.08.2021;18.08.2021;BDL-NL-GB-D-DAILY--210817-01;BDL-NL-GB;07:00;167;0;167;1025;15.12;167;11;5
2021;Aug;17.08.2021;18.08.2021;BDL-NL-GB-D-DAILY--210817-01;BDL-NL-GB;08:00;167;0;167;919;10.72;167;11;3
2021;Aug;17.08.2021;18.08.2021;BDL-NL-GB-D-DAILY--210817-01;BDL-NL-GB;09:00;167;0;167;1041;33.68;167;11;6
2021;Aug;17.08.2021;18.08.2021;BDL-NL-GB-D-DAILY--210817-01;BDL-NL-GB;10:00;167;0;167;1041;47.4;167;11;5
2021;Aug;17.08.2021;18.08.2021;BDL-NL-GB-D-DAILY--210817-01;BDL-NL-GB;11:00;167;0;167;1041;47.4;167;11;7
2021;Aug;17.08.2021;18.08.2021;BDL-NL-GB-D-DAILY--210817-01;BDL-NL-GB;12:00;167;0;167;1041;49.97;167;11;8
2021;Aug;17.08.2021;18.08.2021;BDL-NL-GB-D-DAILY--210817-01;BDL-NL-GB;13:00;167;0;167;1041;55.75;167;11;6
2021;Aug;17.08.2021;18.08.2021;BDL-NL-GB-D-DAILY--210817-01;BDL-NL-GB;14:00;167;0;167;1046;47.56;167;11;5
2021;Aug;17.08.2021;18.08.2021;BDL-NL-GB-D-DAILY--210817-01;BDL-NL-GB;15:00;167;0;167;1046;37.88;167;11;6
2021;Aug;17.08.2021;18.08.2021;BDL-NL-GB-D-DAILY--210817-01;BDL-NL-GB;16:00;167;0;167;1041;27.58;167;11;5
2021;Aug;17.08.2021;18.08.2021;BDL-NL-GB-D-DAILY--210817-01;BDL-NL-GB;17:00;167;0;167;1041;29.47;167;11;6
2021;Aug;17.08.2021;18.08.2021;BDL-NL-GB-D-DAILY--210817-01;BDL-NL-GB;18:00;167;0;167;1041;28.22;167;11;7
2021;Aug;17.08.2021;18.08.2021;BDL-NL-GB-D-DAILY--210817-01;BDL-NL-GB;19:00;167;0;167;1025;23.17;167;11;5
2021;Aug;17.08.2021;18.08.2021;BDL-NL-GB-D-DAILY--210817-01;BDL-NL-GB;20:00;167;0;167;1025;23.37;167;11;5
2021;Aug;17.08.2021;18.08.2021;BDL-NL-GB-D-DAILY--210817-01;BDL-NL-GB;21:00;167;0;167;1025;16.22;166;11;5
2021;Aug;17.08.2021;18.08.2021;BDL-NL-GB-D-DAILY--210817-01;BDL-NL-GB;22:00;167;0;167;1041;14;167;11;8
2021;Aug;17.08.2021;18.08.2021;BDL-NL-GB-D-DAILY--210817-01;BDL-NL-GB;23:00;167;0;167;1000;8.15;167;11;5
2021;Aug;18.08.2021;19.08.2021;BDL-NL-GB-D-DAILY--210818-01;BDL-NL-GB;00:00;167;0;167;966;36.76;167;11;5
2021;Aug;18.08.2021;19.08.2021;BDL-NL-GB-D-DAILY--210818-01;BDL-NL-GB;01:00;167;0;167;966;37.69;167;11;5
2021;Aug;18.08.2021;19.08.2021;BDL-NL-GB-D-DAILY--210818-01;BDL-NL-GB;02:00;167;0;167;966;36.71;167;11;5
2021;Aug;18.08.2021;19.08.2021;BDL-NL-GB-D-DAILY--210818-01;BDL-NL-GB;03:00;167;0;167;961;31.25;167;11;4
2021;Aug;18.08.2021;19.08.2021;BDL-NL-GB-D-DAILY--210818-01;BDL-NL-GB;04:00;167;0;167;806;13.81;167;11;5
2021;Aug;18.08.2021;19.08.2021;BDL-NL-GB-D-DAILY--210818-01;BDL-NL-GB;05:00;167;0;167;806;5.87;167;11;6
2021;Aug;18.08.2021;19.08.2021;BDL-NL-GB-D-DAILY--210818-01;BDL-NL-GB;06:00;167;0;167;829;2.19;167;11;4
2021;Aug;18.08.2021;19.08.2021;BDL-NL-GB-D-DAILY--210818-01;BDL-NL-GB;07:00;167;0;167;851;24.16;167;11;4
2021;Aug;18.08.2021;19.08.2021;BDL-NL-GB-D-DAILY--210818-01;BDL-NL-GB;08:00;167;0;167;945;40.5;167;11;5
2021;Aug;18.08.2021;19.08.2021;BDL-NL-GB-D-DAILY--210818-01;BDL-NL-GB;09:00;167;0;167;961;46.24;167;11;5
2021;Aug;18.08.2021;19.08.2021;BDL-NL-GB-D-DAILY--210818-01;BDL-NL-GB;10:00;167;0;167;961;41.58;167;11;8
2021;Aug;18.08.2021;19.08.2021;BDL-NL-GB-D-DAILY--210818-01;BDL-NL-GB;11:00;167;0;167;961;47.67;167;11;7
2021;Aug;18.08.2021;19.08.2021;BDL-NL-GB-D-DAILY--210818-01;BDL-NL-GB;12:00;167;0;167;966;40.2;167;11;6
2021;Aug;18.08.2021;19.08.2021;BDL-NL-GB-D-DAILY--210818-01;BDL-NL-GB;13:00;167;0;167;966;32.26;167;11;7
2021;Aug;18.08.2021;19.08.2021;BDL-NL-GB-D-DAILY--210818-01;BDL-NL-GB;14:00;167;0;167;961;28.55;167;11;7
2021;Aug;18.08.2021;19.08.2021;BDL-NL-GB-D-DAILY--210818-01;BDL-NL-GB;15:00;167;0;167;961;31.57;167;11;5
2021;Aug;18.08.2021;19.08.2021;BDL-NL-GB-D-DAILY--210818-01;BDL-NL-GB;16:00;167;0;167;961;39.68;167;11;6
2021;Aug;18.08.2021;19.08.2021;BDL-NL-GB-D-DAILY--210818-01;BDL-NL-GB;17:00;167;0;167;961;38.73;167;11;6
2021;Aug;18.08.2021;19.08.2021;BDL-NL-GB-D-DAILY--210818-01;BDL-NL-GB;18:00;167;0;167;945;28.57;167;11;6
2021;Aug;18.08.2021;19.08.2021;BDL-NL-GB-D-DAILY--210818-01;BDL-NL-GB;19:00;167;0;167;945;24.49;167;11;5
2021;Aug;18.08.2021;19.08.2021;BDL-NL-GB-D-DAILY--210818-01;BDL-NL-GB;20:00;167;0;167;961;26.56;167;11;6
2021;Aug;18.08.2021;19.08.2021;BDL-NL-GB-D-DAILY--210818-01;BDL-NL-GB;21:00;167;0;167;822;17.14;167;11;6
2021;Aug;18.08.2021;19.08.2021;BDL-NL-GB-D-DAILY--210818-01;BDL-NL-GB;22:00;167;0;167;961;44.46;167;11;5
2021;Aug;18.08.2021;19.08.2021;BDL-NL-GB-D-DAILY--210818-01;BDL-NL-GB;23:00;167;0;167;961;38.4;167;11;5
2021;Aug;19.08.2021;20.08.2021;BDL-NL-GB-D-DAILY--210819-01;BDL-NL-GB;00:00;167;0;167;997;65.14;167;12;7
2021;Aug;19.08.2021;20.08.2021;BDL-NL-GB-D-DAILY--210819-01;BDL-NL-GB;01:00;167;0;167;997;52.82;167;12;6
2021;Aug;19.08.2021;20.08.2021;BDL-NL-GB-D-DAILY--210819-01;BDL-NL-GB;02:00;167;0;167;1002;49.95;167;12;7
2021;Aug;19.08.2021;20.08.2021;BDL-NL-GB-D-DAILY--210819-01;BDL-NL-GB;03:00;167;0;167;1052;45.7;167;12;6
2021;Aug;19.08.2021;20.08.2021;BDL-NL-GB-D-DAILY--210819-01;BDL-NL-GB;04:00;167;0;167;1052;45.73;167;12;5
2021;Aug;19.08.2021;20.08.2021;BDL-NL-GB-D-DAILY--210819-01;BDL-NL-GB;05:00;167;0;167;1047;40.53;167;12;5
2021;Aug;19.08.2021;20.08.2021;BDL-NL-GB-D-DAILY--210819-01;BDL-NL-GB;06:00;167;0;167;1031;22.58;167;12;5
2021;Aug;19.08.2021;20.08.2021;BDL-NL-GB-D-DAILY--210819-01;BDL-NL-GB;07:00;167;0;167;967;16.93;167;12;6
2021;Aug;19.08.2021;20.08.2021;BDL-NL-GB-D-DAILY--210819-01;BDL-NL-GB;08:00;167;0;167;918;13.01;167;12;5
2021;Aug;19.08.2021;20.08.2021;BDL-NL-GB-D-DAILY--210819-01;BDL-NL-GB;09:00;167;0;167;1047;45.96;167;12;8
2021;Aug;19.08.2021;20.08.2021;BDL-NL-GB-D-DAILY--210819-01;BDL-NL-GB;10:00;167;0;167;1047;60.71;167;12;5
2021;Aug;19.08.2021;20.08.2021;BDL-NL-GB-D-DAILY--210819-01;BDL-NL-GB;11:00;167;0;167;1047;53.65;167;12;7
2021;Aug;19.08.2021;20.08.2021;BDL-NL-GB-D-DAILY--210819-01;BDL-NL-GB;12:00;167;0;167;1047;60.55;167;12;7
2021;Aug;19.08.2021;20.08.2021;BDL-NL-GB-D-DAILY--210819-01;BDL-NL-GB;13:00;167;0;167;1047;61.73;167;12;7
2021;Aug;19.08.2021;20.08.2021;BDL-NL-GB-D-DAILY--210819-01;BDL-NL-GB;14:00;167;0;167;1052;48.94;167;12;7
2021;Aug;19.08.2021;20.08.2021;BDL-NL-GB-D-DAILY--210819-01;BDL-NL-GB;15:00;167;0;167;1052;37.14;167;12;7
2021;Aug;19.08.2021;20.08.2021;BDL-NL-GB-D-DAILY--210819-01;BDL-NL-GB;16:00;167;0;167;1047;41.15;167;12;7
2021;Aug;19.08.2021;20.08.2021;BDL-NL-GB-D-DAILY--210819-01;BDL-NL-GB;17:00;167;0;167;1047;62.81;167;12;5
2021;Aug;19.08.2021;20.08.2021;BDL-NL-GB-D-DAILY--210819-01;BDL-NL-GB;18:00;167;0;167;1031;77.33;167;12;4
2021;Aug;19.08.2021;20.08.2021;BDL-NL-GB-D-DAILY--210819-01;BDL-NL-GB;19:00;167;0;167;1031;84.1;167;12;8
2021;Aug;19.08.2021;20.08.2021;BDL-NL-GB-D-DAILY--210819-01;BDL-NL-GB;20:00;167;0;167;1031;68.85;167;12;8
2021;Aug;19.08.2021;20.08.2021;BDL-NL-GB-D-DAILY--210819-01;BDL-NL-GB;21:00;167;0;167;1031;50.23;167;12;8
2021;Aug;19.08.2021;20.08.2021;BDL-NL-GB-D-DAILY--210819-01;BDL-NL-GB;22:00;167;0;167;1031;46.39;167;12;8
2021;Aug;19.08.2021;20.08.2021;BDL-NL-GB-D-DAILY--210819-01;BDL-NL-GB;23:00;167;0;167;971;16.74;167;12;8
2021;Aug;20.08.2021;21.08.2021;BDL-NL-GB-D-DAILY--210820-01;BDL-NL-GB;00:00;167;0;167;1028;34.97;167;12;7
2021;Aug;20.08.2021;21.08.2021;BDL-NL-GB-D-DAILY--210820-01;BDL-NL-GB;01:00;167;0;167;1028;32.78;167;12;6
2021;Aug;20.08.2021;21.08.2021;BDL-NL-GB-D-DAILY--210820-01;BDL-NL-GB;02:00;167;0;167;1099;29.23;167;12;6
2021;Aug;20.08.2021;21.08.2021;BDL-NL-GB-D-DAILY--210820-01;BDL-NL-GB;03:00;167;0;167;1099;27.59;167;12;5
2021;Aug;20.08.2021;21.08.2021;BDL-NL-GB-D-DAILY--210820-01;BDL-NL-GB;04:00;167;0;167;1083;24.87;167;12;6
2021;Aug;20.08.2021;21.08.2021;BDL-NL-GB-D-DAILY--210820-01;BDL-NL-GB;05:00;167;0;167;1078;19.15;167;12;5
2021;Aug;20.08.2021;21.08.2021;BDL-NL-GB-D-DAILY--210820-01;BDL-NL-GB;06:00;167;0;167;1062;2.99;167;12;4
2021;Aug;20.08.2021;21.08.2021;BDL-NL-GB-D-DAILY--210820-01;BDL-NL-GB;07:00;167;0;167;1062;0.58;167;12;5
2021;Aug;20.08.2021;21.08.2021;BDL-NL-GB-D-DAILY--210820-01;BDL-NL-GB;08:00;167;0;167;1062;0.41;167;12;6
2021;Aug;20.08.2021;21.08.2021;BDL-NL-GB-D-DAILY--210820-01;BDL-NL-GB;09:00;167;0;167;1078;28.61;167;12;6
2021;Aug;20.08.2021;21.08.2021;BDL-NL-GB-D-DAILY--210820-01;BDL-NL-GB;10:00;167;0;167;1078;42.01;167;12;5
2021;Aug;20.08.2021;21.08.2021;BDL-NL-GB-D-DAILY--210820-01;BDL-NL-GB;11:00;167;0;167;1078;40.84;167;12;6
2021;Aug;20.08.2021;21.08.2021;BDL-NL-GB-D-DAILY--210820-01;BDL-NL-GB;12:00;167;0;167;1078;37.05;167;12;6
2021;Aug;20.08.2021;21.08.2021;BDL-NL-GB-D-DAILY--210820-01;BDL-NL-GB;13:00;167;0;167;1078;49.52;167;12;5
2021;Aug;20.08.2021;21.08.2021;BDL-NL-GB-D-DAILY--210820-01;BDL-NL-GB;14:00;167;0;167;1083;38.02;167;12;4
2021;Aug;20.08.2021;21.08.2021;BDL-NL-GB-D-DAILY--210820-01;BDL-NL-GB;15:00;167;0;167;1099;29.91;167;12;6
2021;Aug;20.08.2021;21.08.2021;BDL-NL-GB-D-DAILY--210820-01;BDL-NL-GB;16:00;167;0;167;1094;27;167;12;7
2021;Aug;20.08.2021;21.08.2021;BDL-NL-GB-D-DAILY--210820-01;BDL-NL-GB;17:00;167;0;167;1078;30.55;167;12;5
2021;Aug;20.08.2021;21.08.2021;BDL-NL-GB-D-DAILY--210820-01;BDL-NL-GB;18:00;167;0;167;1078;33.21;167;12;7
2021;Aug;20.08.2021;21.08.2021;BDL-NL-GB-D-DAILY--210820-01;BDL-NL-GB;19:00;167;0;167;1078;22.43;167;12;8
2021;Aug;20.08.2021;21.08.2021;BDL-NL-GB-D-DAILY--210820-01;BDL-NL-GB;20:00;167;0;167;1078;14.93;167;12;6
2021;Aug;20.08.2021;21.08.2021;BDL-NL-GB-D-DAILY--210820-01;BDL-NL-GB;21:00;167;0;167;1078;11.9;167;12;6
2021;Aug;20.08.2021;21.08.2021;BDL-NL-GB-D-DAILY--210820-01;BDL-NL-GB;22:00;167;0;167;1028;13.88;167;12;6
2021;Aug;20.08.2021;21.08.2021;BDL-NL-GB-D-DAILY--210820-01;BDL-NL-GB;23:00;167;0;167;1037;6.68;167;12;5
2021;Aug;21.08.2021;22.08.2021;BDL-NL-GB-D-DAILY--210821-01;BDL-NL-GB;00:00;142;0;142;1002;26.82;142;12;5
2021;Aug;21.08.2021;22.08.2021;BDL-NL-GB-D-DAILY--210821-01;BDL-NL-GB;01:00;142;0;142;1002;19.14;142;12;6
2021;Aug;21.08.2021;22.08.2021;BDL-NL-GB-D-DAILY--210821-01;BDL-NL-GB;02:00;142;0;142;1023;19.19;142;12;6
2021;Aug;21.08.2021;22.08.2021;BDL-NL-GB-D-DAILY--210821-01;BDL-NL-GB;03:00;142;0;142;1023;19.42;142;12;5
2021;Aug;21.08.2021;22.08.2021;BDL-NL-GB-D-DAILY--210821-01;BDL-NL-GB;04:00;142;0;142;1023;16.19;142;12;5
2021;Aug;21.08.2021;22.08.2021;BDL-NL-GB-D-DAILY--210821-01;BDL-NL-GB;05:00;142;0;142;1018;14.26;142;12;5
2021;Aug;21.08.2021;22.08.2021;BDL-NL-GB-D-DAILY--210821-01;BDL-NL-GB;06:00;142;0;142;903;12.79;142;12;6
2021;Aug;21.08.2021;22.08.2021;BDL-NL-GB-D-DAILY--210821-01;BDL-NL-GB;07:00;142;0;142;903;12.17;142;12;6
2021;Aug;21.08.2021;22.08.2021;BDL-NL-GB-D-DAILY--210821-01;BDL-NL-GB;08:00;142;0;142;903;14.04;142;12;4
2021;Aug;21.08.2021;22.08.2021;BDL-NL-GB-D-DAILY--210821-01;BDL-NL-GB;09:00;142;0;142;1002;25.13;142;12;7
2021;Aug;21.08.2021;22.08.2021;BDL-NL-GB-D-DAILY--210821-01;BDL-NL-GB;10:00;142;0;142;1002;41.77;142;12;5
2021;Aug;21.08.2021;22.08.2021;BDL-NL-GB-D-DAILY--210821-01;BDL-NL-GB;11:00;142;0;142;1007;52.41;142;12;7
2021;Aug;21.08.2021;22.08.2021;BDL-NL-GB-D-DAILY--210821-01;BDL-NL-GB;12:00;142;0;142;1007;55.01;142;12;7
2021;Aug;21.08.2021;22.08.2021;BDL-NL-GB-D-DAILY--210821-01;BDL-NL-GB;13:00;142;0;142;1002;60.69;142;12;6
2021;Aug;21.08.2021;22.08.2021;BDL-NL-GB-D-DAILY--210821-01;BDL-NL-GB;14:00;142;0;142;1023;42.79;142;12;6
2021;Aug;21.08.2021;22.08.2021;BDL-NL-GB-D-DAILY--210821-01;BDL-NL-GB;15:00;142;0;142;1023;31.07;142;12;5
2021;Aug;21.08.2021;22.08.2021;BDL-NL-GB-D-DAILY--210821-01;BDL-NL-GB;16:00;142;0;142;1002;24.09;142;12;6
2021;Aug;21.08.2021;22.08.2021;BDL-NL-GB-D-DAILY--210821-01;BDL-NL-GB;17:00;142;0;142;1002;31.26;142;12;6
2021;Aug;21.08.2021;22.08.2021;BDL-NL-GB-D-DAILY--210821-01;BDL-NL-GB;18:00;142;0;142;1002;35.89;142;12;7
2021;Aug;21.08.2021;22.08.2021;BDL-NL-GB-D-DAILY--210821-01;BDL-NL-GB;19:00;142;0;142;1002;43.42;142;12;7
2021;Aug;21.08.2021;22.08.2021;BDL-NL-GB-D-DAILY--210821-01;BDL-NL-GB;20:00;142;0;142;876;35.29;142;12;6
2021;Aug;21.08.2021;22.08.2021;BDL-NL-GB-D-DAILY--210821-01;BDL-NL-GB;21:00;142;0;142;961;27.14;142;12;5
2021;Aug;21.08.2021;22.08.2021;BDL-NL-GB-D-DAILY--210821-01;BDL-NL-GB;22:00;142;0;142;894;24.7;142;12;5
2021;Aug;21.08.2021;22.08.2021;BDL-NL-GB-D-DAILY--210821-01;BDL-NL-GB;23:00;142;0;142;914;13.85;142;12;6
2021;Aug;22.08.2021;23.08.2021;BDL-NL-GB-D-DAILY--210822-01;BDL-NL-GB;00:00;142;0;142;782;35.89;142;10;4
2021;Aug;22.08.2021;23.08.2021;BDL-NL-GB-D-DAILY--210822-01;BDL-NL-GB;01:00;142;0;142;782;28.06;142;10;6
2021;Aug;22.08.2021;23.08.2021;BDL-NL-GB-D-DAILY--210822-01;BDL-NL-GB;02:00;142;0;142;787;19.87;142;10;6
2021;Aug;22.08.2021;23.08.2021;BDL-NL-GB-D-DAILY--210822-01;BDL-NL-GB;03:00;142;0;142;787;30.02;142;10;5
2021;Aug;22.08.2021;23.08.2021;BDL-NL-GB-D-DAILY--210822-01;BDL-NL-GB;04:00;142;0;142;723;28.97;142;10;5
2021;Aug;22.08.2021;23.08.2021;BDL-NL-GB-D-DAILY--210822-01;BDL-NL-GB;05:00;142;0;142;686;23.81;142;10;5
2021;Aug;22.08.2021;23.08.2021;BDL-NL-GB-D-DAILY--210822-01;BDL-NL-GB;06:00;142;0;142;686;25.18;142;10;4
2021;Aug;22.08.2021;23.08.2021;BDL-NL-GB-D-DAILY--210822-01;BDL-NL-GB;07:00;142;0;142;686;21.54;142;10;6
2021;Aug;22.08.2021;23.08.2021;BDL-NL-GB-D-DAILY--210822-01;BDL-NL-GB;08:00;142;0;142;686;20.45;142;10;6
2021;Aug;22.08.2021;23.08.2021;BDL-NL-GB-D-DAILY--210822-01;BDL-NL-GB;09:00;142;0;142;782;29.97;142;10;6
2021;Aug;22.08.2021;23.08.2021;BDL-NL-GB-D-DAILY--210822-01;BDL-NL-GB;10:00;142;0;142;782;47.15;142;10;7
2021;Aug;22.08.2021;23.08.2021;BDL-NL-GB-D-DAILY--210822-01;BDL-NL-GB;11:00;142;0;142;782;49.35;142;10;7
2021;Aug;22.08.2021;23.08.2021;BDL-NL-GB-D-DAILY--210822-01;BDL-NL-GB;12:00;142;0;142;782;52.59;142;10;5
2021;Aug;22.08.2021;23.08.2021;BDL-NL-GB-D-DAILY--210822-01;BDL-NL-GB;13:00;142;0;142;782;57.18;142;10;6
2021;Aug;22.08.2021;23.08.2021;BDL-NL-GB-D-DAILY--210822-01;BDL-NL-GB;14:00;142;0;142;787;37.81;142;10;6
2021;Aug;22.08.2021;23.08.2021;BDL-NL-GB-D-DAILY--210822-01;BDL-NL-GB;15:00;142;0;142;787;31.42;142;10;6
2021;Aug;22.08.2021;23.08.2021;BDL-NL-GB-D-DAILY--210822-01;BDL-NL-GB;16:00;142;0;142;782;29.57;142;10;6
2021;Aug;22.08.2021;23.08.2021;BDL-NL-GB-D-DAILY--210822-01;BDL-NL-GB;17:00;142;0;142;790;42.7;142;10;6
2021;Aug;22.08.2021;23.08.2021;BDL-NL-GB-D-DAILY--210822-01;BDL-NL-GB;18:00;142;0;142;790;48.48;142;10;5
2021;Aug;22.08.2021;23.08.2021;BDL-NL-GB-D-DAILY--210822-01;BDL-NL-GB;19:00;142;0;142;774;45.48;142;10;4
2021;Aug;22.08.2021;23.08.2021;BDL-NL-GB-D-DAILY--210822-01;BDL-NL-GB;20:00;142;0;142;774;42.39;142;10;4
2021;Aug;22.08.2021;23.08.2021;BDL-NL-GB-D-DAILY--210822-01;BDL-NL-GB;21:00;142;0;142;774;39.09;142;10;4
2021;Aug;22.08.2021;23.08.2021;BDL-NL-GB-D-DAILY--210822-01;BDL-NL-GB;22:00;142;0;142;774;37.52;142;10;4
2021;Aug;22.08.2021;23.08.2021;BDL-NL-GB-D-DAILY--210822-01;BDL-NL-GB;23:00;142;0;142;774;16.64;142;10;4
2021;Aug;23.08.2021;24.08.2021;BDL-NL-GB-D-DAILY--210823-01;BDL-NL-GB;00:00;167;0;167;849;45.64;167;10;6
2021;Aug;23.08.2021;24.08.2021;BDL-NL-GB-D-DAILY--210823-01;BDL-NL-GB;01:00;167;0;167;849;38.34;167;10;6
2021;Aug;23.08.2021;24.08.2021;BDL-NL-GB-D-DAILY--210823-01;BDL-NL-GB;02:00;167;0;167;854;38.5;167;10;6
2021;Aug;23.08.2021;24.08.2021;BDL-NL-GB-D-DAILY--210823-01;BDL-NL-GB;03:00;167;0;167;854;34.03;167;10;6
2021;Aug;23.08.2021;24.08.2021;BDL-NL-GB-D-DAILY--210823-01;BDL-NL-GB;04:00;167;0;167;854;30.93;167;10;6
2021;Aug;23.08.2021;24.08.2021;BDL-NL-GB-D-DAILY--210823-01;BDL-NL-GB;05:00;167;0;167;849;23.19;167;10;5
2021;Aug;23.08.2021;24.08.2021;BDL-NL-GB-D-DAILY--210823-01;BDL-NL-GB;06:00;167;0;167;706;10.73;167;10;5
2021;Aug;23.08.2021;24.08.2021;BDL-NL-GB-D-DAILY--210823-01;BDL-NL-GB;07:00;167;0;167;737;7.24;167;10;3
2021;Aug;23.08.2021;24.08.2021;BDL-NL-GB-D-DAILY--210823-01;BDL-NL-GB;08:00;167;0;167;721;2.13;167;10;4
2021;Aug;23.08.2021;24.08.2021;BDL-NL-GB-D-DAILY--210823-01;BDL-NL-GB;09:00;167;0;167;825;33.77;167;10;5
2021;Aug;23.08.2021;24.08.2021;BDL-NL-GB-D-DAILY--210823-01;BDL-NL-GB;10:00;167;0;167;841;44.03;167;10;6
2021;Aug;23.08.2021;24.08.2021;BDL-NL-GB-D-DAILY--210823-01;BDL-NL-GB;11:00;167;0;167;849;35.9;167;10;6
2021;Aug;23.08.2021;24.08.2021;BDL-NL-GB-D-DAILY--210823-01;BDL-NL-GB;12:00;167;0;167;849;35;167;10;6
2021;Aug;23.08.2021;24.08.2021;BDL-NL-GB-D-DAILY--210823-01;BDL-NL-GB;13:00;167;0;167;849;40.87;167;10;5
2021;Aug;23.08.2021;24.08.2021;BDL-NL-GB-D-DAILY--210823-01;BDL-NL-GB;14:00;167;0;167;768;28.53;167;10;5
2021;Aug;23.08.2021;24.08.2021;BDL-NL-GB-D-DAILY--210823-01;BDL-NL-GB;15:00;167;0;167;758;23.71;167;10;5
2021;Aug;23.08.2021;24.08.2021;BDL-NL-GB-D-DAILY--210823-01;BDL-NL-GB;16:00;167;0;167;753;21.36;167;10;4
2021;Aug;23.08.2021;24.08.2021;BDL-NL-GB-D-DAILY--210823-01;BDL-NL-GB;17:00;167;0;167;823;28.38;167;10;6
2021;Aug;23.08.2021;24.08.2021;BDL-NL-GB-D-DAILY--210823-01;BDL-NL-GB;18:00;167;0;167;817;35.99;167;10;5
2021;Aug;23.08.2021;24.08.2021;BDL-NL-GB-D-DAILY--210823-01;BDL-NL-GB;19:00;167;0;167;817;43.97;167;10;5
2021;Aug;23.08.2021;24.08.2021;BDL-NL-GB-D-DAILY--210823-01;BDL-NL-GB;20:00;167;0;167;817;41.5;167;10;4
2021;Aug;23.08.2021;24.08.2021;BDL-NL-GB-D-DAILY--210823-01;BDL-NL-GB;21:00;167;0;167;757;36.39;167;10;4
2021;Aug;23.08.2021;24.08.2021;BDL-NL-GB-D-DAILY--210823-01;BDL-NL-GB;22:00;167;0;167;757;36.71;167;10;4
2021;Aug;23.08.2021;24.08.2021;BDL-NL-GB-D-DAILY--210823-01;BDL-NL-GB;23:00;167;0;167;757;18.68;167;10;4
2021;Aug;24.08.2021;25.08.2021;BDL-NL-GB-D-DAILY--210824-01;BDL-NL-GB;00:00;167;0;167;926;42.51;167;12;6
2021;Aug;24.08.2021;25.08.2021;BDL-NL-GB-D-DAILY--210824-01;BDL-NL-GB;01:00;167;0;167;926;30.71;167;12;7
2021;Aug;24.08.2021;25.08.2021;BDL-NL-GB-D-DAILY--210824-01;BDL-NL-GB;02:00;167;0;167;981;25.23;167;12;8
2021;Aug;24.08.2021;25.08.2021;BDL-NL-GB-D-DAILY--210824-01;BDL-NL-GB;03:00;167;0;167;981;25.95;167;12;6
2021;Aug;24.08.2021;25.08.2021;BDL-NL-GB-D-DAILY--210824-01;BDL-NL-GB;04:00;167;0;167;981;22.81;167;12;6
2021;Aug;24.08.2021;25.08.2021;BDL-NL-GB-D-DAILY--210824-01;BDL-NL-GB;05:00;167;0;167;976;18.98;167;12;6
2021;Aug;24.08.2021;25.08.2021;BDL-NL-GB-D-DAILY--210824-01;BDL-NL-GB;06:00;167;0;167;860;7.15;167;12;6
2021;Aug;24.08.2021;25.08.2021;BDL-NL-GB-D-DAILY--210824-01;BDL-NL-GB;07:00;167;0;167;944;1.47;167;12;6
2021;Aug;24.08.2021;25.08.2021;BDL-NL-GB-D-DAILY--210824-01;BDL-NL-GB;08:00;167;0;167;944;0.98;167;12;6
2021;Aug;24.08.2021;25.08.2021;BDL-NL-GB-D-DAILY--210824-01;BDL-NL-GB;09:00;167;0;167;960;30.69;167;12;7
2021;Aug;24.08.2021;25.08.2021;BDL-NL-GB-D-DAILY--210824-01;BDL-NL-GB;10:00;167;0;167;960;42.19;167;12;6
2021;Aug;24.08.2021;25.08.2021;BDL-NL-GB-D-DAILY--210824-01;BDL-NL-GB;11:00;167;0;167;960;41.08;167;12;7
2021;Aug;24.08.2021;25.08.2021;BDL-NL-GB-D-DAILY--210824-01;BDL-NL-GB;12:00;167;0;167;960;34.51;167;12;7
2021;Aug;24.08.2021;25.08.2021;BDL-NL-GB-D-DAILY--210824-01;BDL-NL-GB;13:00;167;0;167;960;35.14;167;12;7
2021;Aug;24.08.2021;25.08.2021;BDL-NL-GB-D-DAILY--210824-01;BDL-NL-GB;14:00;167;0;167;981;31.76;167;12;6
2021;Aug;24.08.2021;25.08.2021;BDL-NL-GB-D-DAILY--210824-01;BDL-NL-GB;15:00;167;0;167;981;24.32;167;12;6
2021;Aug;24.08.2021;25.08.2021;BDL-NL-GB-D-DAILY--210824-01;BDL-NL-GB;16:00;167;0;167;976;21.73;167;12;6
2021;Aug;24.08.2021;25.08.2021;BDL-NL-GB-D-DAILY--210824-01;BDL-NL-GB;17:00;167;0;167;960;35.49;167;12;4
2021;Aug;24.08.2021;25.08.2021;BDL-NL-GB-D-DAILY--210824-01;BDL-NL-GB;18:00;167;0;167;960;59.77;167;12;6
2021;Aug;24.08.2021;25.08.2021;BDL-NL-GB-D-DAILY--210824-01;BDL-NL-GB;19:00;167;0;167;960;67.75;167;12;4
2021;Aug;24.08.2021;25.08.2021;BDL-NL-GB-D-DAILY--210824-01;BDL-NL-GB;20:00;167;0;167;960;74.74;167;12;5
2021;Aug;24.08.2021;25.08.2021;BDL-NL-GB-D-DAILY--210824-01;BDL-NL-GB;21:00;167;0;167;960;73.27;167;12;5
2021;Aug;24.08.2021;25.08.2021;BDL-NL-GB-D-DAILY--210824-01;BDL-NL-GB;22:00;167;0;167;960;51.74;167;12;6
2021;Aug;24.08.2021;25.08.2021;BDL-NL-GB-D-DAILY--210824-01;BDL-NL-GB;23:00;167;0;167;960;20.01;167;12;6
2021;Aug;25.08.2021;26.08.2021;BDL-NL-GB-D-DAILY--210825-01;BDL-NL-GB;00:00;167;0;167;952;33.76;167;11;6
2021;Aug;25.08.2021;26.08.2021;BDL-NL-GB-D-DAILY--210825-01;BDL-NL-GB;01:00;167;0;167;952;27.89;167;11;6
2021;Aug;25.08.2021;26.08.2021;BDL-NL-GB-D-DAILY--210825-01;BDL-NL-GB;02:00;167;0;167;957;23.31;167;11;5
2021;Aug;25.08.2021;26.08.2021;BDL-NL-GB-D-DAILY--210825-01;BDL-NL-GB;03:00;167;0;167;957;20.32;167;11;5
2021;Aug;25.08.2021;26.08.2021;BDL-NL-GB-D-DAILY--210825-01;BDL-NL-GB;04:00;167;0;167;957;18.4;167;11;5
2021;Aug;25.08.2021;26.08.2021;BDL-NL-GB-D-DAILY--210825-01;BDL-NL-GB;05:00;167;0;167;952;11.19;167;11;6
2021;Aug;25.08.2021;26.08.2021;BDL-NL-GB-D-DAILY--210825-01;BDL-NL-GB;06:00;167;0;167;936;3.55;167;11;3
2021;Aug;25.08.2021;26.08.2021;BDL-NL-GB-D-DAILY--210825-01;BDL-NL-GB;07:00;167;0;167;875;0.6;167;11;5
2021;Aug;25.08.2021;26.08.2021;BDL-NL-GB-D-DAILY--210825-01;BDL-NL-GB;08:00;167;0;167;875;3.61;167;11;4
2021;Aug;25.08.2021;26.08.2021;BDL-NL-GB-D-DAILY--210825-01;BDL-NL-GB;09:00;167;0;167;936;43.02;167;11;5
2021;Aug;25.08.2021;26.08.2021;BDL-NL-GB-D-DAILY--210825-01;BDL-NL-GB;10:00;167;0;167;936;51.57;166;11;6
2021;Aug;25.08.2021;26.08.2021;BDL-NL-GB-D-DAILY--210825-01;BDL-NL-GB;11:00;167;0;167;936;53.04;167;11;6
2021;Aug;25.08.2021;26.08.2021;BDL-NL-GB-D-DAILY--210825-01;BDL-NL-GB;12:00;167;0;167;952;48.66;167;11;8
2021;Aug;25.08.2021;26.08.2021;BDL-NL-GB-D-DAILY--210825-01;BDL-NL-GB;13:00;167;0;167;952;56.43;167;11;6
2021;Aug;25.08.2021;26.08.2021;BDL-NL-GB-D-DAILY--210825-01;BDL-NL-GB;14:00;167;0;167;957;47.75;167;11;5
2021;Aug;25.08.2021;26.08.2021;BDL-NL-GB-D-DAILY--210825-01;BDL-NL-GB;15:00;167;0;167;957;38.85;167;11;6
2021;Aug;25.08.2021;26.08.2021;BDL-NL-GB-D-DAILY--210825-01;BDL-NL-GB;16:00;167;0;167;952;36.35;167;11;4
2021;Aug;25.08.2021;26.08.2021;BDL-NL-GB-D-DAILY--210825-01;BDL-NL-GB;17:00;167;0;167;952;35.66;167;11;7
2021;Aug;25.08.2021;26.08.2021;BDL-NL-GB-D-DAILY--210825-01;BDL-NL-GB;18:00;167;0;167;952;50.36;167;11;6
2021;Aug;25.08.2021;26.08.2021;BDL-NL-GB-D-DAILY--210825-01;BDL-NL-GB;19:00;167;0;167;952;48.87;167;11;7
2021;Aug;25.08.2021;26.08.2021;BDL-NL-GB-D-DAILY--210825-01;BDL-NL-GB;20:00;167;0;167;952;34.14;167;11;6
2021;Aug;25.08.2021;26.08.2021;BDL-NL-GB-D-DAILY--210825-01;BDL-NL-GB;21:00;167;0;167;952;23.85;167;11;6
2021;Aug;25.08.2021;26.08.2021;BDL-NL-GB-D-DAILY--210825-01;BDL-NL-GB;22:00;167;0;167;952;32.28;167;11;4
2021;Aug;25.08.2021;26.08.2021;BDL-NL-GB-D-DAILY--210825-01;BDL-NL-GB;23:00;167;0;167;952;22.07;167;11;4
2021;Aug;26.08.2021;27.08.2021;BDL-NL-GB-D-DAILY--210826-01;BDL-NL-GB;00:00;167;0;167;976;43.82;167;13;6
2021;Aug;26.08.2021;27.08.2021;BDL-NL-GB-D-DAILY--210826-01;BDL-NL-GB;01:00;167;0;167;975;40.31;167;13;7
2021;Aug;26.08.2021;27.08.2021;BDL-NL-GB-D-DAILY--210826-01;BDL-NL-GB;02:00;167;0;167;979;39.58;167;13;7
2021;Aug;26.08.2021;27.08.2021;BDL-NL-GB-D-DAILY--210826-01;BDL-NL-GB;03:00;167;0;167;978;36.45;167;13;8
2021;Aug;26.08.2021;27.08.2021;BDL-NL-GB-D-DAILY--210826-01;BDL-NL-GB;04:00;167;0;167;1007;34.38;167;13;8
2021;Aug;26.08.2021;27.08.2021;BDL-NL-GB-D-DAILY--210826-01;BDL-NL-GB;05:00;167;0;167;930;26.77;167;13;7
2021;Aug;26.08.2021;27.08.2021;BDL-NL-GB-D-DAILY--210826-01;BDL-NL-GB;06:00;167;0;167;886;12.52;167;13;4
2021;Aug;26.08.2021;27.08.2021;BDL-NL-GB-D-DAILY--210826-01;BDL-NL-GB;07:00;167;0;167;886;10;167;13;6
2021;Aug;26.08.2021;27.08.2021;BDL-NL-GB-D-DAILY--210826-01;BDL-NL-GB;08:00;167;0;167;967;7.75;167;13;4
2021;Aug;26.08.2021;27.08.2021;BDL-NL-GB-D-DAILY--210826-01;BDL-NL-GB;09:00;167;0;167;983;22.33;167;13;7
2021;Aug;26.08.2021;27.08.2021;BDL-NL-GB-D-DAILY--210826-01;BDL-NL-GB;10:00;167;0;167;999;38.49;167;13;8
2021;Aug;26.08.2021;27.08.2021;BDL-NL-GB-D-DAILY--210826-01;BDL-NL-GB;11:00;167;0;167;999;32.84;167;13;7
2021;Aug;26.08.2021;27.08.2021;BDL-NL-GB-D-DAILY--210826-01;BDL-NL-GB;12:00;167;0;167;999;29.16;167;13;7
2021;Aug;26.08.2021;27.08.2021;BDL-NL-GB-D-DAILY--210826-01;BDL-NL-GB;13:00;167;0;167;999;36.98;167;13;7
2021;Aug;26.08.2021;27.08.2021;BDL-NL-GB-D-DAILY--210826-01;BDL-NL-GB;14:00;167;0;167;1004;30.75;167;13;7
2021;Aug;26.08.2021;27.08.2021;BDL-NL-GB-D-DAILY--210826-01;BDL-NL-GB;15:00;167;0;167;1004;26.77;167;13;7
2021;Aug;26.08.2021;27.08.2021;BDL-NL-GB-D-DAILY--210826-01;BDL-NL-GB;16:00;167;0;167;999;22.41;167;13;8
2021;Aug;26.08.2021;27.08.2021;BDL-NL-GB-D-DAILY--210826-01;BDL-NL-GB;17:00;167;0;167;983;27.63;167;13;8
2021;Aug;26.08.2021;27.08.2021;BDL-NL-GB-D-DAILY--210826-01;BDL-NL-GB;18:00;167;0;167;983;26.96;167;13;8
2021;Aug;26.08.2021;27.08.2021;BDL-NL-GB-D-DAILY--210826-01;BDL-NL-GB;19:00;167;0;167;953;26.43;167;13;7
2021;Aug;26.08.2021;27.08.2021;BDL-NL-GB-D-DAILY--210826-01;BDL-NL-GB;20:00;167;0;167;953;26.14;167;13;6
2021;Aug;26.08.2021;27.08.2021;BDL-NL-GB-D-DAILY--210826-01;BDL-NL-GB;21:00;167;0;167;953;23.33;167;13;4
2021;Aug;26.08.2021;27.08.2021;BDL-NL-GB-D-DAILY--210826-01;BDL-NL-GB;22:00;167;0;167;845;20.03;167;13;5
2021;Aug;26.08.2021;27.08.2021;BDL-NL-GB-D-DAILY--210826-01;BDL-NL-GB;23:00;167;0;167;821;12.57;167;13;5
2021;Aug;27.08.2021;28.08.2021;BDL-NL-GB-D-DAILY--210827-01;BDL-NL-GB;00:00;110;0;110;767;29.98;110;11;6
2021;Aug;27.08.2021;28.08.2021;BDL-NL-GB-D-DAILY--210827-01;BDL-NL-GB;01:00;110;0;110;767;39.58;110;11;5
2021;Aug;27.08.2021;28.08.2021;BDL-NL-GB-D-DAILY--210827-01;BDL-NL-GB;02:00;110;0;110;772;37.24;110;11;5
2021;Aug;27.08.2021;28.08.2021;BDL-NL-GB-D-DAILY--210827-01;BDL-NL-GB;03:00;110;0;110;772;36.69;110;11;6
2021;Aug;27.08.2021;28.08.2021;BDL-NL-GB-D-DAILY--210827-01;BDL-NL-GB;04:00;110;0;110;772;34.77;110;11;5
2021;Aug;27.08.2021;28.08.2021;BDL-NL-GB-D-DAILY--210827-01;BDL-NL-GB;05:00;110;0;110;767;29.68;110;11;6
2021;Aug;27.08.2021;28.08.2021;BDL-NL-GB-D-DAILY--210827-01;BDL-NL-GB;06:00;110;0;110;751;15.5;110;11;6
2021;Aug;27.08.2021;28.08.2021;BDL-NL-GB-D-DAILY--210827-01;BDL-NL-GB;07:00;110;0;110;672;13.5;110;11;4
2021;Aug;27.08.2021;28.08.2021;BDL-NL-GB-D-DAILY--210827-01;BDL-NL-GB;08:00;110;0;110;687;11.53;110;11;4
2021;Aug;27.08.2021;28.08.2021;BDL-NL-GB-D-DAILY--210827-01;BDL-NL-GB;09:00;110;0;110;751;39.85;110;11;4
2021;Aug;27.08.2021;28.08.2021;BDL-NL-GB-D-DAILY--210827-01;BDL-NL-GB;10:00;110;0;110;767;48.82;110;11;6
2021;Aug;27.08.2021;28.08.2021;BDL-NL-GB-D-DAILY--210827-01;BDL-NL-GB;11:00;110;0;110;722;48.63;110;11;6
2021;Aug;27.08.2021;28.08.2021;BDL-NL-GB-D-DAILY--210827-01;BDL-NL-GB;12:00;110;0;110;722;48.26;110;11;6
2021;Aug;27.08.2021;28.08.2021;BDL-NL-GB-D-DAILY--210827-01;BDL-NL-GB;13:00;110;0;110;722;53.62;110;11;6
2021;Aug;27.08.2021;28.08.2021;BDL-NL-GB-D-DAILY--210827-01;BDL-NL-GB;14:00;110;0;110;727;41.57;110;11;5
2021;Aug;27.08.2021;28.08.2021;BDL-NL-GB-D-DAILY--210827-01;BDL-NL-GB;15:00;110;0;110;727;26.05;110;11;8
2021;Aug;27.08.2021;28.08.2021;BDL-NL-GB-D-DAILY--210827-01;BDL-NL-GB;16:00;110;0;110;722;26.14;110;11;7
2021;Aug;27.08.2021;28.08.2021;BDL-NL-GB-D-DAILY--210827-01;BDL-NL-GB;17:00;110;0;110;722;29.47;110;11;8
2021;Aug;27.08.2021;28.08.2021;BDL-NL-GB-D-DAILY--210827-01;BDL-NL-GB;18:00;110;0;110;767;43.96;110;11;7
2021;Aug;27.08.2021;28.08.2021;BDL-NL-GB-D-DAILY--210827-01;BDL-NL-GB;19:00;110;0;110;751;46.57;110;11;5
2021;Aug;27.08.2021;28.08.2021;BDL-NL-GB-D-DAILY--210827-01;BDL-NL-GB;20:00;110;0;110;751;39.95;110;11;5
2021;Aug;27.08.2021;28.08.2021;BDL-NL-GB-D-DAILY--210827-01;BDL-NL-GB;21:00;110;0;110;751;38.44;110;11;4
2021;Aug;27.08.2021;28.08.2021;BDL-NL-GB-D-DAILY--210827-01;BDL-NL-GB;22:00;110;0;110;751;29.68;110;11;6
2021;Aug;27.08.2021;28.08.2021;BDL-NL-GB-D-DAILY--210827-01;BDL-NL-GB;23:00;110;0;110;672;14.17;110;11;6
2021;Aug;28.08.2021;29.08.2021;BDL-NL-GB-D-DAILY--210828-01;BDL-NL-GB;00:00;100;0;100;680;40.02;100;11;6
2021;Aug;28.08.2021;29.08.2021;BDL-NL-GB-D-DAILY--210828-01;BDL-NL-GB;01:00;100;0;100;729;34.3;100;11;6
2021;Aug;28.08.2021;29.08.2021;BDL-NL-GB-D-DAILY--210828-01;BDL-NL-GB;02:00;100;0;100;729;31;100;11;7
2021;Aug;28.08.2021;29.08.2021;BDL-NL-GB-D-DAILY--210828-01;BDL-NL-GB;03:00;100;0;100;729;29;100;11;5
2021;Aug;28.08.2021;29.08.2021;BDL-NL-GB-D-DAILY--210828-01;BDL-NL-GB;04:00;100;0;100;729;27.06;100;11;5
2021;Aug;28.08.2021;29.08.2021;BDL-NL-GB-D-DAILY--210828-01;BDL-NL-GB;05:00;100;0;100;664;24.48;100;11;5
2021;Aug;28.08.2021;29.08.2021;BDL-NL-GB-D-DAILY--210828-01;BDL-NL-GB;06:00;100;0;100;664;23.76;100;11;5
2021;Aug;28.08.2021;29.08.2021;BDL-NL-GB-D-DAILY--210828-01;BDL-NL-GB;07:00;100;0;100;713;19;100;11;5
2021;Aug;28.08.2021;29.08.2021;BDL-NL-GB-D-DAILY--210828-01;BDL-NL-GB;08:00;100;0;100;713;17.63;100;11;5
2021;Aug;28.08.2021;29.08.2021;BDL-NL-GB-D-DAILY--210828-01;BDL-NL-GB;09:00;100;0;100;678;30;100;11;6
2021;Aug;28.08.2021;29.08.2021;BDL-NL-GB-D-DAILY--210828-01;BDL-NL-GB;10:00;100;0;100;694;51;100;11;5
2021;Aug;28.08.2021;29.08.2021;BDL-NL-GB-D-DAILY--210828-01;BDL-NL-GB;11:00;100;0;100;694;53.49;100;11;6
2021;Aug;28.08.2021;29.08.2021;BDL-NL-GB-D-DAILY--210828-01;BDL-NL-GB;12:00;100;0;100;694;50.82;100;11;7
2021;Aug;28.08.2021;29.08.2021;BDL-NL-GB-D-DAILY--210828-01;BDL-NL-GB;13:00;100;0;100;729;56.46;100;11;7
2021;Aug;28.08.2021;29.08.2021;BDL-NL-GB-D-DAILY--210828-01;BDL-NL-GB;14:00;100;0;100;729;47.27;100;11;6
2021;Aug;28.08.2021;29.08.2021;BDL-NL-GB-D-DAILY--210828-01;BDL-NL-GB;15:00;100;0;100;729;35.44;100;11;6
2021;Aug;28.08.2021;29.08.2021;BDL-NL-GB-D-DAILY--210828-01;BDL-NL-GB;16:00;100;0;100;729;31.55;100;11;5
2021;Aug;28.08.2021;29.08.2021;BDL-NL-GB-D-DAILY--210828-01;BDL-NL-GB;17:00;100;0;100;729;36.91;100;11;7
2021;Aug;28.08.2021;29.08.2021;BDL-NL-GB-D-DAILY--210828-01;BDL-NL-GB;18:00;100;0;100;729;44.55;100;11;6
2021;Aug;28.08.2021;29.08.2021;BDL-NL-GB-D-DAILY--210828-01;BDL-NL-GB;19:00;100;0;100;713;44;100;11;6
2021;Aug;28.08.2021;29.08.2021;BDL-NL-GB-D-DAILY--210828-01;BDL-NL-GB;20:00;100;0;100;713;44.57;100;11;6
2021;Aug;28.08.2021;29.08.2021;BDL-NL-GB-D-DAILY--210828-01;BDL-NL-GB;21:00;100;0;100;729;52.94;100;11;6
2021;Aug;28.08.2021;29.08.2021;BDL-NL-GB-D-DAILY--210828-01;BDL-NL-GB;22:00;100;0;100;729;43.97;100;11;7
2021;Aug;28.08.2021;29.08.2021;BDL-NL-GB-D-DAILY--210828-01;BDL-NL-GB;23:00;100;0;100;729;35.77;100;11;4
2021;Aug;29.08.2021;30.08.2021;BDL-NL-GB-D-DAILY--210829-01;BDL-NL-GB;00:00;85;0;85;419;60.66;85;12;7
2021;Aug;29.08.2021;30.08.2021;BDL-NL-GB-D-DAILY--210829-01;BDL-NL-GB;01:00;85;0;85;419;49.7;85;12;7
2021;Aug;29.08.2021;30.08.2021;BDL-NL-GB-D-DAILY--210829-01;BDL-NL-GB;02:00;85;0;85;419;51.75;85;12;8
2021;Aug;29.08.2021;30.08.2021;BDL-NL-GB-D-DAILY--210829-01;BDL-NL-GB;03:00;85;0;85;419;45.7;85;12;7
2021;Aug;29.08.2021;30.08.2021;BDL-NL-GB-D-DAILY--210829-01;BDL-NL-GB;04:00;85;0;85;419;41.17;85;12;8
2021;Aug;29.08.2021;30.08.2021;BDL-NL-GB-D-DAILY--210829-01;BDL-NL-GB;05:00;85;0;85;419;39.22;85;12;7
2021;Aug;29.08.2021;30.08.2021;BDL-NL-GB-D-DAILY--210829-01;BDL-NL-GB;06:00;85;0;85;419;35;85;12;7
2021;Aug;29.08.2021;30.08.2021;BDL-NL-GB-D-DAILY--210829-01;BDL-NL-GB;07:00;85;0;85;419;37.3;85;12;7
2021;Aug;29.08.2021;30.08.2021;BDL-NL-GB-D-DAILY--210829-01;BDL-NL-GB;08:00;85;0;85;419;32.88;85;12;8
2021;Aug;29.08.2021;30.08.2021;BDL-NL-GB-D-DAILY--210829-01;BDL-NL-GB;09:00;85;0;85;419;42.47;85;12;8
2021;Aug;29.08.2021;30.08.2021;BDL-NL-GB-D-DAILY--210829-01;BDL-NL-GB;10:00;85;0;85;419;56.6;85;12;8
2021;Aug;29.08.2021;30.08.2021;BDL-NL-GB-D-DAILY--210829-01;BDL-NL-GB;11:00;85;0;85;419;62.3;85;12;8
2021;Aug;29.08.2021;30.08.2021;BDL-NL-GB-D-DAILY--210829-01;BDL-NL-GB;12:00;85;0;85;419;63.11;85;12;8
2021;Aug;29.08.2021;30.08.2021;BDL-NL-GB-D-DAILY--210829-01;BDL-NL-GB;13:00;85;0;85;419;67.73;85;12;7
2021;Aug;29.08.2021;30.08.2021;BDL-NL-GB-D-DAILY--210829-01;BDL-NL-GB;14:00;85;0;85;419;55.36;85;12;7
2021;Aug;29.08.2021;30.08.2021;BDL-NL-GB-D-DAILY--210829-01;BDL-NL-GB;15:00;85;0;85;419;47.07;85;12;5
2021;Aug;29.08.2021;30.08.2021;BDL-NL-GB-D-DAILY--210829-01;BDL-NL-GB;16:00;85;0;85;419;42.93;85;12;5
2021;Aug;29.08.2021;30.08.2021;BDL-NL-GB-D-DAILY--210829-01;BDL-NL-GB;17:00;85;0;85;419;47.93;85;12;6
2021;Aug;29.08.2021;30.08.2021;BDL-NL-GB-D-DAILY--210829-01;BDL-NL-GB;18:00;85;0;85;419;48.53;85;12;7
2021;Aug;29.08.2021;30.08.2021;BDL-NL-GB-D-DAILY--210829-01;BDL-NL-GB;19:00;85;0;85;403;48.51;85;12;7
2021;Aug;29.08.2021;30.08.2021;BDL-NL-GB-D-DAILY--210829-01;BDL-NL-GB;20:00;85;0;85;403;42.22;85;12;6
2021;Aug;29.08.2021;30.08.2021;BDL-NL-GB-D-DAILY--210829-01;BDL-NL-GB;21:00;85;0;85;403;46.39;85;12;5
2021;Aug;29.08.2021;30.08.2021;BDL-NL-GB-D-DAILY--210829-01;BDL-NL-GB;22:00;85;0;85;383;43.41;85;12;5
2021;Aug;29.08.2021;30.08.2021;BDL-NL-GB-D-DAILY--210829-01;BDL-NL-GB;23:00;85;0;85;383;29.39;85;12;4
2021;Aug;30.08.2021;31.08.2021;BDL-NL-GB-D-DAILY--210830-01;BDL-NL-GB;00:00;142;0;142;691;49.11;142;10;4
2021;Aug;30.08.2021;31.08.2021;BDL-NL-GB-D-DAILY--210830-01;BDL-NL-GB;01:00;142;0;142;691;38.12;142;10;5
2021;Aug;30.08.2021;31.08.2021;BDL-NL-GB-D-DAILY--210830-01;BDL-NL-GB;02:00;142;0;142;691;34.5;142;10;4
2021;Aug;30.08.2021;31.08.2021;BDL-NL-GB-D-DAILY--210830-01;BDL-NL-GB;03:00;142;0;142;691;26.39;142;10;5
2021;Aug;30.08.2021;31.08.2021;BDL-NL-GB-D-DAILY--210830-01;BDL-NL-GB;04:00;142;0;142;691;15.29;142;10;5
2021;Aug;30.08.2021;31.08.2021;BDL-NL-GB-D-DAILY--210830-01;BDL-NL-GB;05:00;142;0;142;691;10.25;142;10;5
2021;Aug;30.08.2021;31.08.2021;BDL-NL-GB-D-DAILY--210830-01;BDL-NL-GB;06:00;190;0;190;786;0.83;190;10;5
2021;Aug;30.08.2021;31.08.2021;BDL-NL-GB-D-DAILY--210830-01;BDL-NL-GB;07:00;190;0;190;747;0.3;190;10;5
2021;Aug;30.08.2021;31.08.2021;BDL-NL-GB-D-DAILY--210830-01;BDL-NL-GB;08:00;190;0;190;747;0.3;190;10;5
2021;Aug;30.08.2021;31.08.2021;BDL-NL-GB-D-DAILY--210830-01;BDL-NL-GB;09:00;142;0;142;649;0.67;142;10;5
2021;Aug;30.08.2021;31.08.2021;BDL-NL-GB-D-DAILY--210830-01;BDL-NL-GB;10:00;142;0;142;691;18.73;142;10;5
2021;Aug;30.08.2021;31.08.2021;BDL-NL-GB-D-DAILY--210830-01;BDL-NL-GB;11:00;142;0;142;691;23.76;142;10;6
2021;Aug;30.08.2021;31.08.2021;BDL-NL-GB-D-DAILY--210830-01;BDL-NL-GB;12:00;142;0;142;691;33.87;142;10;5
2021;Aug;30.08.2021;31.08.2021;BDL-NL-GB-D-DAILY--210830-01;BDL-NL-GB;13:00;142;0;142;691;41.62;142;10;5
2021;Aug;30.08.2021;31.08.2021;BDL-NL-GB-D-DAILY--210830-01;BDL-NL-GB;14:00;142;0;142;691;35.58;142;10;6
2021;Aug;30.08.2021;31.08.2021;BDL-NL-GB-D-DAILY--210830-01;BDL-NL-GB;15:00;142;0;142;691;19.99;142;10;6
2021;Aug;30.08.2021;31.08.2021;BDL-NL-GB-D-DAILY--210830-01;BDL-NL-GB;16:00;142;0;142;691;15.42;142;10;5
2021;Aug;30.08.2021;31.08.2021;BDL-NL-GB-D-DAILY--210830-01;BDL-NL-GB;17:00;142;0;142;691;19.02;142;10;5
2021;Aug;30.08.2021;31.08.2021;BDL-NL-GB-D-DAILY--210830-01;BDL-NL-GB;18:00;142;0;142;675;25.8;142;10;4
2021;Aug;30.08.2021;31.08.2021;BDL-NL-GB-D-DAILY--210830-01;BDL-NL-GB;19:00;142;0;142;675;31.59;142;10;4
2021;Aug;30.08.2021;31.08.2021;BDL-NL-GB-D-DAILY--210830-01;BDL-NL-GB;20:00;142;0;142;675;29.8;142;10;4
2021;Aug;30.08.2021;31.08.2021;BDL-NL-GB-D-DAILY--210830-01;BDL-NL-GB;21:00;142;0;142;675;33.31;142;10;4
2021;Aug;30.08.2021;31.08.2021;BDL-NL-GB-D-DAILY--210830-01;BDL-NL-GB;22:00;142;0;142;675;28.12;142;10;3
2021;Aug;30.08.2021;31.08.2021;BDL-NL-GB-D-DAILY--210830-01;BDL-NL-GB;23:00;142;0;142;603;21.32;142;10;3
2021;Aug;31.08.2021;01.09.2021;BDL-NL-GB-D-DAILY--210831-01;BDL-NL-GB;00:00;167;0;167;876;35.68;167;11;5
2021;Aug;31.08.2021;01.09.2021;BDL-NL-GB-D-DAILY--210831-01;BDL-NL-GB;01:00;167;0;167;876;30.02;167;11;6
2021;Aug;31.08.2021;01.09.2021;BDL-NL-GB-D-DAILY--210831-01;BDL-NL-GB;02:00;167;0;167;876;28.73;167;11;7
2021;Aug;31.08.2021;01.09.2021;BDL-NL-GB-D-DAILY--210831-01;BDL-NL-GB;03:00;167;0;167;876;26.22;167;11;6
2021;Aug;31.08.2021;01.09.2021;BDL-NL-GB-D-DAILY--210831-01;BDL-NL-GB;04:00;167;0;167;876;25.71;167;11;5
2021;Aug;31.08.2021;01.09.2021;BDL-NL-GB-D-DAILY--210831-01;BDL-NL-GB;05:00;167;0;167;876;19.29;167;11;5
2021;Aug;31.08.2021;01.09.2021;BDL-NL-GB-D-DAILY--210831-01;BDL-NL-GB;06:00;167;0;167;844;1.92;167;11;3
2021;Aug;31.08.2021;01.09.2021;BDL-NL-GB-D-DAILY--210831-01;BDL-NL-GB;07:00;167;0;167;852;0.6;167;11;4
2021;Aug;31.08.2021;01.09.2021;BDL-NL-GB-D-DAILY--210831-01;BDL-NL-GB;08:00;167;0;167;852;0.7;167;11;4
2021;Aug;31.08.2021;01.09.2021;BDL-NL-GB-D-DAILY--210831-01;BDL-NL-GB;09:00;167;0;167;738;4.7;167;11;4
2021;Aug;31.08.2021;01.09.2021;BDL-NL-GB-D-DAILY--210831-01;BDL-NL-GB;10:00;167;0;167;868;23.63;167;11;5
2021;Aug;31.08.2021;01.09.2021;BDL-NL-GB-D-DAILY--210831-01;BDL-NL-GB;11:00;167;0;167;868;23;167;11;5
2021;Aug;31.08.2021;01.09.2021;BDL-NL-GB-D-DAILY--210831-01;BDL-NL-GB;12:00;167;0;167;868;24.82;167;11;5
2021;Aug;31.08.2021;01.09.2021;BDL-NL-GB-D-DAILY--210831-01;BDL-NL-GB;13:00;167;0;167;868;32.58;167;11;4
2021;Aug;31.08.2021;01.09.2021;BDL-NL-GB-D-DAILY--210831-01;BDL-NL-GB;14:00;167;0;167;873;20.92;167;11;5
2021;Aug;31.08.2021;01.09.2021;BDL-NL-GB-D-DAILY--210831-01;BDL-NL-GB;15:00;167;0;167;889;10.73;167;11;5
2021;Aug;31.08.2021;01.09.2021;BDL-NL-GB-D-DAILY--210831-01;BDL-NL-GB;16:00;167;0;167;868;8.35;167;11;4
2021;Aug;31.08.2021;01.09.2021;BDL-NL-GB-D-DAILY--210831-01;BDL-NL-GB;17:00;167;0;167;868;14.3;167;11;5
2021;Aug;31.08.2021;01.09.2021;BDL-NL-GB-D-DAILY--210831-01;BDL-NL-GB;18:00;167;0;167;852;27.66;167;11;4
2021;Aug;31.08.2021;01.09.2021;BDL-NL-GB-D-DAILY--210831-01;BDL-NL-GB;19:00;167;0;167;792;26.63;167;11;4
2021;Aug;31.08.2021;01.09.2021;BDL-NL-GB-D-DAILY--210831-01;BDL-NL-GB;20:00;167;0;167;767;21.85;167;11;4
2021;Aug;31.08.2021;01.09.2021;BDL-NL-GB-D-DAILY--210831-01;BDL-NL-GB;21:00;167;0;167;852;19;167;11;6
2021;Aug;31.08.2021;01.09.2021;BDL-NL-GB-D-DAILY--210831-01;BDL-NL-GB;22:00;167;0;167;852;22.33;167;11;3
2021;Aug;31.08.2021;01.09.2021;BDL-NL-GB-D-DAILY--210831-01;BDL-NL-GB;23:00;167;0;167;730;6.73;167;11;3
