Maze Size, Time (ms) 
10,0.07217387000000017 
30,0.15526367999999977 
20,0.1222344799999998 
50,0.23728130999999975 
70,0.31997017000000044 
40,0.20840415000000034 
90,0.40722103999999965 
60,0.29846007 
110,0.5145066699999977 
80,0.3872157200000008 
130,0.6848845399999984 
100,0.47232365999999754 
150,0.8691382700000019 
120,0.5664692000000007 
140,0.72121176 
170,1.1938669199999992 
190,1.2894433300000008 
160,1.0637445000000014 
210,1.5893428599999986 
230,1.9201274000000024 
180,1.5440928200000013 
250,2.1975651399999983 
200,1.7282897499999996 
270,2.574963739999993 
220,1.9446222200000025 
290,2.8648114799999984 
310,3.0153139300000045 
260,2.4444591700000116 
240,2.5360281800000015 
330,3.4454603599999856 
280,2.770108739999993 
350,3.711006880000004 
370,3.9608327300000084 
300,3.0469786399999967 
390,4.172660879999986 
320,3.2052394799999986 
340,3.4128687999999987 
410,4.564654129999986 
430,4.775743800000012 
360,3.828109599999983 
380,4.034433869999989 
450,4.938198869999974 
400,4.056368169999991 
420,4.0923888899999925 
470,4.981241689999993 
440,4.2653185200000046 
490,5.222859169999975 
480,4.629696299999991 
460,4.699842840000018 
500,4.669269129999989 
