{
    "type": "postgres",
    "host": "localhost",
    "post": "5432",
    "username": "postgres",
    "password": "",
    "database": "weavit",
    "synchronize": "true",
    "logging": "true",
    "entities": ["dist/**/*.entity{.ts,.js}"]

}