<svg width="16" height="13" viewBox="0 0 16 13" fill="none" xmlns="http://www.w3.org/2000/svg">
    <path d="M0 6.5H15" stroke="#A0A5BA" stroke-width="1.4" stroke-linecap="round" stroke-linejoin="round"/>
    <path d="M0 1.5H15" stroke="#A0A5BA" stroke-width="1.4" stroke-linecap="round" stroke-linejoin="round"/>
    <path d="M7 11.5H15" stroke="#A0A5BA" stroke-width="1.4" stroke-linecap="round" stroke-linejoin="round"/>
</svg>
