GiD Post Results File 1.0
Result "displacement" "thick_cylinder" 0 Vector OnNodes
ComponentNames "x" "y"
Values
1 0 -0.256837
2 0 -0.269939
3 -0.0102103 -0.211636
4 0 -0.223983
5 0.1125 -0.192475
6 0.0596495 -0.209804
7 0.0844654 -0.0905654
8 0 -0.194802
9 0.189984 -0.117
10 0.298566 -0.0595076
11 0.376949 -0.0868149
12 0.340914 0
13 0.44087 0
14 0.347735 -0.0162118
15 0.676979 0
16 1 0
End Values
