
 LIST ALL SELECTED NODES.   DSYS=      0
 SORT TABLE ON  NODE  NODE  NODE

   NODE        X                   Y                   Z
      51     0.00000000000       12.0000000000       0.00000000000    
      52     0.00000000000       12.0000000000      0.810000000000    
      53     0.00000000000       39.5000000000      0.810000000000    
      54     0.00000000000       13.1458333333      0.810000000000    
      55     0.00000000000       14.2916666667      0.810000000000    
      56     0.00000000000       15.4375000000      0.810000000000    
      57     0.00000000000       16.5833333333      0.810000000000    
      58     0.00000000000       17.7291666667      0.810000000000    
      59     0.00000000000       18.8750000000      0.810000000000    
      60     0.00000000000       20.0208333333      0.810000000000    
      61     0.00000000000       21.1666666667      0.810000000000    
      62     0.00000000000       22.3125000000      0.810000000000    
      63     0.00000000000       23.4583333333      0.810000000000    
      64     0.00000000000       24.6041666667      0.810000000000    
      65     0.00000000000       25.7500000000      0.810000000000    
      66     0.00000000000       26.8958333333      0.810000000000    
      67     0.00000000000       28.0416666667      0.810000000000    
      68     0.00000000000       29.1875000000      0.810000000000    
      69     0.00000000000       30.3333333333      0.810000000000    
      70     0.00000000000       31.4791666667      0.810000000000    

   NODE        X                   Y                   Z
      71     0.00000000000       32.6250000000      0.810000000000    
      72     0.00000000000       33.7708333333      0.810000000000    
      73     0.00000000000       34.9166666667      0.810000000000    
      74     0.00000000000       36.0625000000      0.810000000000    
      75     0.00000000000       37.2083333333      0.810000000000    
      76     0.00000000000       38.3541666667      0.810000000000    
      77     0.00000000000       39.5000000000       0.00000000000    
      78     0.00000000000       13.1458333333       0.00000000000    
      79     0.00000000000       14.2916666667       0.00000000000    
      80     0.00000000000       15.4375000000       0.00000000000    
      81     0.00000000000       16.5833333333       0.00000000000    
      82     0.00000000000       17.7291666667       0.00000000000    
      83     0.00000000000       18.8750000000       0.00000000000    
      84     0.00000000000       20.0208333333       0.00000000000    
      85     0.00000000000       21.1666666667       0.00000000000    
      86     0.00000000000       22.3125000000       0.00000000000    
      87     0.00000000000       23.4583333333       0.00000000000    
      88     0.00000000000       24.6041666667       0.00000000000    
      89     0.00000000000       25.7500000000       0.00000000000    
      90     0.00000000000       26.8958333333       0.00000000000    

   NODE        X                   Y                   Z
      91     0.00000000000       28.0416666667       0.00000000000    
      92     0.00000000000       29.1875000000       0.00000000000    
      93     0.00000000000       30.3333333333       0.00000000000    
      94     0.00000000000       31.4791666667       0.00000000000    
      95     0.00000000000       32.6250000000       0.00000000000    
      96     0.00000000000       33.7708333333       0.00000000000    
      97     0.00000000000       34.9166666667       0.00000000000    
      98     0.00000000000       36.0625000000       0.00000000000    
      99     0.00000000000       37.2083333333       0.00000000000    
     100     0.00000000000       38.3541666667       0.00000000000    
    1251     0.00000000000       0.00000000000      0.810000000000    
    1275     0.00000000000       0.00000000000       0.00000000000    
    1299     0.00000000000      0.500000000000      0.810000000000    
    1300     0.00000000000       1.00000000000      0.810000000000    
    1301     0.00000000000       1.50000000000      0.810000000000    
    1302     0.00000000000       2.00000000000      0.810000000000    
    1303     0.00000000000       2.50000000000      0.810000000000    
    1304     0.00000000000       3.00000000000      0.810000000000    
    1305     0.00000000000       3.50000000000      0.810000000000    
    1306     0.00000000000       4.00000000000      0.810000000000    

   NODE        X                   Y                   Z
    1307     0.00000000000       4.50000000000      0.810000000000    
    1308     0.00000000000       5.00000000000      0.810000000000    
    1309     0.00000000000       5.50000000000      0.810000000000    
    1310     0.00000000000       6.00000000000      0.810000000000    
    1311     0.00000000000       6.50000000000      0.810000000000    
    1312     0.00000000000       7.00000000000      0.810000000000    
    1313     0.00000000000       7.50000000000      0.810000000000    
    1314     0.00000000000       8.00000000000      0.810000000000    
    1315     0.00000000000       8.50000000000      0.810000000000    
    1316     0.00000000000       9.00000000000      0.810000000000    
    1317     0.00000000000       9.50000000000      0.810000000000    
    1318     0.00000000000       10.0000000000      0.810000000000    
    1319     0.00000000000       10.5000000000      0.810000000000    
    1320     0.00000000000       11.0000000000      0.810000000000    
    1321     0.00000000000       11.5000000000      0.810000000000    
    1719     0.00000000000      0.500000000000       0.00000000000    
    1720     0.00000000000       1.00000000000       0.00000000000    
    1721     0.00000000000       1.50000000000       0.00000000000    
    1722     0.00000000000       2.00000000000       0.00000000000    
    1723     0.00000000000       2.50000000000       0.00000000000    

   NODE        X                   Y                   Z
    1724     0.00000000000       3.00000000000       0.00000000000    
    1725     0.00000000000       3.50000000000       0.00000000000    
    1726     0.00000000000       4.00000000000       0.00000000000    
    1727     0.00000000000       4.50000000000       0.00000000000    
    1728     0.00000000000       5.00000000000       0.00000000000    
    1729     0.00000000000       5.50000000000       0.00000000000    
    1730     0.00000000000       6.00000000000       0.00000000000    
    1731     0.00000000000       6.50000000000       0.00000000000    
    1732     0.00000000000       7.00000000000       0.00000000000    
    1733     0.00000000000       7.50000000000       0.00000000000    
    1734     0.00000000000       8.00000000000       0.00000000000    
    1735     0.00000000000       8.50000000000       0.00000000000    
    1736     0.00000000000       9.00000000000       0.00000000000    
    1737     0.00000000000       9.50000000000       0.00000000000    
    1738     0.00000000000       10.0000000000       0.00000000000    
    1739     0.00000000000       10.5000000000       0.00000000000    
    1740     0.00000000000       11.0000000000       0.00000000000    
    1741     0.00000000000       11.5000000000       0.00000000000    



