Point(1) = {0, 0, 0, 30};
Point(2) = {300, 0, 0, 30};
Point(3) = {300, 80, 0, 3};
Point(4) = {0, 80, 0, 3};
Point(12) = {10, 121, 0, 10};
Point(13) = {40, 121, 0, 10};
Point(15) = {40, 91, 0, 3};
Point(17) = {20, 81, 0, 3};
Point(18) = {30, 81, 0, 3};
Point(19) = {30, 91, 0, 1e+22};
Point(20) = {10, 91, 0, 3};
Point(21) = {20, 91, 0, 1e+22};
Line(1) = {1, 2};
Line(2) = {2, 3};
Line(3) = {3, 4};
Line(4) = {4, 1};
Circle(5) = {20, 21, 17};
Circle(6) = {18, 19, 15};
Line(7) = {12, 20};
Line(8) = {12, 13};
Line(9) = {13, 15};
Line(10) = {18, 17};
Line Loop(12) = {3, 4, 1, 2};
Plane Surface(12) = {12};
Line Loop(14) = {9, -6, 10, -5, -7, 8};
Plane Surface(14) = {14};

Characteristic Length {4, 3, 17, 18} = 3;
Characteristic Length {12, 13} = 20;
Characteristic Length {1, 2} = 50;

Mesh.Algorithm = 5;
Mesh.RecombineAll = 1;
Mesh.SubdivisionAlgorithm = 1;
Mesh.SaveGroupsOfNodes = 1;
