
 LIST ALL SELECTED NODES.   DSYS=      0
 SORT TABLE ON  NODE  NODE  NODE

   NODE        X                   Y                   Z
       1     0.00000000000       0.00000000000       0.00000000000    
      20     4.49000000000       0.00000000000       0.00000000000    
      43    0.898000000000       0.00000000000       0.00000000000    
      44     1.79600000000       0.00000000000       0.00000000000    
      45     2.69400000000       0.00000000000       0.00000000000    
      46     3.59200000000       0.00000000000       0.00000000000    
     115     26.6700000000       0.00000000000       0.00000000000    
     138     8.92600000000       0.00000000000       0.00000000000    
     139     13.3620000000       0.00000000000       0.00000000000    
     140     17.7980000000       0.00000000000       0.00000000000    
     141     22.2340000000       0.00000000000       0.00000000000    



