<?xml version="1.0" encoding="UTF-8" standalone="no"?>
<!-- Created with Inkscape (http://www.inkscape.org/) -->

<svg
   xmlns:dc="http://purl.org/dc/elements/1.1/"
   xmlns:cc="http://creativecommons.org/ns#"
   xmlns:rdf="http://www.w3.org/1999/02/22-rdf-syntax-ns#"
   xmlns:svg="http://www.w3.org/2000/svg"
   xmlns="http://www.w3.org/2000/svg"
   xmlns:sodipodi="http://sodipodi.sourceforge.net/DTD/sodipodi-0.dtd"
   xmlns:inkscape="http://www.inkscape.org/namespaces/inkscape"
   width="744.09448819"
   height="1052.3622047"
   id="svg16247"
   version="1.1"
   inkscape:version="0.48.2 r9819"
   sodipodi:docname="num_int_2D.svg">
  <defs
     id="defs16249">
    <marker
       inkscape:stockid="Arrow2Lstart"
       orient="auto"
       refY="0.0"
       refX="0.0"
       id="Arrow2Lstart"
       style="overflow:visible">
      <path
         id="path3814"
         style="font-size:12.0;fill-rule:evenodd;stroke-width:0.62500000;stroke-linejoin:round"
         d="M 8.7185878,4.0337352 L -2.2072895,0.016013256 L 8.7185884,-4.0017078 C 6.9730900,-1.6296469 6.9831476,1.6157441 8.7185878,4.0337352 z "
         transform="scale(1.1) translate(1,0)" />
    </marker>
  </defs>
  <sodipodi:namedview
     id="base"
     pagecolor="#ffffff"
     bordercolor="#666666"
     borderopacity="1.0"
     inkscape:pageopacity="0.0"
     inkscape:pageshadow="2"
     inkscape:zoom="2.8"
     inkscape:cx="541.69367"
     inkscape:cy="691.46356"
     inkscape:document-units="px"
     inkscape:current-layer="layer1"
     showgrid="true"
     inkscape:window-width="1280"
     inkscape:window-height="951"
     inkscape:window-x="0"
     inkscape:window-y="25"
     inkscape:window-maximized="1">
    <inkscape:grid
       type="xygrid"
       id="grid16255" />
  </sodipodi:namedview>
  <metadata
     id="metadata16252">
    <rdf:RDF>
      <cc:Work
         rdf:about="">
        <dc:format>image/svg+xml</dc:format>
        <dc:type
           rdf:resource="http://purl.org/dc/dcmitype/StillImage" />
        <dc:title />
      </cc:Work>
    </rdf:RDF>
  </metadata>
  <g
     inkscape:label="Layer 1"
     inkscape:groupmode="layer"
     id="layer1">
    <path
       style="fill:#e6e6e6;stroke:#e6e6e6;stroke-width:1px;stroke-linecap:butt;stroke-linejoin:miter;stroke-opacity:1"
       d="m 310,202.36218 10,90 90,0 10,-90 z"
       id="path17188"
       inkscape:connector-curvature="0"
       sodipodi:nodetypes="ccccc" />
    <path
       style="fill:none;stroke:#000000;stroke-width:0.3;stroke-linecap:butt;stroke-linejoin:miter;stroke-opacity:1;stroke-miterlimit:4;stroke-dasharray:none"
       d="m 160,72.362183 0,339.999997"
       id="path16257"
       inkscape:connector-curvature="0" />
    <path
       style="fill:none;stroke:#000000;stroke-width:0.3;stroke-linecap:butt;stroke-linejoin:miter;stroke-opacity:1;stroke-miterlimit:4;stroke-dasharray:none"
       d="m 140,392.36218 360,0"
       id="path16259"
       inkscape:connector-curvature="0" />
    <path
       style="fill:none;stroke:#000000;stroke-width:1.2;stroke-linecap:butt;stroke-linejoin:miter;stroke-opacity:1;stroke-miterlimit:4;stroke-dasharray:none"
       d="m 220,102.36218 100,10"
       id="path16769"
       inkscape:connector-curvature="0" />
    <path
       style="fill:none;stroke:#000000;stroke-width:1.2;stroke-linecap:butt;stroke-linejoin:miter;stroke-opacity:1;stroke-miterlimit:4;stroke-dasharray:none"
       d="m 410,112.36218 -90,0"
       id="path16771"
       inkscape:connector-curvature="0" />
    <path
       style="fill:none;stroke:#000000;stroke-width:1.2;stroke-linecap:butt;stroke-linejoin:miter;stroke-opacity:1;stroke-miterlimit:4;stroke-dasharray:none"
       d="m 480,102.36218 -70,10"
       id="path16773"
       inkscape:connector-curvature="0" />
    <path
       style="fill:none;stroke:#000000;stroke-width:1.2;stroke-linecap:butt;stroke-linejoin:miter;stroke-opacity:1;stroke-miterlimit:4;stroke-dasharray:none"
       d="m 220,102.36218 -20,90"
       id="path16775"
       inkscape:connector-curvature="0" />
    <path
       style="fill:none;stroke:#000000;stroke-width:1.2;stroke-linecap:butt;stroke-linejoin:miter;stroke-opacity:1;stroke-miterlimit:4;stroke-dasharray:none"
       d="m 320,112.36218 -10,90"
       id="path16777"
       inkscape:connector-curvature="0" />
    <path
       style="fill:none;stroke:#000000;stroke-width:1.2;stroke-linecap:butt;stroke-linejoin:miter;stroke-opacity:1;stroke-miterlimit:4;stroke-dasharray:none"
       d="m 200,192.36218 110,10"
       id="path16779"
       inkscape:connector-curvature="0" />
    <path
       style="fill:none;stroke:#000000;stroke-width:1.2;stroke-linecap:butt;stroke-linejoin:miter;stroke-opacity:1;stroke-miterlimit:4;stroke-dasharray:none"
       d="m 410,112.36218 10,90"
       id="path16781"
       inkscape:connector-curvature="0" />
    <path
       style="fill:none;stroke:#000000;stroke-width:1.2;stroke-linecap:butt;stroke-linejoin:miter;stroke-opacity:1;stroke-miterlimit:4;stroke-dasharray:none"
       d="m 310,202.36218 110,0"
       id="path16783"
       inkscape:connector-curvature="0" />
    <path
       style="fill:none;stroke:#000000;stroke-width:1.2;stroke-linecap:butt;stroke-linejoin:miter;stroke-opacity:1;stroke-miterlimit:4;stroke-dasharray:none"
       d="m 480,102.36218 20,90"
       id="path16785"
       inkscape:connector-curvature="0" />
    <path
       style="fill:none;stroke:#000000;stroke-width:1.2;stroke-linecap:butt;stroke-linejoin:miter;stroke-opacity:1;stroke-miterlimit:4;stroke-dasharray:none"
       d="m 420,202.36218 80,-10"
       id="path16787"
       inkscape:connector-curvature="0" />
    <path
       style="fill:none;stroke:#000000;stroke-width:1.2;stroke-linecap:butt;stroke-linejoin:miter;stroke-opacity:1;stroke-miterlimit:4;stroke-dasharray:none"
       d="m 310,202.36218 10,90"
       id="path16789"
       inkscape:connector-curvature="0" />
    <path
       style="fill:none;stroke:#000000;stroke-width:1.2;stroke-linecap:butt;stroke-linejoin:miter;stroke-opacity:1;stroke-miterlimit:4;stroke-dasharray:none"
       d="m 420,202.36218 -10,90"
       id="path16791"
       inkscape:connector-curvature="0" />
    <path
       style="fill:none;stroke:#000000;stroke-width:1.2;stroke-linecap:butt;stroke-linejoin:miter;stroke-opacity:1;stroke-miterlimit:4;stroke-dasharray:none"
       d="m 320,292.36218 90,0"
       id="path16793"
       inkscape:connector-curvature="0" />
    <path
       style="fill:none;stroke:#000000;stroke-width:1.2;stroke-linecap:butt;stroke-linejoin:miter;stroke-opacity:1;stroke-miterlimit:4;stroke-dasharray:none"
       d="m 200,192.36218 20,100"
       id="path16795"
       inkscape:connector-curvature="0" />
    <path
       style="fill:none;stroke:#000000;stroke-width:1.2;stroke-linecap:butt;stroke-linejoin:miter;stroke-opacity:1;stroke-miterlimit:4;stroke-dasharray:none"
       d="m 320,292.36218 -100,0"
       id="path16797"
       inkscape:connector-curvature="0" />
    <path
       style="fill:none;stroke:#000000;stroke-width:1.2;stroke-linecap:butt;stroke-linejoin:miter;stroke-opacity:1;stroke-miterlimit:4;stroke-dasharray:none"
       d="m 500,192.36218 -20,90"
       id="path16799"
       inkscape:connector-curvature="0" />
    <path
       style="fill:none;stroke:#000000;stroke-width:1.2;stroke-linecap:butt;stroke-linejoin:miter;stroke-opacity:1;stroke-miterlimit:4;stroke-dasharray:none"
       d="m 410,292.36218 70,-10"
       id="path16801"
       inkscape:connector-curvature="0" />
    <path
       style="fill:none;stroke:#000000;stroke-width:1.2;stroke-linecap:butt;stroke-linejoin:miter;stroke-opacity:1;stroke-miterlimit:4;stroke-dasharray:none"
       d="m 220,292.36218 10,80"
       id="path16803"
       inkscape:connector-curvature="0" />
    <path
       style="fill:none;stroke:#000000;stroke-width:1.2;stroke-linecap:butt;stroke-linejoin:miter;stroke-opacity:1;stroke-miterlimit:4;stroke-dasharray:none"
       d="m 320,292.36218 0,70"
       id="path16805"
       inkscape:connector-curvature="0" />
    <path
       style="fill:none;stroke:#000000;stroke-width:1.2;stroke-linecap:butt;stroke-linejoin:miter;stroke-opacity:1;stroke-miterlimit:4;stroke-dasharray:none"
       d="m 410,292.36218 0,60"
       id="path16807"
       inkscape:connector-curvature="0" />
    <path
       style="fill:none;stroke:#000000;stroke-width:1.2;stroke-linecap:butt;stroke-linejoin:miter;stroke-opacity:1;stroke-miterlimit:4;stroke-dasharray:none"
       d="m 480,282.36218 10,50"
       id="path16809"
       inkscape:connector-curvature="0" />
    <path
       style="fill:none;stroke:#000000;stroke-width:1.2;stroke-linecap:butt;stroke-linejoin:miter;stroke-opacity:1;stroke-miterlimit:4;stroke-dasharray:none"
       d="m 230,372.36218 90,-10"
       id="path16811"
       inkscape:connector-curvature="0" />
    <path
       style="fill:none;stroke:#000000;stroke-width:1.2;stroke-linecap:butt;stroke-linejoin:miter;stroke-opacity:1;stroke-miterlimit:4;stroke-dasharray:none"
       d="m 410,352.36218 -90,10"
       id="path16813"
       inkscape:connector-curvature="0" />
    <path
       style="fill:none;stroke:#000000;stroke-width:1.2;stroke-linecap:butt;stroke-linejoin:miter;stroke-opacity:1;stroke-miterlimit:4;stroke-dasharray:none"
       d="m 490,332.36218 -80,20"
       id="path16815"
       inkscape:connector-curvature="0" />
    <path
       sodipodi:type="arc"
       style="fill:#ffffff;fill-opacity:1;fill-rule:nonzero;stroke:#000000;stroke-width:0.60000002;stroke-miterlimit:4;stroke-opacity:1;stroke-dasharray:none;stroke-dashoffset:0"
       id="path7003-9-8"
       sodipodi:cx="295"
       sodipodi:cy="167.36218"
       sodipodi:rx="3"
       sodipodi:ry="3"
       d="m 298,167.36218 a 3,3 0 1 1 -6,0 3,3 0 1 1 6,0 z"
       transform="translate(-75,-65)" />
    <path
       sodipodi:type="arc"
       style="fill:#ffffff;fill-opacity:1;fill-rule:nonzero;stroke:#000000;stroke-width:0.60000002;stroke-miterlimit:4;stroke-opacity:1;stroke-dasharray:none;stroke-dashoffset:0"
       id="path7003-9-8-3"
       sodipodi:cx="295"
       sodipodi:cy="167.36218"
       sodipodi:rx="3"
       sodipodi:ry="3"
       d="m 298,167.36218 a 3,3 0 1 1 -6,0 3,3 0 1 1 6,0 z"
       transform="translate(-95,25)" />
    <path
       sodipodi:type="arc"
       style="fill:#ffffff;fill-opacity:1;fill-rule:nonzero;stroke:#000000;stroke-width:0.60000002;stroke-miterlimit:4;stroke-opacity:1;stroke-dasharray:none;stroke-dashoffset:0"
       id="path7003-9-8-9"
       sodipodi:cx="295"
       sodipodi:cy="167.36218"
       sodipodi:rx="3"
       sodipodi:ry="3"
       d="m 298,167.36218 a 3,3 0 1 1 -6,0 3,3 0 1 1 6,0 z"
       transform="translate(-75,125)" />
    <path
       sodipodi:type="arc"
       style="fill:#ffffff;fill-opacity:1;fill-rule:nonzero;stroke:#000000;stroke-width:0.60000002;stroke-miterlimit:4;stroke-opacity:1;stroke-dasharray:none;stroke-dashoffset:0"
       id="path7003-9-8-8"
       sodipodi:cx="295"
       sodipodi:cy="167.36218"
       sodipodi:rx="3"
       sodipodi:ry="3"
       d="m 298,167.36218 a 3,3 0 1 1 -6,0 3,3 0 1 1 6,0 z"
       transform="translate(-65,205)" />
    <path
       sodipodi:type="arc"
       style="fill:#ffffff;fill-opacity:1;fill-rule:nonzero;stroke:#000000;stroke-width:0.60000002;stroke-miterlimit:4;stroke-opacity:1;stroke-dasharray:none;stroke-dashoffset:0"
       id="path7003-9-8-2"
       sodipodi:cx="295"
       sodipodi:cy="167.36218"
       sodipodi:rx="3"
       sodipodi:ry="3"
       d="m 298,167.36218 a 3,3 0 1 1 -6,0 3,3 0 1 1 6,0 z"
       transform="translate(25,195)" />
    <path
       sodipodi:type="arc"
       style="fill:#ffffff;fill-opacity:1;fill-rule:nonzero;stroke:#000000;stroke-width:0.60000002;stroke-miterlimit:4;stroke-opacity:1;stroke-dasharray:none;stroke-dashoffset:0"
       id="path7003-9-8-1"
       sodipodi:cx="295"
       sodipodi:cy="167.36218"
       sodipodi:rx="3"
       sodipodi:ry="3"
       d="m 298,167.36218 a 3,3 0 1 1 -6,0 3,3 0 1 1 6,0 z"
       transform="translate(25,125)" />
    <path
       sodipodi:type="arc"
       style="fill:#ffffff;fill-opacity:1;fill-rule:nonzero;stroke:#000000;stroke-width:0.60000002;stroke-miterlimit:4;stroke-opacity:1;stroke-dasharray:none;stroke-dashoffset:0"
       id="path7003-9-8-0"
       sodipodi:cx="295"
       sodipodi:cy="167.36218"
       sodipodi:rx="3"
       sodipodi:ry="3"
       d="m 298,167.36218 a 3,3 0 1 1 -6,0 3,3 0 1 1 6,0 z"
       transform="translate(15,35)" />
    <path
       sodipodi:type="arc"
       style="fill:#ffffff;fill-opacity:1;fill-rule:nonzero;stroke:#000000;stroke-width:0.60000002;stroke-miterlimit:4;stroke-opacity:1;stroke-dasharray:none;stroke-dashoffset:0"
       id="path7003-9-8-02"
       sodipodi:cx="295"
       sodipodi:cy="167.36218"
       sodipodi:rx="3"
       sodipodi:ry="3"
       d="m 298,167.36218 a 3,3 0 1 1 -6,0 3,3 0 1 1 6,0 z"
       transform="translate(25,-55)" />
    <path
       sodipodi:type="arc"
       style="fill:#ffffff;fill-opacity:1;fill-rule:nonzero;stroke:#000000;stroke-width:0.60000002;stroke-miterlimit:4;stroke-opacity:1;stroke-dasharray:none;stroke-dashoffset:0"
       id="path7003-9-8-4"
       sodipodi:cx="295"
       sodipodi:cy="167.36218"
       sodipodi:rx="3"
       sodipodi:ry="3"
       d="m 298,167.36218 a 3,3 0 1 1 -6,0 3,3 0 1 1 6,0 z"
       transform="translate(115,-55)" />
    <path
       sodipodi:type="arc"
       style="fill:#ffffff;fill-opacity:1;fill-rule:nonzero;stroke:#000000;stroke-width:0.60000002;stroke-miterlimit:4;stroke-opacity:1;stroke-dasharray:none;stroke-dashoffset:0"
       id="path7003-9-8-7"
       sodipodi:cx="295"
       sodipodi:cy="167.36218"
       sodipodi:rx="3"
       sodipodi:ry="3"
       d="m 298,167.36218 a 3,3 0 1 1 -6,0 3,3 0 1 1 6,0 z"
       transform="translate(125,35)" />
    <path
       sodipodi:type="arc"
       style="fill:#ffffff;fill-opacity:1;fill-rule:nonzero;stroke:#000000;stroke-width:0.60000002;stroke-miterlimit:4;stroke-opacity:1;stroke-dasharray:none;stroke-dashoffset:0"
       id="path7003-9-8-6"
       sodipodi:cx="295"
       sodipodi:cy="167.36218"
       sodipodi:rx="3"
       sodipodi:ry="3"
       d="m 298,167.36218 a 3,3 0 1 1 -6,0 3,3 0 1 1 6,0 z"
       transform="translate(115,125)" />
    <path
       sodipodi:type="arc"
       style="fill:#ffffff;fill-opacity:1;fill-rule:nonzero;stroke:#000000;stroke-width:0.60000002;stroke-miterlimit:4;stroke-opacity:1;stroke-dasharray:none;stroke-dashoffset:0"
       id="path7003-9-8-00"
       sodipodi:cx="295"
       sodipodi:cy="167.36218"
       sodipodi:rx="3"
       sodipodi:ry="3"
       d="m 298,167.36218 a 3,3 0 1 1 -6,0 3,3 0 1 1 6,0 z"
       transform="translate(115,185)" />
    <path
       sodipodi:type="arc"
       style="fill:#ffffff;fill-opacity:1;fill-rule:nonzero;stroke:#000000;stroke-width:0.60000002;stroke-miterlimit:4;stroke-opacity:1;stroke-dasharray:none;stroke-dashoffset:0"
       id="path7003-9-8-23"
       sodipodi:cx="295"
       sodipodi:cy="167.36218"
       sodipodi:rx="3"
       sodipodi:ry="3"
       d="m 298,167.36218 a 3,3 0 1 1 -6,0 3,3 0 1 1 6,0 z"
       transform="translate(195,165)" />
    <path
       sodipodi:type="arc"
       style="fill:#ffffff;fill-opacity:1;fill-rule:nonzero;stroke:#000000;stroke-width:0.60000002;stroke-miterlimit:4;stroke-opacity:1;stroke-dasharray:none;stroke-dashoffset:0"
       id="path7003-9-8-12"
       sodipodi:cx="295"
       sodipodi:cy="167.36218"
       sodipodi:rx="3"
       sodipodi:ry="3"
       d="m 298,167.36218 a 3,3 0 1 1 -6,0 3,3 0 1 1 6,0 z"
       transform="translate(185,115)" />
    <path
       sodipodi:type="arc"
       style="fill:#ffffff;fill-opacity:1;fill-rule:nonzero;stroke:#000000;stroke-width:0.60000002;stroke-miterlimit:4;stroke-opacity:1;stroke-dasharray:none;stroke-dashoffset:0"
       id="path7003-9-8-87"
       sodipodi:cx="295"
       sodipodi:cy="167.36218"
       sodipodi:rx="3"
       sodipodi:ry="3"
       d="m 298,167.36218 a 3,3 0 1 1 -6,0 3,3 0 1 1 6,0 z"
       transform="translate(205,25)" />
    <path
       sodipodi:type="arc"
       style="fill:#ffffff;fill-opacity:1;fill-rule:nonzero;stroke:#000000;stroke-width:0.60000002;stroke-miterlimit:4;stroke-opacity:1;stroke-dasharray:none;stroke-dashoffset:0"
       id="path7003-9-8-13"
       sodipodi:cx="295"
       sodipodi:cy="167.36218"
       sodipodi:rx="3"
       sodipodi:ry="3"
       d="m 298,167.36218 a 3,3 0 1 1 -6,0 3,3 0 1 1 6,0 z"
       transform="translate(185,-65)" />
    <text
       xml:space="preserve"
       style="font-size:10px;font-style:normal;font-variant:normal;font-weight:normal;font-stretch:normal;text-align:start;line-height:125%;letter-spacing:0px;word-spacing:0px;writing-mode:lr-tb;text-anchor:start;fill:#000000;fill-opacity:1;stroke:none;font-family:Bitstream Vera Sans;-inkscape-font-specification:Bitstream Vera Sans"
       x="505"
       y="392.36218"
       id="text16940"
       sodipodi:linespacing="125%"><tspan
         sodipodi:role="line"
         id="tspan16942"
         x="513.49365"
         y="392.36218">$x$</tspan></text>
    <text
       xml:space="preserve"
       style="font-size:10px;font-style:normal;font-variant:normal;font-weight:normal;font-stretch:normal;text-align:center;line-height:125%;letter-spacing:0px;word-spacing:0px;writing-mode:lr-tb;text-anchor:middle;fill:#000000;fill-opacity:1;stroke:none;font-family:Bitstream Vera Sans;-inkscape-font-specification:Bitstream Vera Sans"
       x="160"
       y="67.362183"
       id="text16944"
       sodipodi:linespacing="125%"><tspan
         sodipodi:role="line"
         id="tspan16946"
         x="160"
         y="67.362183">$y$</tspan></text>
    <rect
       style="fill:#e6e6e6;fill-opacity:1;fill-rule:nonzero;stroke:#000000;stroke-width:1.19999999999999996;stroke-miterlimit:4;stroke-dasharray:none"
       id="rect17023"
       width="180"
       height="180"
       x="260"
       y="452.36218" />
    <path
       style="fill:none;stroke:#000000;stroke-width:0.3;stroke-linecap:butt;stroke-linejoin:miter;stroke-opacity:1;stroke-miterlimit:4;stroke-dasharray:none"
       d="m 350,422.36218 0,120"
       id="path17025"
       inkscape:connector-curvature="0" />
    <path
       style="fill:none;stroke:#000000;stroke-width:0.3;stroke-linecap:butt;stroke-linejoin:miter;stroke-opacity:1;stroke-miterlimit:4;stroke-dasharray:none"
       d="m 470,542.36218 -120,0"
       id="path17027"
       inkscape:connector-curvature="0" />
    <text
       xml:space="preserve"
       style="font-size:10px;font-style:normal;font-variant:normal;font-weight:normal;font-stretch:normal;text-align:start;line-height:125%;letter-spacing:0px;word-spacing:0px;writing-mode:lr-tb;text-anchor:start;fill:#000000;fill-opacity:1;stroke:none;font-family:Bitstream Vera Sans;-inkscape-font-specification:Bitstream Vera Sans"
       x="475"
       y="542.36218"
       id="text16940-6"
       sodipodi:linespacing="125%"><tspan
         sodipodi:role="line"
         id="tspan16942-9"
         x="475"
         y="542.36218">$r$</tspan></text>
    <text
       xml:space="preserve"
       style="font-size:10px;font-style:normal;font-variant:normal;font-weight:normal;font-stretch:normal;text-align:center;line-height:125%;letter-spacing:0px;word-spacing:0px;writing-mode:lr-tb;text-anchor:middle;fill:#000000;fill-opacity:1;stroke:none;font-family:Bitstream Vera Sans;-inkscape-font-specification:Bitstream Vera Sans"
       x="350"
       y="417.36218"
       id="text16940-7"
       sodipodi:linespacing="125%"><tspan
         sodipodi:role="line"
         id="tspan16942-1"
         x="350"
         y="417.36218">$s$</tspan></text>
    <path
       sodipodi:type="arc"
       style="fill:#ffffff;fill-opacity:1;fill-rule:nonzero;stroke:#000000;stroke-width:0.60000002;stroke-miterlimit:4;stroke-opacity:1;stroke-dasharray:none;stroke-dashoffset:0"
       id="path7003-9-8-8-5"
       sodipodi:cx="295"
       sodipodi:cy="167.36218"
       sodipodi:rx="3"
       sodipodi:ry="3"
       d="m 298,167.36218 a 3,3 0 1 1 -6,0 3,3 0 1 1 6,0 z"
       transform="translate(-35,285)" />
    <path
       sodipodi:type="arc"
       style="fill:#ffffff;fill-opacity:1;fill-rule:nonzero;stroke:#000000;stroke-width:0.60000002;stroke-miterlimit:4;stroke-opacity:1;stroke-dasharray:none;stroke-dashoffset:0"
       id="path7003-9-8-8-1"
       sodipodi:cx="295"
       sodipodi:cy="167.36218"
       sodipodi:rx="3"
       sodipodi:ry="3"
       d="m 298,167.36218 a 3,3 0 1 1 -6,0 3,3 0 1 1 6,0 z"
       transform="translate(-35,465)" />
    <path
       sodipodi:type="arc"
       style="fill:#ffffff;fill-opacity:1;fill-rule:nonzero;stroke:#000000;stroke-width:0.60000002;stroke-miterlimit:4;stroke-opacity:1;stroke-dasharray:none;stroke-dashoffset:0"
       id="path7003-9-8-8-6"
       sodipodi:cx="295"
       sodipodi:cy="167.36218"
       sodipodi:rx="3"
       sodipodi:ry="3"
       d="m 298,167.36218 a 3,3 0 1 1 -6,0 3,3 0 1 1 6,0 z"
       transform="translate(145,465)" />
    <path
       sodipodi:type="arc"
       style="fill:#ffffff;fill-opacity:1;fill-rule:nonzero;stroke:#000000;stroke-width:0.60000002;stroke-miterlimit:4;stroke-opacity:1;stroke-dasharray:none;stroke-dashoffset:0"
       id="path7003-9-8-8-19"
       sodipodi:cx="295"
       sodipodi:cy="167.36218"
       sodipodi:rx="3"
       sodipodi:ry="3"
       d="m 298,167.36218 a 3,3 0 1 1 -6,0 3,3 0 1 1 6,0 z"
       transform="translate(145,285)" />
    <text
       xml:space="preserve"
       style="font-size:10px;font-style:normal;font-variant:normal;font-weight:normal;font-stretch:normal;text-align:start;line-height:125%;letter-spacing:0px;word-spacing:0px;writing-mode:lr-tb;text-anchor:start;fill:#000000;fill-opacity:1;stroke:none;font-family:Bitstream Vera Sans;-inkscape-font-specification:Bitstream Vera Sans"
       x="355"
       y="447.36218"
       id="text17117"
       sodipodi:linespacing="125%"><tspan
         sodipodi:role="line"
         id="tspan17119"
         x="355"
         y="447.36218">$1$</tspan></text>
    <text
       xml:space="preserve"
       style="font-size:10px;font-style:normal;font-variant:normal;font-weight:normal;font-stretch:normal;text-align:start;line-height:125%;letter-spacing:0px;word-spacing:0px;writing-mode:lr-tb;text-anchor:start;fill:#000000;fill-opacity:1;stroke:none;font-family:Bitstream Vera Sans;-inkscape-font-specification:Bitstream Vera Sans"
       x="445"
       y="537.36218"
       id="text17117-7"
       sodipodi:linespacing="125%"><tspan
         sodipodi:role="line"
         id="tspan17119-7"
         x="445"
         y="537.36218">$1$</tspan></text>
    <text
       xml:space="preserve"
       style="font-size:10px;font-style:normal;font-variant:normal;font-weight:normal;font-stretch:normal;text-align:center;line-height:125%;letter-spacing:0px;word-spacing:0px;writing-mode:lr-tb;text-anchor:middle;fill:#000000;fill-opacity:1;stroke:none;font-family:Bitstream Vera Sans;-inkscape-font-specification:Bitstream Vera Sans"
       x="350"
       y="647.36218"
       id="text17117-1"
       sodipodi:linespacing="125%"><tspan
         sodipodi:role="line"
         id="tspan17119-6"
         x="350"
         y="647.36218">$-1$</tspan></text>
    <text
       xml:space="preserve"
       style="font-size:10px;font-style:normal;font-variant:normal;font-weight:normal;font-stretch:normal;text-align:end;line-height:125%;letter-spacing:0px;word-spacing:0px;writing-mode:lr-tb;text-anchor:end;fill:#000000;fill-opacity:1;stroke:none;font-family:Bitstream Vera Sans;-inkscape-font-specification:Bitstream Vera Sans"
       x="250"
       y="542.36218"
       id="text17117-1-9"
       sodipodi:linespacing="125%"><tspan
         sodipodi:role="line"
         id="tspan17119-6-7"
         x="250"
         y="542.36218">$-1$</tspan></text>
    <path
       style="fill:none;stroke:#000000;stroke-width:0.30000001;stroke-linecap:butt;stroke-linejoin:miter;stroke-opacity:1;stroke-miterlimit:4;stroke-dasharray:2.4000001,0.60000002,0.30000001,0.60000002;stroke-dashoffset:0"
       d="m 250,492.36218 200,0"
       id="path17192"
       inkscape:connector-curvature="0" />
    <path
       style="fill:none;stroke:#000000;stroke-width:0.30000001;stroke-linecap:butt;stroke-linejoin:miter;stroke-opacity:1;stroke-miterlimit:4;stroke-dasharray:2.4000001,0.60000002,0.30000001,0.60000002;stroke-dashoffset:0"
       d="m 300,442.36218 0,200"
       id="path17194"
       inkscape:connector-curvature="0" />
    <path
       style="fill:none;stroke:#000000;stroke-width:0.30000001;stroke-linecap:butt;stroke-linejoin:miter;stroke-opacity:1;stroke-miterlimit:4;stroke-dasharray:2.4000001,0.60000002,0.30000001,0.60000002;stroke-dashoffset:0"
       d="m 400,442.36218 0,200"
       id="path17196"
       inkscape:connector-curvature="0" />
    <path
       style="fill:none;stroke:#000000;stroke-width:0.30000001;stroke-linecap:butt;stroke-linejoin:miter;stroke-opacity:1;stroke-miterlimit:4;stroke-dasharray:2.4000001,0.60000002,0.30000001,0.60000002;stroke-dashoffset:0"
       d="m 250,592.36218 200,0"
       id="path17198"
       inkscape:connector-curvature="0" />
    <path
       style="fill:#ffffff;stroke:#000000;stroke-width:0.60000002;stroke-linecap:butt;stroke-linejoin:miter;stroke-miterlimit:4;stroke-opacity:1;stroke-dasharray:none"
       d="m 300,488.36218 -3,6 6,0 z"
       id="path15679"
       inkscape:connector-curvature="0" />
    <path
       style="fill:#ffffff;stroke:#000000;stroke-width:0.60000002;stroke-linecap:butt;stroke-linejoin:miter;stroke-miterlimit:4;stroke-opacity:1;stroke-dasharray:none"
       d="m 400,488.36218 -3,6 6,0 z"
       id="path15679-6"
       inkscape:connector-curvature="0" />
    <path
       style="fill:#ffffff;stroke:#000000;stroke-width:0.60000002;stroke-linecap:butt;stroke-linejoin:miter;stroke-miterlimit:4;stroke-opacity:1;stroke-dasharray:none"
       d="m 400,588.36218 -3,6 6,0 z"
       id="path15679-4"
       inkscape:connector-curvature="0" />
    <path
       style="fill:#ffffff;stroke:#000000;stroke-width:0.60000002;stroke-linecap:butt;stroke-linejoin:miter;stroke-miterlimit:4;stroke-opacity:1;stroke-dasharray:none"
       d="m 300,588.36218 -3,6 6,0 z"
       id="path15679-7"
       inkscape:connector-curvature="0" />
    <text
       xml:space="preserve"
       style="font-size:10px;font-style:normal;font-variant:normal;font-weight:normal;font-stretch:normal;text-align:center;line-height:125%;letter-spacing:0px;word-spacing:0px;writing-mode:lr-tb;text-anchor:middle;fill:#000000;fill-opacity:1;stroke:none;font-family:Bitstream Vera Sans;-inkscape-font-specification:Bitstream Vera Sans"
       x="300"
       y="657.36218"
       id="text17117-1-98"
       sodipodi:linespacing="125%"><tspan
         sodipodi:role="line"
         id="tspan17119-6-8"
         x="300"
         y="657.36218">$i=0$</tspan></text>
    <text
       xml:space="preserve"
       style="font-size:10px;font-style:normal;font-variant:normal;font-weight:normal;font-stretch:normal;text-align:center;line-height:125%;letter-spacing:0px;word-spacing:0px;writing-mode:lr-tb;text-anchor:middle;fill:#000000;fill-opacity:1;stroke:none;font-family:Bitstream Vera Sans;-inkscape-font-specification:Bitstream Vera Sans"
       x="400"
       y="657.36218"
       id="text17117-1-98-1"
       sodipodi:linespacing="125%"><tspan
         sodipodi:role="line"
         id="tspan17119-6-8-2"
         x="400"
         y="657.36218">$i=1$</tspan></text>
    <text
       xml:space="preserve"
       style="font-size:10px;font-style:normal;font-variant:normal;font-weight:normal;font-stretch:normal;text-align:start;line-height:125%;letter-spacing:0px;word-spacing:0px;writing-mode:lr-tb;text-anchor:start;fill:#000000;fill-opacity:1;stroke:none;font-family:Bitstream Vera Sans;-inkscape-font-specification:Bitstream Vera Sans"
       x="455"
       y="597.36218"
       id="text17117-1-98-1-5"
       sodipodi:linespacing="125%"><tspan
         sodipodi:role="line"
         id="tspan17119-6-8-2-6"
         x="455"
         y="597.36218">$j=0$</tspan></text>
    <text
       xml:space="preserve"
       style="font-size:10px;font-style:normal;font-variant:normal;font-weight:normal;font-stretch:normal;text-align:start;line-height:125%;letter-spacing:0px;word-spacing:0px;writing-mode:lr-tb;text-anchor:start;fill:#000000;fill-opacity:1;stroke:none;font-family:Bitstream Vera Sans;-inkscape-font-specification:Bitstream Vera Sans"
       x="455"
       y="497.36218"
       id="text17117-1-98-1-5-6"
       sodipodi:linespacing="125%"><tspan
         sodipodi:role="line"
         id="tspan17119-6-8-2-6-1"
         x="455"
         y="497.36218">$j=1$</tspan></text>
    <text
       xml:space="preserve"
       style="font-size:10px;font-style:normal;font-variant:normal;font-weight:normal;font-stretch:normal;text-align:end;line-height:125%;letter-spacing:0px;word-spacing:0px;writing-mode:lr-tb;text-anchor:end;fill:#000000;fill-opacity:1;stroke:none;font-family:Bitstream Vera Sans;-inkscape-font-specification:Bitstream Vera Sans"
       x="250"
       y="637.36218"
       id="text17323"
       sodipodi:linespacing="125%"><tspan
         sodipodi:role="line"
         id="tspan17325"
         x="250"
         y="637.36218">$0$</tspan></text>
    <text
       xml:space="preserve"
       style="font-size:10px;font-style:normal;font-variant:normal;font-weight:normal;font-stretch:normal;text-align:end;line-height:125%;letter-spacing:0px;word-spacing:0px;writing-mode:lr-tb;text-anchor:end;fill:#000000;fill-opacity:1;stroke:none;font-family:Bitstream Vera Sans;-inkscape-font-specification:Bitstream Vera Sans"
       x="250"
       y="452.36218"
       id="text17323-8"
       sodipodi:linespacing="125%"><tspan
         sodipodi:role="line"
         id="tspan17325-8"
         x="250"
         y="452.36218">$3$</tspan></text>
    <text
       xml:space="preserve"
       style="font-size:10px;font-style:normal;font-variant:normal;font-weight:normal;font-stretch:normal;text-align:start;line-height:125%;letter-spacing:0px;word-spacing:0px;writing-mode:lr-tb;text-anchor:start;fill:#000000;fill-opacity:1;stroke:none;font-family:Bitstream Vera Sans;-inkscape-font-specification:Bitstream Vera Sans"
       x="450"
       y="637.36218"
       id="text17323-8-4"
       sodipodi:linespacing="125%"><tspan
         sodipodi:role="line"
         id="tspan17325-8-0"
         x="450"
         y="637.36218">$1$</tspan></text>
    <text
       xml:space="preserve"
       style="font-size:10px;font-style:normal;font-variant:normal;font-weight:normal;font-stretch:normal;text-align:start;line-height:125%;letter-spacing:0px;word-spacing:0px;writing-mode:lr-tb;text-anchor:start;fill:#000000;fill-opacity:1;stroke:none;font-family:Bitstream Vera Sans;-inkscape-font-specification:Bitstream Vera Sans"
       x="450"
       y="452.36218"
       id="text17323-8-4-0"
       sodipodi:linespacing="125%"><tspan
         sodipodi:role="line"
         id="tspan17325-8-0-0"
         x="450"
         y="452.36218">$2$</tspan></text>
    <g
       id="g17451"
       transform="matrix(1,0,0.0817675,1,-20.236379,0)" />
    <path
       style="fill:#ffffff;stroke:#000000;stroke-width:0.60000002;stroke-linecap:butt;stroke-linejoin:miter;stroke-miterlimit:4;stroke-opacity:1;stroke-dasharray:none"
       d="m 340,222.36218 -3,6 6,0 z"
       id="path15679-5"
       inkscape:connector-curvature="0" />
    <path
       style="fill:#ffffff;stroke:#000000;stroke-width:0.60000002;stroke-linecap:butt;stroke-linejoin:miter;stroke-miterlimit:4;stroke-opacity:1;stroke-dasharray:none"
       d="m 390,222.36218 -3,6 6,0 z"
       id="path15679-73"
       inkscape:connector-curvature="0" />
    <path
       style="fill:#ffffff;stroke:#000000;stroke-width:0.60000002;stroke-linecap:butt;stroke-linejoin:miter;stroke-miterlimit:4;stroke-opacity:1;stroke-dasharray:none"
       d="m 345,267.36218 -3,6 6,0 z"
       id="path15679-54"
       inkscape:connector-curvature="0" />
    <path
       style="fill:#ffffff;stroke:#000000;stroke-width:0.60000002;stroke-linecap:butt;stroke-linejoin:miter;stroke-miterlimit:4;stroke-opacity:1;stroke-dasharray:none"
       d="m 387,267.36218 -3,6 6,0 z"
       id="path15679-2"
       inkscape:connector-curvature="0" />
    <text
       xml:space="preserve"
       style="font-size:10px;font-style:normal;font-variant:normal;font-weight:normal;font-stretch:normal;text-align:end;line-height:125%;letter-spacing:0px;word-spacing:0px;writing-mode:lr-tb;text-anchor:end;fill:#000000;fill-opacity:1;stroke:none;font-family:Bitstream Vera Sans;-inkscape-font-specification:Bitstream Vera Sans"
       x="305"
       y="192.36218"
       id="text17323-8-0"
       sodipodi:linespacing="125%"><tspan
         sodipodi:role="line"
         id="tspan17325-8-1"
         x="305"
         y="192.36218">$\mcircled{25}$</tspan></text>
    <text
       xml:space="preserve"
       style="font-size:10px;font-style:normal;font-variant:normal;font-weight:normal;font-stretch:normal;text-align:end;line-height:125%;letter-spacing:0px;word-spacing:0px;writing-mode:lr-tb;text-anchor:end;fill:#000000;fill-opacity:1;stroke:none;font-family:Bitstream Vera Sans;-inkscape-font-specification:Bitstream Vera Sans"
       x="310"
       y="287.36218"
       id="text17323-8-0-4"
       sodipodi:linespacing="125%"><tspan
         sodipodi:role="line"
         id="tspan17325-8-1-2"
         x="310"
         y="287.36218">$\mcircled{17}$</tspan></text>
    <text
       xml:space="preserve"
       style="font-size:10px;font-style:normal;font-variant:normal;font-weight:normal;font-stretch:normal;text-align:start;line-height:125%;letter-spacing:0px;word-spacing:0px;writing-mode:lr-tb;text-anchor:start;fill:#000000;fill-opacity:1;stroke:none;font-family:Bitstream Vera Sans;-inkscape-font-specification:Bitstream Vera Sans"
       x="430"
       y="192.36218"
       id="text17323-8-0-4-8"
       sodipodi:linespacing="125%"><tspan
         sodipodi:role="line"
         id="tspan17325-8-1-2-3"
         x="430"
         y="192.36218">$\mcircled{19}$</tspan></text>
    <text
       xml:space="preserve"
       style="font-size:10px;font-style:normal;font-variant:normal;font-weight:normal;font-stretch:normal;text-align:start;line-height:125%;letter-spacing:0px;word-spacing:0px;writing-mode:lr-tb;text-anchor:start;fill:#000000;fill-opacity:1;stroke:none;font-family:Bitstream Vera Sans;-inkscape-font-specification:Bitstream Vera Sans"
       x="420"
       y="282.36218"
       id="text17323-8-0-4-8-0"
       sodipodi:linespacing="125%"><tspan
         sodipodi:role="line"
         id="tspan17325-8-1-2-3-0"
         x="420"
         y="282.36218">$\mcircled{23}$</tspan></text>
    <text
       xml:space="preserve"
       style="font-size:10px;font-style:normal;font-variant:normal;font-weight:normal;font-stretch:normal;text-align:center;line-height:125%;letter-spacing:0px;word-spacing:0px;writing-mode:lr-tb;text-anchor:middle;fill:#000000;fill-opacity:1;stroke:none;font-family:Bitstream Vera Sans;-inkscape-font-specification:Bitstream Vera Sans"
       x="365"
       y="177.36218"
       id="text17592"
       sodipodi:linespacing="125%"><tspan
         sodipodi:role="line"
         id="tspan17594"
         x="365"
         y="177.36218">global node</tspan></text>
    <text
       xml:space="preserve"
       style="font-size:10px;font-style:normal;font-variant:normal;font-weight:normal;font-stretch:normal;text-align:start;line-height:125%;letter-spacing:0px;word-spacing:0px;writing-mode:lr-tb;text-anchor:start;fill:#000000;fill-opacity:1;stroke:none;font-family:Bitstream Vera Sans;-inkscape-font-specification:Bitstream Vera Sans"
       x="375"
       y="412.36218"
       id="text17596"
       sodipodi:linespacing="125%"><tspan
         sodipodi:role="line"
         id="tspan17598"
         x="375"
         y="412.36218">local node</tspan></text>
    <path
       style="fill:none;stroke:#000000;stroke-width:0.80000001;stroke-linecap:butt;stroke-linejoin:miter;stroke-miterlimit:4;stroke-opacity:1;stroke-dasharray:none;marker-start:url(#Arrow2Lstart)"
       d="m 430,232.36218 c 0,0 120,20 120,160 0,160 -80,170 -80,170"
       id="path17600"
       inkscape:connector-curvature="0"
       sodipodi:nodetypes="csc" />
    <text
       xml:space="preserve"
       style="font-size:10px;font-style:normal;font-variant:normal;font-weight:normal;font-stretch:normal;text-align:start;line-height:125%;letter-spacing:0px;word-spacing:0px;writing-mode:lr-tb;text-anchor:start;fill:#000000;fill-opacity:1;stroke:none;font-family:Bitstream Vera Sans;-inkscape-font-specification:Bitstream Vera Sans"
       x="550"
       y="332.36218"
       id="text17786"
       sodipodi:linespacing="125%"><tspan
         sodipodi:role="line"
         id="tspan17788"
         x="550"
         y="332.36218">$\bfx(\bfr)$</tspan></text>
    <text
       xml:space="preserve"
       style="font-size:10px;font-style:normal;font-variant:normal;font-weight:normal;font-stretch:normal;text-align:start;line-height:125%;letter-spacing:0px;word-spacing:0px;writing-mode:lr-tb;text-anchor:start;fill:#000000;fill-opacity:1;stroke:none;font-family:Bitstream Vera Sans;-inkscape-font-specification:Bitstream Vera Sans"
       x="540"
       y="302.36218"
       id="text17790"
       sodipodi:linespacing="125%"><tspan
         sodipodi:role="line"
         id="tspan17792"
         x="540"
         y="302.36218">bilinear mapping</tspan></text>
    <text
       xml:space="preserve"
       style="font-size:10px;font-style:normal;font-variant:normal;font-weight:normal;font-stretch:normal;text-align:start;line-height:125%;letter-spacing:0px;word-spacing:0px;writing-mode:lr-tb;text-anchor:start;fill:#000000;fill-opacity:1;stroke:none;font-family:Bitstream Vera Sans;-inkscape-font-specification:Bitstream Vera Sans"
       x="375"
       y="427.36218"
       id="text17832"
       sodipodi:linespacing="125%"><tspan
         sodipodi:role="line"
         id="tspan17834"
         x="375"
         y="427.36218">numbers</tspan></text>
    <text
       xml:space="preserve"
       style="font-size:10px;font-style:normal;font-variant:normal;font-weight:normal;font-stretch:normal;text-align:center;line-height:125%;letter-spacing:0px;word-spacing:0px;writing-mode:lr-tb;text-anchor:middle;fill:#000000;fill-opacity:1;stroke:none;font-family:Bitstream Vera Sans;-inkscape-font-specification:Bitstream Vera Sans"
       x="365"
       y="192.36218"
       id="text17592-3"
       sodipodi:linespacing="125%"><tspan
         sodipodi:role="line"
         id="tspan17594-5"
         x="365"
         y="192.36218">numbers</tspan></text>
  </g>
</svg>
