<?xml version="1.0" encoding="UTF-8" standalone="no"?>
<!-- Created with Inkscape (http://www.inkscape.org/) -->

<svg
   xmlns:dc="http://purl.org/dc/elements/1.1/"
   xmlns:cc="http://creativecommons.org/ns#"
   xmlns:rdf="http://www.w3.org/1999/02/22-rdf-syntax-ns#"
   xmlns:svg="http://www.w3.org/2000/svg"
   xmlns="http://www.w3.org/2000/svg"
   xmlns:sodipodi="http://sodipodi.sourceforge.net/DTD/sodipodi-0.dtd"
   xmlns:inkscape="http://www.inkscape.org/namespaces/inkscape"
   width="744.09448819"
   height="1052.3622047"
   id="svg7236"
   version="1.1"
   inkscape:version="0.48.3.1 r9886"
   sodipodi:docname="stress.svg">
  <defs
     id="defs7238">
    <marker
       inkscape:stockid="Arrow2Lstart"
       orient="auto"
       refY="0.0"
       refX="0.0"
       id="Arrow2Lstart"
       style="overflow:visible">
      <path
         id="path4460"
         style="font-size:12.0;fill-rule:evenodd;stroke-width:0.62500000;stroke-linejoin:round"
         d="M 8.7185878,4.0337352 L -2.2072895,0.016013256 L 8.7185884,-4.0017078 C 6.9730900,-1.6296469 6.9831476,1.6157441 8.7185878,4.0337352 z "
         transform="scale(1.1) translate(1,0)" />
    </marker>
    <marker
       inkscape:stockid="Arrow2Lend"
       orient="auto"
       refY="0.0"
       refX="0.0"
       id="Arrow2Lend"
       style="overflow:visible;">
      <path
         id="path3785"
         style="font-size:12.0;fill-rule:evenodd;stroke-width:0.62500000;stroke-linejoin:round;"
         d="M 8.7185878,4.0337352 L -2.2072895,0.016013256 L 8.7185884,-4.0017078 C 6.9730900,-1.6296469 6.9831476,1.6157441 8.7185878,4.0337352 z "
         transform="scale(1.1) rotate(180) translate(1,0)" />
    </marker>
    <marker
       inkscape:stockid="Arrow2Lend"
       orient="auto"
       refY="0"
       refX="0"
       id="Arrow2Lend-0"
       style="overflow:visible">
      <path
         inkscape:connector-curvature="0"
         id="path3785-8"
         style="font-size:12px;fill-rule:evenodd;stroke-width:0.625;stroke-linejoin:round"
         d="M 8.7185878,4.0337352 -2.2072895,0.01601326 8.7185884,-4.0017078 c -1.7454984,2.3720609 -1.7354408,5.6174519 -6e-7,8.035443 z"
         transform="matrix(-1.1,0,0,-1.1,-1.1,0)" />
    </marker>
  </defs>
  <sodipodi:namedview
     id="base"
     pagecolor="#ffffff"
     bordercolor="#666666"
     borderopacity="1.0"
     inkscape:pageopacity="0.0"
     inkscape:pageshadow="2"
     inkscape:zoom="1.4"
     inkscape:cx="286.39188"
     inkscape:cy="794.09049"
     inkscape:document-units="px"
     inkscape:current-layer="layer1"
     showgrid="true"
     inkscape:window-width="1215"
     inkscape:window-height="1000"
     inkscape:window-x="65"
     inkscape:window-y="24"
     inkscape:window-maximized="1"
     inkscape:snap-global="true"
     showguides="true"
     inkscape:guide-bbox="true">
    <inkscape:grid
       type="xygrid"
       id="grid7244"
       empspacing="5"
       visible="true"
       enabled="true"
       snapvisiblegridlinesonly="true" />
  </sodipodi:namedview>
  <metadata
     id="metadata7241">
    <rdf:RDF>
      <cc:Work
         rdf:about="">
        <dc:format>image/svg+xml</dc:format>
        <dc:type
           rdf:resource="http://purl.org/dc/dcmitype/StillImage" />
        <dc:title></dc:title>
      </cc:Work>
    </rdf:RDF>
  </metadata>
  <g
     inkscape:label="Layer 1"
     inkscape:groupmode="layer"
     id="layer1">
    <path
       style="fill:none;stroke:#000000;stroke-width:0.3;stroke-linecap:butt;stroke-linejoin:miter;stroke-opacity:1;stroke-miterlimit:4;stroke-dasharray:none"
       d="m 160,252.36218 240,50"
       id="path7270"
       inkscape:connector-curvature="0"
       sodipodi:nodetypes="cc" />
    <path
       sodipodi:type="arc"
       style="fill:#e6e6e6;stroke:#000000;stroke-width:1.37893844000000021;stroke-miterlimit:4;stroke-dasharray:none"
       id="path3195-8"
       sodipodi:cx="300"
       sodipodi:cy="227.36218"
       sodipodi:rx="90"
       sodipodi:ry="25"
       d="m 390,227.36218 a 90,25 0 1 1 -180,0 90,25 0 1 1 180,0 z"
       transform="matrix(0.75730829,0,0,1,45.965259,-100)" />
    <path
       style="fill:#e6e6e6;stroke:#000000;stroke-width:1.20000005000000010;stroke-linecap:butt;stroke-linejoin:miter;stroke-miterlimit:4;stroke-opacity:1;stroke-dasharray:none"
       d="m 341.32519,127.25454 c 0.10879,-4.9115 2.30408,-22.85871 -7.07107,-53.379417 -9.28548,-30.228787 -70,-49.999996 -70,-49.999996 -50,-10 -59.28571,63.749996 -59.28571,103.749993"
       id="path7246-5"
       inkscape:connector-curvature="0"
       sodipodi:nodetypes="cscc" />
    <path
       style="fill:none;stroke:#000000;stroke-width:0.3;stroke-linecap:butt;stroke-linejoin:miter;stroke-opacity:1;stroke-miterlimit:4;stroke-dasharray:none"
       d="m 160,72.362183 0,179.999997 -90,110"
       id="path7268"
       inkscape:connector-curvature="0" />
    <g
       id="g4000"
       style="fill:#e6e6e6">
      <path
         sodipodi:nodetypes="cssssc"
         inkscape:connector-curvature="0"
         id="path7246"
         d="M 205.71429,226.64789 C 205,233.61218 205,241.64789 205,247.36218 c 0,40 -40,60 -30,90 10,30 30,50 60,50 30,0 90,-10 100,-70 10,-60 7.32143,-84.46429 7.14286,-89.46429"
         style="fill:#e6e6e6;stroke:#000000;stroke-width:1.20000005000000010;stroke-linecap:butt;stroke-linejoin:miter;stroke-miterlimit:4;stroke-opacity:1;stroke-dasharray:none" />
      <path
         transform="matrix(0.75730829,0,0,1,46.748203,0.71428571)"
         d="m 390,227.36218 a 90,25 0 1 1 -180,0 90,25 0 1 1 180,0 z"
         sodipodi:ry="25"
         sodipodi:rx="90"
         sodipodi:cy="227.36218"
         sodipodi:cx="300"
         id="path3195"
         style="fill:#e6e6e6;stroke:#000000;stroke-width:1.37893847999999997;stroke-miterlimit:4;stroke-dasharray:none"
         sodipodi:type="arc" />
    </g>
    <path
       sodipodi:type="arc"
       style="fill:#ffffff;fill-opacity:1;fill-rule:nonzero;stroke:#000000;stroke-width:0.80000001;stroke-miterlimit:4;stroke-opacity:1;stroke-dasharray:none;stroke-dashoffset:0"
       id="path4004"
       sodipodi:cx="275"
       sodipodi:cy="227.36218"
       sodipodi:rx="20"
       sodipodi:ry="10"
       d="m 295,227.36218 a 20,10 0 1 1 -40,0 20,10 0 1 1 40,0 z" />
    <path
       style="fill:none;stroke:#000000;stroke-width:0.6;stroke-linecap:butt;stroke-linejoin:miter;stroke-miterlimit:4;stroke-opacity:1;stroke-dasharray:none;marker-end:url(#Arrow2Lend)"
       d="m 160,252.36218 115,-25"
       id="path8182"
       inkscape:connector-curvature="0"
       sodipodi:nodetypes="cc" />
    <text
       xml:space="preserve"
       style="font-size:14px;font-style:normal;font-weight:normal;line-height:125%;letter-spacing:0px;word-spacing:0px;writing-mode:lr-tb;fill:#000000;fill-opacity:1;stroke:none;font-family:Bitstream Vera Sans"
       x="80"
       y="362.36218"
       id="text8366"
       sodipodi:linespacing="125%"><tspan
         sodipodi:role="line"
         id="tspan8368"
         x="80"
         y="362.36218">$X_1,x_1$</tspan></text>
    <text
       xml:space="preserve"
       style="font-size:14px;font-style:normal;font-weight:normal;line-height:125%;letter-spacing:0px;word-spacing:0px;writing-mode:lr-tb;fill:#000000;fill-opacity:1;stroke:none;font-family:Bitstream Vera Sans"
       x="165"
       y="82.362183"
       id="text8374"
       sodipodi:linespacing="125%"><tspan
         sodipodi:role="line"
         id="tspan8376"
         x="165"
         y="82.362183">$X_3,x_3$</tspan></text>
    <text
       xml:space="preserve"
       style="font-size:14px;font-style:normal;font-weight:normal;text-align:center;line-height:125%;letter-spacing:0px;word-spacing:0px;writing-mode:lr-tb;text-anchor:middle;fill:#000000;fill-opacity:1;stroke:none;font-family:Bitstream Vera Sans"
       x="230"
       y="402.36218"
       id="text8416"
       sodipodi:linespacing="125%"><tspan
         sodipodi:role="line"
         id="tspan8418"
         x="230"
         y="402.36218">time $t$</tspan></text>
    <text
       xml:space="preserve"
       style="font-size:14px;font-style:normal;font-weight:normal;text-align:center;line-height:125%;letter-spacing:0px;word-spacing:0px;writing-mode:lr-tb;text-anchor:middle;fill:#000000;fill-opacity:1;stroke:none;font-family:Bitstream Vera Sans"
       x="260"
       y="47.362183"
       id="text8493"
       sodipodi:linespacing="125%"><tspan
         sodipodi:role="line"
         id="tspan8495"
         x="260"
         y="47.362183">$\omega$</tspan></text>
    <path
       style="fill:none;stroke:#000000;stroke-width:0.3;stroke-linecap:butt;stroke-linejoin:miter;stroke-opacity:1;stroke-miterlimit:4;stroke-dasharray:none"
       d="m 185,342.36218 c 0,0 10,20 25,30 15,10 40.71429,6.07143 45,5"
       id="path8539"
       inkscape:connector-curvature="0" />
    <path
       style="fill:none;stroke:#000000;stroke-width:0.3;stroke-linecap:butt;stroke-linejoin:miter;stroke-miterlimit:4;stroke-opacity:1;stroke-dasharray:none"
       d="m 194.82143,343.31702 c 0,0 3.75,11.42857 18.75,21.42857 15,10 31.96429,7.5 36.25,6.42857"
       id="path8539-2"
       inkscape:connector-curvature="0"
       sodipodi:nodetypes="csc" />
    <path
       style="fill:none;stroke:#000000;stroke-width:0.3;stroke-linecap:butt;stroke-linejoin:miter;stroke-miterlimit:4;stroke-opacity:1;stroke-dasharray:none"
       d="m 203.39287,343.67416 c 3.36671,4.11048 10.15607,10.75106 16.42857,14.46429 11.20913,6.63564 21.07143,5.89365 25.71429,5"
       id="path8539-6"
       inkscape:connector-curvature="0"
       sodipodi:nodetypes="csc" />
    <path
       style="fill:none;stroke:#000000;stroke-width:0.6;stroke-linecap:butt;stroke-linejoin:miter;stroke-opacity:1;stroke-miterlimit:4;stroke-dasharray:none;marker-end:url(#Arrow2Lend)"
       d="m 275,227.36218 -30,-55"
       id="path4006"
       inkscape:connector-curvature="0"
       sodipodi:nodetypes="cc" />
    <path
       sodipodi:type="arc"
       style="fill:#e6e6e6;stroke:#000000;stroke-width:1.37893844;stroke-miterlimit:4;stroke-dasharray:4.13681544, 4.13681544;stroke-dashoffset:0"
       id="path3195-8-8"
       sodipodi:cx="300"
       sodipodi:cy="227.36218"
       sodipodi:rx="90"
       sodipodi:ry="25"
       d="m 210,227.36218 a 90,25 0 0 1 180,0"
       transform="matrix(0.75730829,0,0,1,45.965259,-100)"
       sodipodi:start="3.1415927"
       sodipodi:end="6.2831853"
       sodipodi:open="true" />
    <path
       transform="translate(0,-100)"
       sodipodi:type="arc"
       style="fill:#ffffff;fill-opacity:1;fill-rule:nonzero;stroke:#000000;stroke-width:0.6;stroke-miterlimit:4;stroke-opacity:1;stroke-dasharray:2.4,2.4;stroke-dashoffset:0"
       id="path4004-8"
       sodipodi:cx="275"
       sodipodi:cy="227.36218"
       sodipodi:rx="20"
       sodipodi:ry="10"
       d="m 295,227.36218 a 20,10 0 1 1 -40,0 20,10 0 1 1 40,0 z" />
    <path
       sodipodi:type="arc"
       style="fill:#ffffff;stroke:#000000;stroke-width:0.80000001;stroke-miterlimit:4;stroke-opacity:1;stroke-dasharray:2.40000004,2.40000004;stroke-dashoffset:0"
       id="path7272-1"
       sodipodi:cx="270"
       sodipodi:cy="282.36218"
       sodipodi:rx="3"
       sodipodi:ry="3"
       d="m 273,282.36218 a 3,3 0 1 1 -6,0 3,3 0 1 1 6,0 z"
       transform="translate(5,-155)" />
    <path
       style="fill:none;stroke:#000000;stroke-width:0.6;stroke-linecap:butt;stroke-linejoin:miter;stroke-miterlimit:4;stroke-opacity:1;stroke-dasharray:none;marker-end:none;marker-start:url(#Arrow2Lstart)"
       d="m 305,182.36218 -30,-55"
       id="path4006-0"
       inkscape:connector-curvature="0"
       sodipodi:nodetypes="cc" />
    <path
       style="fill:none;stroke:#000000;stroke-width:0.6;stroke-linecap:butt;stroke-linejoin:miter;stroke-opacity:1;stroke-miterlimit:4;stroke-dasharray:none;marker-end:url(#Arrow2Lend-0)"
       d="m 275,227.36218 0,-35"
       id="path4887"
       inkscape:connector-curvature="0" />
    <path
       style="fill:none;stroke:#000000;stroke-width:0.6;stroke-linecap:butt;stroke-linejoin:miter;stroke-opacity:1;stroke-miterlimit:4;stroke-dasharray:none;marker-end:url(#Arrow2Lend-0)"
       d="m 275,127.36218 0,35"
       id="path4889"
       inkscape:connector-curvature="0" />
    <text
       xml:space="preserve"
       style="font-size:14px;font-style:normal;font-weight:normal;line-height:125%;letter-spacing:0px;word-spacing:0px;writing-mode:lr-tb;fill:#000000;fill-opacity:1;stroke:none;font-family:Bitstream Vera Sans"
       x="390"
       y="292.36218"
       id="text8366-4"
       sodipodi:linespacing="125%"><tspan
         sodipodi:role="line"
         id="tspan8368-2"
         x="390"
         y="292.36218">$X_2,x_2$</tspan></text>
    <text
       xml:space="preserve"
       style="font-size:14px;font-style:normal;font-weight:normal;line-height:125%;letter-spacing:0px;word-spacing:0px;writing-mode:lr-tb;fill:#000000;fill-opacity:1;stroke:none;font-family:Bitstream Vera Sans"
       x="280"
       y="232.36218"
       id="text7990"
       sodipodi:linespacing="125%"><tspan
         sodipodi:role="line"
         id="tspan7992"
         x="280"
         y="232.36218">$\bfP$</tspan></text>
    <text
       xml:space="preserve"
       style="font-size:14px;font-style:normal;font-weight:normal;text-align:center;line-height:125%;letter-spacing:0px;word-spacing:0px;writing-mode:lr-tb;text-anchor:middle;fill:#000000;fill-opacity:1;stroke:none;font-family:Bitstream Vera Sans"
       x="275"
       y="176.36218"
       id="text5341-3"
       sodipodi:linespacing="125%"><tspan
         sodipodi:role="line"
         id="tspan5343-5"
         x="275"
         y="176.36218">$-\bfn$</tspan></text>
    <text
       xml:space="preserve"
       style="font-size:14px;font-style:normal;font-weight:normal;text-align:end;line-height:125%;letter-spacing:0px;word-spacing:0px;writing-mode:lr-tb;text-anchor:end;fill:#000000;fill-opacity:1;stroke:none;font-family:Bitstream Vera Sans"
       x="250"
       y="222.36218"
       id="text5404"
       sodipodi:linespacing="125%"><tspan
         sodipodi:role="line"
         id="tspan5406"
         x="250"
         y="222.36218">$\Delta a$</tspan></text>
    <text
       xml:space="preserve"
       style="font-size:14px;font-style:normal;font-weight:normal;text-align:end;line-height:125%;letter-spacing:0px;word-spacing:0px;writing-mode:lr-tb;text-anchor:end;fill:#000000;fill-opacity:1;stroke:none;font-family:Bitstream Vera Sans"
       x="240"
       y="182.36218"
       id="text5408"
       sodipodi:linespacing="125%"><tspan
         sodipodi:role="line"
         id="tspan5410"
         x="240"
         y="182.36218">$\Delta {\cal P}$</tspan></text>
    <text
       xml:space="preserve"
       style="font-size:14px;font-style:normal;font-weight:normal;line-height:125%;letter-spacing:0px;word-spacing:0px;writing-mode:lr-tb;fill:#000000;fill-opacity:1;stroke:none;font-family:Bitstream Vera Sans"
       x="310"
       y="182.36218"
       id="text5412"
       sodipodi:linespacing="125%"><tspan
         sodipodi:role="line"
         id="tspan5414"
         x="310"
         y="182.36218">$-\Delta {\cal P}$</tspan></text>
    <path
       sodipodi:type="arc"
       style="fill:#ffffff;stroke:#000000;stroke-width:0.80000001;stroke-miterlimit:4;stroke-opacity:1;stroke-dasharray:none;stroke-dashoffset:0"
       id="path7272"
       sodipodi:cx="270"
       sodipodi:cy="282.36218"
       sodipodi:rx="3"
       sodipodi:ry="3"
       d="m 273,282.36218 a 3,3 0 1 1 -6,0 3,3 0 1 1 6,0 z"
       transform="translate(5,-55)" />
    <text
       xml:space="preserve"
       style="font-size:14px;font-style:normal;font-weight:normal;text-align:center;line-height:125%;letter-spacing:0px;word-spacing:0px;writing-mode:lr-tb;text-anchor:middle;fill:#000000;fill-opacity:1;stroke:none;font-family:Bitstream Vera Sans"
       x="275"
       y="190.36218"
       id="text5341-3-7"
       sodipodi:linespacing="125%"><tspan
         sodipodi:role="line"
         id="tspan5343-5-6"
         x="275"
         y="190.36218">$\bfn$</tspan></text>
  </g>
</svg>
