%!PS-Adobe-2.0 EPSF-2.0
%%BoundingBox: 20 20 560 328
%%Title: Z:\home\svn\mueli-da\src_images\fe_loesung.eps 
%%Creator: AutoCAD PSOUT
%%For:  , 
%%Pages: 1
%%DocumentFonts: (atend)
%%DocumentNeededFonts: (atend)
%%CreationDate: 2007-02-28
%%EndComments
save
20 20 translate
0.24 dup scale
0 setlinewidth
/ACADLayer  { pop } def
/ACADColor { setrgbcolor pop } def
/ACADLtype { pop
userdict /Linedict known not { /Linedict 100 dict def } if
1 index cvn Linedict exch known not {
mark 1 index { dup 0 eq { pop 1 72.0 div } if abs } forall
counttomark 2 add -1 roll astore exch pop
1 index cvn exch Linedict begin def end }
{ pop } ifelse 
Linedict begin cvx exec 0 setdash end } bind def
/bd{bind def}bind def /m{moveto}bd /l{lineto}bd /s{stroke}bd
/a{arc}bd /an{arcn}bd /gs{gsave}bd /gr{grestore}bd
/cp{closepath}bd /tr{translate}bd /sc{scale}bd /co{concat}bd
/ff{findfont}bd /sf{setfont}bd /sh{show}bd /np{newpath}bd
/sw{setlinewidth}bd /sj{setlinejoin}bd /sm{setmiterlimit}bd
/cl{clip}bd /fi{fill}bd
%%EndProlog
%%Page: 1 1
gs np -20 -20 m -20 1299 l  2269 1299 l 2269 -20 l cp cl np 7 0 0 0 ACADColor
(0) ACADLayer (_Continuous) [  ] (A) ACADLtype np 541 1222 m 545 1245 l
549 1222 l cp fi 545 1222 m 545 782 l s np 1727 786 m 1750 782 l 1727 778 l
cp fi 1727 782 m 545 782 l s gs 9.2712 9.2666 sc 53.8407 -0.5462 tr
[ 1 0 0 1 5 99.54081072 ] co np 0 0 1 0 360 a s gr gs 9.2712 9.2666 sc
53.8407 -0.5462 tr [ 1 0 0 1 45 120 ] co np 0 0 1 0 360 a s gr gs
9.2712 9.2666 sc 53.8407 -0.5462 tr [ 1 0 0 1 85 125 ] co np 0 0 1 0 360 a s gr
gs 9.2712 9.2666 sc 53.8407 -0.5462 tr [ 1 0 0 1 125 108.19649551 ] co np
0 0 1 0 360 a s gr 5 0 0 1 ACADColor (_CENTER) [  9.525  -1.905  1.905  -1.905
 ] (A) ACADLtype gs 9.2712 9.2666 sc 53.8407 -0.5462 tr
5.9363 99.8919 m 44.0637 119.6489 l s gr gs 9.2712 9.2666 sc 53.8407 -0.5462 tr
45.9923 120.124 m 84.0077 124.876 l s gr gs 9.2712 9.2666 sc 53.8407 -0.5462 tr
85.9363 124.6489 m 124.0637 108.5476 l s gr 7 0 0 0 ACADColor (_Continuous) [
 ] (A) ACADLtype 553 921 m 595 953 l 637 981 l 680 1007 l 725 1031 l 769 1052 l
815 1071 l 907 1104 l s np 1727 276 m 1750 272 l 1727 269 l cp fi
1727 272 m 545 272 l s np 541 620 m 545 643 l 549 620 l cp fi
545 620 m 545 272 l s (_DASHED) [  3.81  -1.905  ] (A) ACADLtype gs
9.2712 9.2666 sc 53.8407 -0.5462 tr 45 119 m 45 85 l s gr gs 9.2712 9.2666 sc
53.8407 -0.5462 tr 85 124 m 85 85 l s gr gs 9.2712 9.2666 sc 53.8407 -0.5462 tr
125 107.1965 m 125 85 l s gr (_Continuous) [  ] (A) ACADLtype
925 1109 m 1013 1130 l 1101 1146 l 1145 1152 l 1189 1155 l 1234 1156 l
1277 1154 l s 1296 1152 m 1342 1145 l 1388 1134 l 1434 1120 l 1479 1102 l
1523 1082 l 1566 1058 l 1609 1031 l 1650 1002 l s (_DASHED) [  3.81  -1.905
 ] (A) ACADLtype gs 9.2712 9.2666 sc 53.8407 -0.5462 tr
45 45.8027 m 45 41.6206 l s gr gs 9.2712 9.2666 sc 53.8407 -0.5462 tr
85 34.0976 m 85 27.8128 l s gr 5 0 0 1 ACADColor (_CENTER) [  9.525  -1.905
 1.905  -1.905  ] (A) ACADLtype gs 9.2712 9.2666 sc 53.8407 -0.5462 tr
5 45.8027 m 45 45.8027 l s gr gs 9.2712 9.2666 sc 53.8407 -0.5462 tr
45 34.0976 m 85 34.0976 l s gr gs 9.2712 9.2666 sc 53.8407 -0.5462 tr
85 15.3835 m 125 15.3835 l s gr 7 0 0 0 ACADColor (_DASHED) [  3.81  -1.905
 ] (A) ACADLtype gs 9.2712 9.2666 sc 53.8407 -0.5462 tr 125 30 m 125 6 l s gr
(_Continuous) [  ] (A) ACADLtype 545 483 m 689 434 l 835 388 l 983 347 l
1131 307 l 1204 284 l 1274 256 l 1343 224 l 1408 186 l 1472 145 l 1535 100 l
1658 6 l s 1 1 0 0 ACADColor 546 473 m 907 373 l s 925 368 m 1278 246 l
s 1295 238 m 1649 45 l s gs 9.2712 9.2666 sc 53.8407 -0.5462 tr
[ 1 0 0 1 45 40.62060968 ] co np 0 0 1 0 360 a s gr 7 0 0 0 ACADColor
(_DASHED) [  3.81  -1.905  ] (A) ACADLtype gs 9.2712 9.2666 sc
53.8407 -0.5462 tr 45 39.6206 m 45 30 l s gr 1 1 0 0 ACADColor (_Continuous) [
 ] (A) ACADLtype gs 9.2712 9.2666 sc 53.8407 -0.5462 tr
[ 1 0 0 1 85 26.81278787 ] co np 0 0 1 0 360 a s gr 7 0 0 0 ACADColor
(_DASHED) [  3.81  -1.905  ] (A) ACADLtype gs 9.2712 9.2666 sc
53.8407 -0.5462 tr 85 25.8128 m 85 15.3835 l s gr 1 1 0 0 ACADColor
(_Continuous) [  ] (A) ACADLtype gs 9.2712 9.2666 sc 53.8407 -0.5462 tr
[ 1 0 0 1 125 5 ] co np 0 0 1 0 360 a s gr 7 0 0 0 ACADColor (_DASHED) [  3.81
 -1.905  ] (A) ACADLtype gs 9.2712 9.2666 sc 53.8407 -0.5462 tr
125 4 m 125 1.2289 l s gr (_Continuous) [  ] (A) ACADLtype gs 9.2712 9.2666 sc
53.8407 -0.5462 tr [ 1 0 0 1 4.75 85 ] co 0.5 sw 0 sj 10 sm np 0 0 m np
0.25 0 0.25 180 0 a 0.25 0 0.25 0 180 a cp s gr gs 9.2712 9.2666 sc
53.8407 -0.5462 tr [ 1 0 0 1 44.75 85 ] co 0.5 sw 0 sj 10 sm np 0 0 m np
0.25 0 0.25 180 0 a 0.25 0 0.25 0 180 a cp s gr gs 9.2712 9.2666 sc
53.8407 -0.5462 tr [ 1 0 0 1 84.75 85 ] co 0.5 sw 0 sj 10 sm np 0 0 m np
0.25 0 0.25 180 0 a 0.25 0 0.25 0 180 a cp s gr gs 9.2712 9.2666 sc
53.8407 -0.5462 tr [ 1 0 0 1 124.75 85 ] co 0.5 sw 0 sj 10 sm np 0 0 m np
0.25 0 0.25 180 0 a 0.25 0 0.25 0 180 a cp s gr gs 9.2712 9.2666 sc
53.8407 -0.5462 tr [ 1 0 0 1 4.75 30 ] co 0.5 sw 0 sj 10 sm np 0 0 m np
0.25 0 0.25 180 0 a 0.25 0 0.25 0 180 a cp s gr gs 9.2712 9.2666 sc
53.8407 -0.5462 tr [ 1 0 0 1 44.75 30 ] co 0.5 sw 0 sj 10 sm np 0 0 m np
0.25 0 0.25 180 0 a 0.25 0 0.25 0 180 a cp s gr gs 9.2712 9.2666 sc
53.8407 -0.5462 tr [ 1 0 0 1 84.75 30 ] co 0.5 sw 0 sj 10 sm np 0 0 m np
0.25 0 0.25 180 0 a 0.25 0 0.25 0 180 a cp s gr gs 9.2712 9.2666 sc
53.8407 -0.5462 tr [ 1 0 0 1 124.75 30 ] co 0.5 sw 0 sj 10 sm np 0 0 m np
0.25 0 0.25 180 0 a 0.25 0 0.25 0 180 a cp s gr (font_l) ACADLayer
1704 828 m 1704 856 l s 1704 319 m 1704 347 l s (font_r) ACADLayer
499 1245 m 499 1273 l s 499 643 m 499 671 l s (font_l) ACADLayer
916 776 m 916 678 l s 1287 776 m 1287 678 l s 939 689 m 1264 689 l s
np 939 693 m 939 686 l 916 689 l 916 689 l cp fi np 1264 693 m 1264 686 l
1287 689 l 1287 689 l cp fi 916 782 m 916 782 l s 1287 782 m 1287 782 l
s 1287 689 m 1287 689 l s (font_c) ACADLayer 1101 712 m 1101 740 l s
(font_l) ACADLayer 1426 1199 m 1426 1227 l s 1519 1153 m 1519 1181 l
s 1426 319 m 1426 347 l s 1240 411 m 1240 439 l s (font_r) ACADLayer
1148 133 m 1148 161 l s 5 0 0 1 ACADColor (0) ACADLayer np 1361 1144 m
1342 1130 l 1355 1149 l cp fi 1358 1147 m 1407 1199 l s 7 0 0 0 ACADColor
np 1495 1121 m 1483 1101 l 1488 1124 l cp fi 1491 1122 m 1503 1153 l s
np 1366 237 m 1352 219 l 1359 241 l cp fi 1363 239 m 1406 319 l s
5 0 0 1 ACADColor np 1205 332 m 1195 310 l 1198 334 l cp fi
1202 333 m 1224 411 l s 1 1 0 0 ACADColor np 1225 241 m 1239 259 l 1231 237 l
cp fi 1228 239 m 1172 133 l s
showpage
%%Trailer
restore
%%DocumentFonts:
%%DocumentNeededFonts:
