%!PS-Adobe-2.0 EPSF-2.0
%%BoundingBox: 20 20 560 328
%%Title: Z:\home\svn\mueli-da\src_images\model_scheibe_loch_acad.eps 
%%Creator: AutoCAD PSOUT
%%For:  , 
%%Pages: 1
%%DocumentFonts: (atend)
%%DocumentNeededFonts: (atend)
%%CreationDate: 2007-02-28
%%EndComments
save
20 20 translate
0.24 dup scale
0 setlinewidth
/ACADLayer  { pop } def
/ACADColor { setrgbcolor pop } def
/ACADLtype { pop
userdict /Linedict known not { /Linedict 100 dict def } if
1 index cvn Linedict exch known not {
mark 1 index { dup 0 eq { pop 1 72.0 div } if abs } forall
counttomark 2 add -1 roll astore exch pop
1 index cvn exch Linedict begin def end }
{ pop } ifelse 
Linedict begin cvx exec 0 setdash end } bind def
/bd{bind def}bind def /m{moveto}bd /l{lineto}bd /s{stroke}bd
/a{arc}bd /an{arcn}bd /gs{gsave}bd /gr{grestore}bd
/cp{closepath}bd /tr{translate}bd /sc{scale}bd /co{concat}bd
/ff{findfont}bd /sf{setfont}bd /sh{show}bd /np{newpath}bd
/sw{setlinewidth}bd /sj{setlinejoin}bd /sm{setmiterlimit}bd
/cl{clip}bd /fi{fill}bd
%%EndProlog
%%Page: 1 1
gs np -20 -20 m -20 1299 l  2268 1299 l 2268 -20 l cp cl np 7 0 0 0 ACADColor
(0) ACADLayer (_CONTINUOUS) [  ] (A) ACADLtype 1451 278 m 1451 1107 l
621 1107 l s (_CENTER) [  9.525  -1.905  1.905  -1.905  ] (A) ACADLtype gs
10.3679 10.3674 sc -10.0406 -43.1486 tr 70 80 m 70 60 l s gr gs
10.3679 10.3674 sc -10.0406 -43.1486 tr 60 70 m 80 70 l s gr (_CONTINUOUS) [
 ] (A) ACADLtype gs 10.3679 10.3674 sc -10.0406 -43.1486 tr
[ 1 0 0 1 70 70 ] co np 0 0 10 0 90 a s gr 621 1107 m 621 382 l
s 725 278 m 1451 278 l s 569 1026 m 569 1085 l s 557 1026 m 557 1085 l
s 569 1026 m 621 1055 l s 551 1085 m 557 1079 l s 536 1083 m 557 1061 l
s 536 1065 m 557 1044 l s 536 1048 m 557 1026 l s 536 1030 m 540 1026 l
s 551 463 m 557 457 l s 536 461 m 557 439 l s 536 443 m 557 422 l
s 536 426 m 557 404 l s 536 408 m 540 404 l s 569 463 m 621 433 l
s 569 404 m 569 463 l s 557 404 m 557 463 l s 569 404 m 621 433 l
s 551 671 m 557 664 l s 536 668 m 557 647 l s 536 651 m 557 629 l
s 536 633 m 557 612 l s 536 615 m 540 611 l s 569 611 m 621 641 l
s 557 611 m 557 671 l s 569 611 m 569 671 l 621 641 l s 551 878 m 557 872 l
s 536 876 m 557 854 l s 536 858 m 557 837 l s 536 840 m 557 819 l
s 536 823 m 540 818 l s 569 878 m 621 848 l s 569 818 m 569 878 l
s 557 818 m 557 878 l s 569 818 m 621 848 l s 569 1085 m 621 1055 l
s 1014 226 m 984 278 l s 954 226 m 984 278 l s 1162 226 m 1191 278 l
s 1221 226 m 1191 278 l s 1429 226 m 1399 278 l s 1369 226 m 1399 278 l
s 1014 214 m 954 214 l s 1014 226 m 954 226 l s 954 207 m 960 214 l
s 957 192 m 978 214 l s 974 192 m 996 214 l s 992 192 m 1013 214 l
s 1009 192 m 1014 197 l s 1221 226 m 1162 226 l s 1221 214 m 1162 214 l
s 1162 207 m 1168 214 l s 1164 192 m 1185 214 l s 1181 192 m 1203 214 l
s 1199 192 m 1221 214 l s 1217 192 m 1221 197 l s 1429 214 m 1369 214 l
s 1429 226 m 1369 226 l s 1369 207 m 1375 214 l s 1371 192 m 1393 214 l
s 1389 192 m 1410 214 l s 1406 192 m 1428 214 l s 1424 192 m 1429 197 l
s 747 226 m 777 278 l s 807 226 m 777 278 l s 747 207 m 753 214 l
s 749 192 m 771 214 l s 767 192 m 788 214 l s 784 192 m 806 214 l
s 802 192 m 807 197 l s 807 214 m 747 214 l s 807 226 m 747 226 l
s 615 278 m 453 278 l s 615 1107 m 453 1107 l s 466 304 m 466 1081 l s
np 461 304 m 470 304 l 466 278 l 466 278 l cp fi np 461 1081 m 470 1081 l
466 1107 l 466 1107 l cp fi 621 278 m 621 278 l s 621 1107 m 621 1107 l
s 466 1107 m 466 1107 l s 621 271 m 621 109 l s 725 271 m 725 109 l
s 647 122 m 699 122 l s np 647 127 m 647 118 l 621 122 l 621 122 l cp fi
np 699 127 m 699 118 l 725 122 l 725 122 l cp fi 621 278 m 621 278 l
s 725 278 m 725 278 l s 725 122 m 725 122 l s 621 271 m 621 6 l
s 1451 271 m 1451 6 l s 647 19 m 1425 19 l s np 647 23 m 647 14 l 621 19 l
621 19 l cp fi np 1425 23 m 1425 14 l 1451 19 l 1451 19 l cp fi
621 278 m 621 278 l s 1451 278 m 1451 278 l s 1451 19 m 1451 19 l
s 1658 278 m 1658 1107 l s np 1632 1112 m 1658 1107 l 1632 1103 l cp fi
1632 1107 m 1451 1107 l s np 1632 1070 m 1658 1066 l 1632 1061 l cp fi
1632 1066 m 1451 1066 l s np 1632 1029 m 1658 1024 l 1632 1020 l cp fi
1632 1024 m 1451 1024 l s np 1632 987 m 1658 983 l 1632 979 l cp fi
1632 983 m 1451 983 l s np 1632 946 m 1658 941 l 1632 937 l cp fi
1632 941 m 1451 941 l s np 1632 904 m 1658 900 l 1632 896 l cp fi
1632 900 m 1451 900 l s np 1632 863 m 1658 858 l 1632 854 l cp fi
1632 858 m 1451 858 l s np 1632 821 m 1658 817 l 1632 813 l cp fi
1632 817 m 1451 817 l s np 1632 780 m 1658 776 l 1632 771 l cp fi
1632 776 m 1451 776 l s np 1632 738 m 1658 734 l 1632 730 l cp fi
1632 734 m 1451 734 l s np 1632 697 m 1658 693 l 1632 688 l cp fi
1632 693 m 1451 693 l s np 1632 655 m 1658 651 l 1632 647 l cp fi
1632 651 m 1451 651 l s np 1632 614 m 1658 610 l 1632 605 l cp fi
1632 610 m 1451 610 l s np 1632 572 m 1658 568 l 1632 564 l cp fi
1632 568 m 1451 568 l s np 1632 531 m 1658 527 l 1632 522 l cp fi
1632 527 m 1451 527 l s np 1632 490 m 1658 485 l 1632 481 l cp fi
1632 485 m 1451 485 l s np 1632 448 m 1658 444 l 1632 439 l cp fi
1632 444 m 1451 444 l s np 1632 407 m 1658 402 l 1632 398 l cp fi
1632 402 m 1451 402 l s np 1632 365 m 1658 361 l 1632 356 l cp fi
1632 361 m 1451 361 l s np 1632 324 m 1658 319 l 1632 315 l cp fi
1632 319 m 1451 319 l s np 1632 282 m 1658 278 l 1632 274 l cp fi
1632 278 m 1451 278 l s np 1788 282 m 1813 278 l 1788 274 l cp fi
1788 278 m 1658 278 l s np 617 1237 m 621 1263 l 625 1237 l cp fi
621 1237 m 621 1107 l s (font_l) ACADLayer 1803 299 m 1803 340 l
s 1699 1107 m 1699 1066 l s (font_c) ACADLayer 1036 39 m 1036 81 l s
(font_r) ACADLayer 435 755 m 435 713 l s 600 1273 m 600 1232 l s
(font_c) ACADLayer 662 143 m 662 184 l s (0) ACADLayer gs 10.3679 10.3674 sc
-10.0406 -43.1486 tr [ 1 0 0 1 70 150 ] co 0.25 sw 0 sj 10 sm np 0 0 m
0 -80 10 90 0 an 10 -80 l 80 -80 l 80 0 l 0 0 l s gr
showpage
%%Trailer
restore
%%DocumentFonts:
%%DocumentNeededFonts:
