%!PS-Adobe-3.0 EPSF-3.0
%%Creator: MATLAB, The Mathworks, Inc. Version 7.3.0.298 (R2006b). Operating System: Linux 2.6.19-gentoo-r5 #2 SMP Wed Jan 31 08:26:24 CET 2007 x86_64.
%%Title: /home/mueli/svn/mueli-da/src_images/kirsch_1_0_anal_img.eps
%%CreationDate: 02/13/2007  15:55:21
%%DocumentNeededFonts: Helvetica
%%DocumentProcessColors: Cyan Magenta Yellow Black
%%LanguageLevel: 2
%%Pages: 1
%%BoundingBox:   106   296   503   495
%%EndComments

%%BeginProlog
% MathWorks dictionary
/MathWorks 160 dict begin
% definition operators
/bdef {bind def} bind def
/ldef {load def} bind def
/xdef {exch def} bdef
/xstore {exch store} bdef
% operator abbreviations
/c  /clip ldef
/cc /concat ldef
/cp /closepath ldef
/gr /grestore ldef
/gs /gsave ldef
/mt /moveto ldef
/np /newpath ldef
/cm /currentmatrix ldef
/sm /setmatrix ldef
/rm /rmoveto ldef
/rl /rlineto ldef
/s {show newpath} bdef
/sc {setcmykcolor} bdef
/sr /setrgbcolor ldef
/sg /setgray ldef
/w /setlinewidth ldef
/j /setlinejoin ldef
/cap /setlinecap ldef
/rc {rectclip} bdef
/rf {rectfill} bdef
% page state control
/pgsv () def
/bpage {/pgsv save def} bdef
/epage {pgsv restore} bdef
/bplot /gsave ldef
/eplot {stroke grestore} bdef
% orientation switch
/portraitMode 0 def /landscapeMode 1 def /rotateMode 2 def
% coordinate system mappings
/dpi2point 0 def
% font control
/FontSize 0 def
/FMS {/FontSize xstore findfont [FontSize 0 0 FontSize neg 0 0]
  makefont setfont} bdef
/reencode {exch dup where {pop load} {pop StandardEncoding} ifelse
  exch dup 3 1 roll findfont dup length dict begin
  { 1 index /FID ne {def}{pop pop} ifelse } forall
  /Encoding exch def currentdict end definefont pop} bdef
/isroman {findfont /CharStrings get /Agrave known} bdef
/FMSR {3 1 roll 1 index dup isroman {reencode} {pop pop} ifelse
  exch FMS} bdef
/csm {1 dpi2point div -1 dpi2point div scale neg translate
 dup landscapeMode eq {pop -90 rotate}
  {rotateMode eq {90 rotate} if} ifelse} bdef
% line types: solid, dotted, dashed, dotdash
/SO { [] 0 setdash } bdef
/DO { [.5 dpi2point mul 4 dpi2point mul] 0 setdash } bdef
/DA { [6 dpi2point mul] 0 setdash } bdef
/DD { [.5 dpi2point mul 4 dpi2point mul 6 dpi2point mul 4
  dpi2point mul] 0 setdash } bdef
% macros for lines and objects
/L {lineto stroke} bdef
/MP {3 1 roll moveto 1 sub {rlineto} repeat} bdef
/AP {{rlineto} repeat} bdef
/PDlw -1 def
/W {/PDlw currentlinewidth def setlinewidth} def
/PP {closepath eofill} bdef
/DP {closepath stroke} bdef
/MR {4 -2 roll moveto dup  0 exch rlineto exch 0 rlineto
  neg 0 exch rlineto closepath} bdef
/FR {MR stroke} bdef
/PR {MR fill} bdef
/L1i {{currentfile picstr readhexstring pop} image} bdef
/tMatrix matrix def
/MakeOval {newpath tMatrix currentmatrix pop translate scale
0 0 1 0 360 arc tMatrix setmatrix} bdef
/FO {MakeOval stroke} bdef
/PO {MakeOval fill} bdef
/PD {currentlinewidth 2 div 0 360 arc fill
   PDlw -1 eq not {PDlw w /PDlw -1 def} if} def
/FA {newpath tMatrix currentmatrix pop translate scale
  0 0 1 5 -2 roll arc tMatrix setmatrix stroke} bdef
/PA {newpath tMatrix currentmatrix pop	translate 0 0 moveto scale
  0 0 1 5 -2 roll arc closepath tMatrix setmatrix fill} bdef
/FAn {newpath tMatrix currentmatrix pop translate scale
  0 0 1 5 -2 roll arcn tMatrix setmatrix stroke} bdef
/PAn {newpath tMatrix currentmatrix pop translate 0 0 moveto scale
  0 0 1 5 -2 roll arcn closepath tMatrix setmatrix fill} bdef
/vradius 0 def /hradius 0 def /lry 0 def
/lrx 0 def /uly 0 def /ulx 0 def /rad 0 def
/MRR {/vradius xdef /hradius xdef /lry xdef /lrx xdef /uly xdef
  /ulx xdef newpath tMatrix currentmatrix pop ulx hradius add uly
  vradius add translate hradius vradius scale 0 0 1 180 270 arc 
  tMatrix setmatrix lrx hradius sub uly vradius add translate
  hradius vradius scale 0 0 1 270 360 arc tMatrix setmatrix
  lrx hradius sub lry vradius sub translate hradius vradius scale
  0 0 1 0 90 arc tMatrix setmatrix ulx hradius add lry vradius sub
  translate hradius vradius scale 0 0 1 90 180 arc tMatrix setmatrix
  closepath} bdef
/FRR {MRR stroke } bdef
/PRR {MRR fill } bdef
/MlrRR {/lry xdef /lrx xdef /uly xdef /ulx xdef /rad lry uly sub 2 div def
  newpath tMatrix currentmatrix pop ulx rad add uly rad add translate
  rad rad scale 0 0 1 90 270 arc tMatrix setmatrix lrx rad sub lry rad
  sub translate rad rad scale 0 0 1 270 90 arc tMatrix setmatrix
  closepath} bdef
/FlrRR {MlrRR stroke } bdef
/PlrRR {MlrRR fill } bdef
/MtbRR {/lry xdef /lrx xdef /uly xdef /ulx xdef /rad lrx ulx sub 2 div def
  newpath tMatrix currentmatrix pop ulx rad add uly rad add translate
  rad rad scale 0 0 1 180 360 arc tMatrix setmatrix lrx rad sub lry rad
  sub translate rad rad scale 0 0 1 0 180 arc tMatrix setmatrix
  closepath} bdef
/FtbRR {MtbRR stroke } bdef
/PtbRR {MtbRR fill } bdef
/stri 6 array def /dtri 6 array def
/smat 6 array def /dmat 6 array def
/tmat1 6 array def /tmat2 6 array def /dif 3 array def
/asub {/ind2 exch def /ind1 exch def dup dup
  ind1 get exch ind2 get sub exch } bdef
/tri_to_matrix {
  2 0 asub 3 1 asub 4 0 asub 5 1 asub
  dup 0 get exch 1 get 7 -1 roll astore } bdef
/compute_transform {
  dmat dtri tri_to_matrix tmat1 invertmatrix 
  smat stri tri_to_matrix tmat2 concatmatrix } bdef
/ds {stri astore pop} bdef
/dt {dtri astore pop} bdef
/db {2 copy /cols xdef /rows xdef mul dup 3 mul string
  currentfile 
  3 index 0 eq {/ASCIIHexDecode filter}
  {/ASCII85Decode filter 3 index 2 eq {/RunLengthDecode filter} if }
  ifelse exch readstring pop
  dup 0 3 index getinterval /rbmap xdef
  dup 2 index dup getinterval /gbmap xdef
  1 index dup 2 mul exch getinterval /bbmap xdef pop pop}bdef
/it {gs np dtri aload pop moveto lineto lineto cp c
  cols rows 8 compute_transform 
  rbmap gbmap bbmap true 3 colorimage gr}bdef
/il {newpath moveto lineto stroke}bdef
currentdict end def
%%EndProlog

%%BeginSetup
MathWorks begin

0 cap

end
%%EndSetup

%%Page: 1 1
%%BeginPageSetup
%%PageBoundingBox:   106   296   503   495
MathWorks begin
bpage
%%EndPageSetup

%%BeginObject: obj1
bplot

/dpi2point 12 def
portraitMode 1272 5940 csm

    0     0  4771  2379 rc
85 dict begin %Colortable dictionary
/c0 { 0.000000 0.000000 0.000000 sr} bdef
/c1 { 1.000000 1.000000 1.000000 sr} bdef
/c2 { 0.900000 0.000000 0.000000 sr} bdef
/c3 { 0.000000 0.820000 0.000000 sr} bdef
/c4 { 0.000000 0.000000 0.800000 sr} bdef
/c5 { 0.910000 0.820000 0.320000 sr} bdef
/c6 { 1.000000 0.260000 0.820000 sr} bdef
/c7 { 0.000000 0.820000 0.820000 sr} bdef
c0
1 j
1 sg
   0    0 4772 2380 rf
6 w
0 1939 3698 0 0 -1939 620 2117 4 MP
PP
-3698 0 0 1939 3698 0 0 -1939 620 2117 5 MP stroke
4 w
DO
0 sg
 620 2117 mt  620  178 L
 620  178 mt  620  178 L
1148 2117 mt 1148  178 L
1148  178 mt 1148  178 L
1676 2117 mt 1676  178 L
1676  178 mt 1676  178 L
2204 2117 mt 2204  178 L
2204  178 mt 2204  178 L
2733 2117 mt 2733  178 L
2733  178 mt 2733  178 L
3261 2117 mt 3261  178 L
3261  178 mt 3261  178 L
3789 2117 mt 3789  178 L
3789  178 mt 3789  178 L
4318 2117 mt 4318  178 L
4318  178 mt 4318  178 L
 620 2117 mt 4318 2117 L
4318 2117 mt 4318 2117 L
 620 1632 mt 4318 1632 L
4318 1632 mt 4318 1632 L
 620 1147 mt 4318 1147 L
4318 1147 mt 4318 1147 L
 620  662 mt 4318  662 L
4318  662 mt 4318  662 L
 620  178 mt 4318  178 L
4318  178 mt 4318  178 L
SO
6 w
 620 2117 mt 4318 2117 L
 620  178 mt 4318  178 L
 620 2117 mt  620  178 L
4318 2117 mt 4318  178 L
 620 2117 mt 4318 2117 L
 620 2117 mt  620  178 L
 620 2117 mt  620 2080 L
 620  178 mt  620  214 L
%%IncludeResource: font Helvetica
/Helvetica /ISOLatin1Encoding 96 FMSR

 554 2240 mt 
(0.5) s
1148 2117 mt 1148 2080 L
1148  178 mt 1148  214 L
1122 2240 mt 
(1) s
1676 2117 mt 1676 2080 L
1676  178 mt 1676  214 L
1610 2240 mt 
(1.5) s
2204 2117 mt 2204 2080 L
2204  178 mt 2204  214 L
2178 2240 mt 
(2) s
2733 2117 mt 2733 2080 L
2733  178 mt 2733  214 L
2667 2240 mt 
(2.5) s
3261 2117 mt 3261 2080 L
3261  178 mt 3261  214 L
3235 2240 mt 
(3) s
3789 2117 mt 3789 2080 L
3789  178 mt 3789  214 L
3723 2240 mt 
(3.5) s
4318 2117 mt 4318 2080 L
4318  178 mt 4318  214 L
4292 2240 mt 
(4) s
 620 2117 mt  656 2117 L
4318 2117 mt 4281 2117 L
 476 2152 mt 
(-1) s
 620 1632 mt  656 1632 L
4318 1632 mt 4281 1632 L
 396 1667 mt 
(-0.5) s
 620 1147 mt  656 1147 L
4318 1147 mt 4281 1147 L
 532 1182 mt 
(0) s
 620  662 mt  656  662 L
4318  662 mt 4281  662 L
 452  697 mt 
(0.5) s
 620  178 mt  656  178 L
4318  178 mt 4281  178 L
 532  213 mt 
(1) s
 620 2117 mt 4318 2117 L
 620  178 mt 4318  178 L
 620 2117 mt  620  178 L
4318 2117 mt 4318  178 L
gs 620 178 3699 1940 rc
/c8 { 0.000000 0.000000 1.000000 sr} bdef
c8
11 0 11 0 10 -1 11 0 10 0 11 0 10 0 11 -1 
11 0 10 0 11 0 10 0 11 -1 10 0 11 0 11 0 
10 0 11 -1 10 0 11 0 10 0 11 0 11 -1 10 0 
11 0 10 0 11 -1 10 0 11 0 10 0 11 -1 11 0 
10 0 11 0 10 0 11 -1 10 0 11 0 11 0 10 -1 
11 0 10 0 11 0 10 -1 11 0 11 0 10 -1 11 0 
10 0 11 0 10 -1 11 0 10 0 11 0 11 -1 10 0 
11 0 10 -1 11 0 10 0 11 -1 11 0 10 0 11 0 
10 -1 11 0 10 0 11 -1 11 0 10 0 11 -1 10 0 
11 0 10 -1 11 0 10 0 11 -1 11 0 10 0 11 -1 
10 0 11 -1 10 0 11 0 11 -1 10 0 11 0 10 -1 
11 0 10 -1 11 0 11 0 10 -1 11 0 10 -1 11 0 
10 0 11 -1 11 0 10 -1 11 0 10 -1 11 0 10 0 
11 -1 10 0 11 -1 11 0 10 -1 11 0 10 -1 11 0 
10 -1 11 0 11 -1 10 0 11 -1 10 0 11 -1 10 0 
11 -1 11 0 10 -1 11 0 10 -1 11 -1 10 0 11 -1 
10 0 11 -1 11 -1 10 0 11 -1 10 0 11 -1 10 -1 
11 0 11 -1 10 0 11 -1 10 -1 11 0 10 -1 11 -1 
11 -1 10 0 11 -1 10 -1 11 0 10 -1 11 -1 10 -1 
11 0 11 -1 10 -1 11 -1 10 -1 11 0 10 -1 11 -1 
11 -1 10 -1 11 0 10 -1 11 -1 10 -1 11 -1 11 -1 
10 -1 11 -1 10 -1 11 -1 10 -1 11 -1 10 -1 11 -1 
11 -1 10 -1 11 -1 10 -1 11 -1 10 -1 11 -1 11 -1 
10 -1 11 -1 10 -2 11 -1 10 -1 11 -1 11 -1 10 -2 
11 -1 10 -1 11 -2 10 -1 11 -1 11 -2 10 -1 11 -1 
10 -2 11 -1 10 -2 11 -1 10 -2 11 -1 11 -2 10 -1 
11 -2 10 -1 11 -2 10 -2 11 -1 11 -2 10 -2 11 -2 
10 -1 11 -2 10 -2 11 -2 11 -2 10 -2 11 -2 10 -2 
11 -2 10 -2 11 -2 10 -2 11 -2 11 -2 10 -3 11 -2 
10 -2 11 -2 10 -3 11 -2 11 -3 10 -2 11 -3 10 -2 
11 -3 10 -3 11 -2 11 -3 10 -3 11 -3 10 -3 11 -3 
10 -3 11 -3 10 -3 11 -3 11 -3 10 -4 11 -3 10 -4 
11 -3 10 -4 11 -3 11 -4 10 -4 11 -4 10 -4 11 -4 
10 -4 11 -4 11 -4 10 -4 11 -5 10 -4 11 -5 10 -4 
11 -5 11 -5 10 -5 11 -5 10 -5 11 -6 10 -5 11 -5 
10 -6 11 -6 11 -6 10 -6 11 -6 10 -6 11 -6 10 -7 
11 -6 11 -7 10 -7 11 -7 10 -7 11 -8 10 -7 11 -8 
11 -8 10 -8 11 -8 1158 684 300 MP stroke
10 -9 11 -8 10 -9 11 -9 10 -9 11 -9 11 -10 10 -10 
11 -10 10 -10 11 -10 10 -11 11 -10 11 -11 10 -12 11 -11 
10 -12 11 -12 10 -12 11 -12 11 -12 10 -13 11 -13 10 -13 
11 -13 10 -13 11 -14 10 -13 11 -14 11 -14 10 -14 11 -13 
10 -14 11 -13 10 -14 11 -12 11 -13 10 -12 11 -12 10 -10 
11 -10 10 -9 11 -8 11 -5 10 -4 11 -2 10 0 11 4 
10 8 11 11 10 17 620 1147 52 MP stroke
/c9 { 0.000000 0.500000 0.000000 sr} bdef
c9
11 0 11 0 10 0 11 0 10 0 11 0 10 0 11 1 
11 0 10 0 11 0 10 0 11 0 10 0 11 0 11 0 
10 0 11 0 10 0 11 0 10 0 11 0 11 0 10 0 
11 0 10 0 11 0 10 0 11 0 10 0 11 0 11 0 
10 0 11 1 10 0 11 0 10 0 11 0 11 0 10 0 
11 0 10 0 11 0 10 0 11 0 11 0 10 0 11 0 
10 0 11 0 10 0 11 0 10 0 11 0 11 1 10 0 
11 0 10 0 11 0 10 0 11 0 11 0 10 0 11 0 
10 0 11 0 10 0 11 0 11 0 10 0 11 0 10 0 
11 1 10 0 11 0 10 0 11 0 11 0 10 0 11 0 
10 0 11 0 10 0 11 0 11 0 10 0 11 0 10 0 
11 1 10 0 11 0 11 0 10 0 11 0 10 0 11 0 
10 0 11 0 11 0 10 0 11 0 10 0 11 1 10 0 
11 0 10 0 11 0 11 0 10 0 11 0 10 0 11 0 
10 0 11 0 11 1 10 0 11 0 10 0 11 0 10 0 
11 0 11 0 10 0 11 0 10 0 11 1 10 0 11 0 
10 0 11 0 11 0 10 0 11 0 10 0 11 0 10 1 
11 0 11 0 10 0 11 0 10 0 11 0 10 0 11 0 
11 0 10 1 11 0 10 0 11 0 10 0 11 0 10 0 
11 0 11 1 10 0 11 0 10 0 11 0 10 0 11 0 
11 0 10 1 11 0 10 0 11 0 10 0 11 0 11 0 
10 1 11 0 10 0 11 0 10 0 11 0 10 0 11 1 
11 0 10 0 11 0 10 0 11 0 10 0 11 1 11 0 
10 0 11 0 10 0 11 0 10 1 11 0 11 0 10 0 
11 0 10 1 11 0 10 0 11 0 11 0 10 0 11 1 
10 0 11 0 10 0 11 0 10 1 11 0 11 0 10 0 
11 0 10 1 11 0 10 0 11 0 11 0 10 1 11 0 
10 0 11 0 10 1 11 0 11 0 10 0 11 0 10 1 
11 0 10 0 11 0 10 1 11 0 11 0 10 0 11 1 
10 0 11 0 10 0 11 0 11 1 10 0 11 0 10 0 
11 1 10 0 11 0 11 0 10 1 11 0 10 0 11 0 
10 1 11 0 10 0 11 0 11 1 10 0 11 0 10 0 
11 1 10 0 11 0 11 0 10 0 11 1 10 0 11 0 
10 0 11 0 11 0 10 1 11 0 10 0 11 0 10 0 
11 0 11 0 10 0 11 0 10 0 11 0 10 0 11 0 
10 0 11 0 11 0 10 0 11 0 10 -1 11 0 10 0 
11 -1 11 0 10 0 11 -1 10 0 11 -1 10 -1 11 -1 
11 -1 10 0 11 -2 1158 1116 300 MP stroke
10 -1 11 -1 10 -1 11 -2 10 -2 11 -1 11 -2 10 -2 
11 -3 10 -2 11 -3 10 -3 11 -3 11 -4 10 -3 11 -4 
10 -5 11 -5 10 -5 11 -5 11 -7 10 -6 11 -7 10 -8 
11 -9 10 -9 11 -10 10 -11 11 -11 11 -13 10 -14 11 -15 
10 -17 11 -18 10 -20 11 -21 11 -24 10 -26 11 -28 10 -31 
11 -34 10 -37 11 -41 11 -45 10 -50 11 -55 10 -60 11 -67 
10 -75 11 -83 10 -92 620 2117 52 MP stroke
gr

c9
0 sg
 607 2152 mt 
( ) s
4306  212 mt 
( ) s
1 sg
0 278 868 0 0 -278 3391 516 4 MP
PP
-868 0 0 278 868 0 0 -278 3391 516 5 MP stroke
4 w
DO
SO
6 w
0 sg
3391  516 mt 4259  516 L
3391  238 mt 4259  238 L
3391  516 mt 3391  238 L
4259  516 mt 4259  238 L
3391  516 mt 4259  516 L
3391  516 mt 3391  238 L
3391  516 mt 4259  516 L
3391  238 mt 4259  238 L
3391  516 mt 3391  238 L
4259  516 mt 4259  238 L
3875  349 mt 
(sigmarr) s
gs 3391 238 869 279 rc
c8
372 0 3465 315 2 MP stroke
gr

c8
0 sg
3875  474 mt 
(sigmapp) s
gs 3391 238 869 279 rc
c9
372 0 3465 438 2 MP stroke
gr

c9

end %%Color Dict

eplot
%%EndObject

epage
end

showpage

%%Trailer
%%EOF
