%!PS-Adobe-3.0 EPSF-3.0
%%Creator: MATLAB, The Mathworks, Inc. Version 7.3.0.298 (R2006b). Operating System: Linux 2.6.19-gentoo-r5 #2 SMP Wed Jan 31 08:26:24 CET 2007 x86_64.
%%Title: /home/mueli/svn/mueli-da/src_images/kirsch_2_sigma_rr_0_img.eps
%%CreationDate: 02/13/2007  16:36:40
%%DocumentNeededFonts: Helvetica
%%DocumentProcessColors: Cyan Magenta Yellow Black
%%LanguageLevel: 2
%%Pages: 1
%%BoundingBox:   206   296   404   495
%%EndComments

%%BeginProlog
% MathWorks dictionary
/MathWorks 160 dict begin
% definition operators
/bdef {bind def} bind def
/ldef {load def} bind def
/xdef {exch def} bdef
/xstore {exch store} bdef
% operator abbreviations
/c  /clip ldef
/cc /concat ldef
/cp /closepath ldef
/gr /grestore ldef
/gs /gsave ldef
/mt /moveto ldef
/np /newpath ldef
/cm /currentmatrix ldef
/sm /setmatrix ldef
/rm /rmoveto ldef
/rl /rlineto ldef
/s {show newpath} bdef
/sc {setcmykcolor} bdef
/sr /setrgbcolor ldef
/sg /setgray ldef
/w /setlinewidth ldef
/j /setlinejoin ldef
/cap /setlinecap ldef
/rc {rectclip} bdef
/rf {rectfill} bdef
% page state control
/pgsv () def
/bpage {/pgsv save def} bdef
/epage {pgsv restore} bdef
/bplot /gsave ldef
/eplot {stroke grestore} bdef
% orientation switch
/portraitMode 0 def /landscapeMode 1 def /rotateMode 2 def
% coordinate system mappings
/dpi2point 0 def
% font control
/FontSize 0 def
/FMS {/FontSize xstore findfont [FontSize 0 0 FontSize neg 0 0]
  makefont setfont} bdef
/reencode {exch dup where {pop load} {pop StandardEncoding} ifelse
  exch dup 3 1 roll findfont dup length dict begin
  { 1 index /FID ne {def}{pop pop} ifelse } forall
  /Encoding exch def currentdict end definefont pop} bdef
/isroman {findfont /CharStrings get /Agrave known} bdef
/FMSR {3 1 roll 1 index dup isroman {reencode} {pop pop} ifelse
  exch FMS} bdef
/csm {1 dpi2point div -1 dpi2point div scale neg translate
 dup landscapeMode eq {pop -90 rotate}
  {rotateMode eq {90 rotate} if} ifelse} bdef
% line types: solid, dotted, dashed, dotdash
/SO { [] 0 setdash } bdef
/DO { [.5 dpi2point mul 4 dpi2point mul] 0 setdash } bdef
/DA { [6 dpi2point mul] 0 setdash } bdef
/DD { [.5 dpi2point mul 4 dpi2point mul 6 dpi2point mul 4
  dpi2point mul] 0 setdash } bdef
% macros for lines and objects
/L {lineto stroke} bdef
/MP {3 1 roll moveto 1 sub {rlineto} repeat} bdef
/AP {{rlineto} repeat} bdef
/PDlw -1 def
/W {/PDlw currentlinewidth def setlinewidth} def
/PP {closepath eofill} bdef
/DP {closepath stroke} bdef
/MR {4 -2 roll moveto dup  0 exch rlineto exch 0 rlineto
  neg 0 exch rlineto closepath} bdef
/FR {MR stroke} bdef
/PR {MR fill} bdef
/L1i {{currentfile picstr readhexstring pop} image} bdef
/tMatrix matrix def
/MakeOval {newpath tMatrix currentmatrix pop translate scale
0 0 1 0 360 arc tMatrix setmatrix} bdef
/FO {MakeOval stroke} bdef
/PO {MakeOval fill} bdef
/PD {currentlinewidth 2 div 0 360 arc fill
   PDlw -1 eq not {PDlw w /PDlw -1 def} if} def
/FA {newpath tMatrix currentmatrix pop translate scale
  0 0 1 5 -2 roll arc tMatrix setmatrix stroke} bdef
/PA {newpath tMatrix currentmatrix pop	translate 0 0 moveto scale
  0 0 1 5 -2 roll arc closepath tMatrix setmatrix fill} bdef
/FAn {newpath tMatrix currentmatrix pop translate scale
  0 0 1 5 -2 roll arcn tMatrix setmatrix stroke} bdef
/PAn {newpath tMatrix currentmatrix pop translate 0 0 moveto scale
  0 0 1 5 -2 roll arcn closepath tMatrix setmatrix fill} bdef
/vradius 0 def /hradius 0 def /lry 0 def
/lrx 0 def /uly 0 def /ulx 0 def /rad 0 def
/MRR {/vradius xdef /hradius xdef /lry xdef /lrx xdef /uly xdef
  /ulx xdef newpath tMatrix currentmatrix pop ulx hradius add uly
  vradius add translate hradius vradius scale 0 0 1 180 270 arc 
  tMatrix setmatrix lrx hradius sub uly vradius add translate
  hradius vradius scale 0 0 1 270 360 arc tMatrix setmatrix
  lrx hradius sub lry vradius sub translate hradius vradius scale
  0 0 1 0 90 arc tMatrix setmatrix ulx hradius add lry vradius sub
  translate hradius vradius scale 0 0 1 90 180 arc tMatrix setmatrix
  closepath} bdef
/FRR {MRR stroke } bdef
/PRR {MRR fill } bdef
/MlrRR {/lry xdef /lrx xdef /uly xdef /ulx xdef /rad lry uly sub 2 div def
  newpath tMatrix currentmatrix pop ulx rad add uly rad add translate
  rad rad scale 0 0 1 90 270 arc tMatrix setmatrix lrx rad sub lry rad
  sub translate rad rad scale 0 0 1 270 90 arc tMatrix setmatrix
  closepath} bdef
/FlrRR {MlrRR stroke } bdef
/PlrRR {MlrRR fill } bdef
/MtbRR {/lry xdef /lrx xdef /uly xdef /ulx xdef /rad lrx ulx sub 2 div def
  newpath tMatrix currentmatrix pop ulx rad add uly rad add translate
  rad rad scale 0 0 1 180 360 arc tMatrix setmatrix lrx rad sub lry rad
  sub translate rad rad scale 0 0 1 0 180 arc tMatrix setmatrix
  closepath} bdef
/FtbRR {MtbRR stroke } bdef
/PtbRR {MtbRR fill } bdef
/stri 6 array def /dtri 6 array def
/smat 6 array def /dmat 6 array def
/tmat1 6 array def /tmat2 6 array def /dif 3 array def
/asub {/ind2 exch def /ind1 exch def dup dup
  ind1 get exch ind2 get sub exch } bdef
/tri_to_matrix {
  2 0 asub 3 1 asub 4 0 asub 5 1 asub
  dup 0 get exch 1 get 7 -1 roll astore } bdef
/compute_transform {
  dmat dtri tri_to_matrix tmat1 invertmatrix 
  smat stri tri_to_matrix tmat2 concatmatrix } bdef
/ds {stri astore pop} bdef
/dt {dtri astore pop} bdef
/db {2 copy /cols xdef /rows xdef mul dup 3 mul string
  currentfile 
  3 index 0 eq {/ASCIIHexDecode filter}
  {/ASCII85Decode filter 3 index 2 eq {/RunLengthDecode filter} if }
  ifelse exch readstring pop
  dup 0 3 index getinterval /rbmap xdef
  dup 2 index dup getinterval /gbmap xdef
  1 index dup 2 mul exch getinterval /bbmap xdef pop pop}bdef
/it {gs np dtri aload pop moveto lineto lineto cp c
  cols rows 8 compute_transform 
  rbmap gbmap bbmap true 3 colorimage gr}bdef
/il {newpath moveto lineto stroke}bdef
currentdict end def
%%EndProlog

%%BeginSetup
MathWorks begin

0 cap

end
%%EndSetup

%%Page: 1 1
%%BeginPageSetup
%%PageBoundingBox:   206   296   404   495
MathWorks begin
bpage
%%EndPageSetup

%%BeginObject: obj1
bplot

/dpi2point 12 def
portraitMode 2472 5940 csm

    0     0  2381  2379 rc
87 dict begin %Colortable dictionary
/c0 { 0.000000 0.000000 0.000000 sr} bdef
/c1 { 1.000000 1.000000 1.000000 sr} bdef
/c2 { 0.900000 0.000000 0.000000 sr} bdef
/c3 { 0.000000 0.820000 0.000000 sr} bdef
/c4 { 0.000000 0.000000 0.800000 sr} bdef
/c5 { 0.910000 0.820000 0.320000 sr} bdef
/c6 { 1.000000 0.260000 0.820000 sr} bdef
/c7 { 0.000000 0.820000 0.820000 sr} bdef
c0
1 j
1 sg
   0    0 2382 2380 rf
6 w
0 1939 1845 0 0 -1939 310 2117 4 MP
PP
-1845 0 0 1939 1845 0 0 -1939 310 2117 5 MP stroke
4 w
DO
SO
6 w
0 sg
 310 2117 mt 2155 2117 L
 310 2117 mt  310  178 L
 573 2117 mt  573 2097 L
%%IncludeResource: font Helvetica
/Helvetica /ISOLatin1Encoding 96 FMSR

 547 2240 mt 
(1) s
1100 2117 mt 1100 2097 L
1074 2240 mt 
(2) s
1627 2117 mt 1627 2097 L
1601 2240 mt 
(3) s
2155 2117 mt 2155 2097 L
2129 2240 mt 
(4) s
 310 2117 mt  329 2117 L
  33 2152 mt 
(-0.25) s
 310 1840 mt  329 1840 L
  86 1875 mt 
(-0.2) s
 310 1563 mt  329 1563 L
  33 1598 mt 
(-0.15) s
 310 1286 mt  329 1286 L
  86 1321 mt 
(-0.1) s
 310 1009 mt  329 1009 L
  33 1044 mt 
(-0.05) s
 310  732 mt  329  732 L
 222  767 mt 
(0) s
 310  454 mt  329  454 L
  89  489 mt 
(0.05) s
 310  178 mt  329  178 L
 142  213 mt 
(0.1) s
gs 310 178 1846 1940 rc
/c8 { 1.000000 0.000000 0.000000 sr} bdef
c8
359 52 359 -58 238 47 237 -123 186 123 186 -214 140 67 140 -1238 
310 1866 9 MP stroke
/c9 { 0.000000 1.000000 0.000000 sr} bdef
c9
180 21 179 -8 180 -5 179 -15 119 0 119 -28 119 9 118 -48 
93 53 93 -103 93 54 93 -129 70 140 70 -308 70 182 70 -529 
310 1224 17 MP stroke
/c10 { 0.000000 0.000000 1.000000 sr} bdef
c10
90 12 90 6 90 4 89 0 180 -15 179 -4 60 -5 59 -14 
59 -1 60 -10 59 -1 60 -12 59 0 59 -17 47 7 46 -25 
47 12 46 -36 47 21 46 -48 47 14 46 -51 35 45 35 -96 
35 48 35 -100 35 36 35 -120 35 138 35 -196 310 922 31 MP stroke
/c11 { 0.000000 1.000000 1.000000 sr} bdef
c11
90 12 90 6 90 1 89 -1 90 -3 90 -6 89 -6 90 -7 
60 -3 59 -8 59 -2 60 -10 59 -1 60 -12 59 -1 59 -15 
47 0 46 -11 24 4 23 -16 23 2 23 -12 23 2 24 -14 
23 3 23 -18 23 5 24 -20 23 0 23 -19 18 8 17 -26 
18 6 17 -25 18 7 17 -29 18 9 17 -34 18 13 17 -39 
18 16 17 -39 18 19 17 -35 18 68 17 -52 310 797 47 MP stroke
gr

c11
0 sg
 297 2152 mt 
( ) s
2143  212 mt 
( ) s
1 sg
0 514 799 0 0 -514 1297 752 4 MP
PP
-799 0 0 514 799 0 0 -514 1297 752 5 MP stroke
4 w
DO
SO
6 w
0 sg
1297  752 mt 2096  752 L
1297  238 mt 2096  238 L
1297  752 mt 1297  238 L
2096  752 mt 2096  238 L
1297  752 mt 2096  752 L
1297  752 mt 1297  238 L
1297  752 mt 2096  752 L
1297  238 mt 2096  238 L
1297  752 mt 1297  238 L
2096  752 mt 2096  238 L
1772  348 mt 
(refine0) s
gs 1297 238 800 515 rc
c8
365 0 1369 313 2 MP stroke
gr

c8
0 sg
1772  469 mt 
(refine1) s
gs 1297 238 800 515 rc
c9
365 0 1369 434 2 MP stroke
gr

c9
0 sg
1772  590 mt 
(refine2) s
gs 1297 238 800 515 rc
c10
365 0 1369 555 2 MP stroke
gr

c10
0 sg
1772  711 mt 
(refine3) s
gs 1297 238 800 515 rc
c11
365 0 1369 676 2 MP stroke
gr

c11

end %%Color Dict

eplot
%%EndObject

epage
end

showpage

%%Trailer
%%EOF
