%!PS-Adobe-2.0 EPSF-2.0 
%%BoundingBox: 21 69 565 265
%%HiResBoundingBox: 21.516 69.252 564.576 264.444
%%Title: Z:\home\svn\mueli-da\src_images\knotenquadratur_acad.eps 
%%Creator: AutoCAD PSOUT 
%%For: , 
%%Pages: 1 
%%DocumentFonts: (atend) 
%%DocumentNeededFonts: (atend) 
%%CreationDate: 2007-02-28 
%%EndComments 
save 
20 20 translate 
0.24 dup scale 
0 setlinewidth 
/ACADLayer { pop } def 
/ACADColor { setrgbcolor pop } def 
/ACADLtype { pop 
userdict /Linedict known not { /Linedict 100 dict def } if 
1 index cvn Linedict exch known not { 
mark 1 index { dup 0 eq { pop 1 72.0 div } if abs } forall 
counttomark 2 add -1 roll astore exch pop 
1 index cvn exch Linedict begin def end } 
{ pop } ifelse 
Linedict begin cvx exec 0 setdash end } bind def 
/bd{bind def}bind def /m{moveto}bd /l{lineto}bd /s{stroke}bd 
/a{arc}bd /an{arcn}bd /gs{gsave}bd /gr{grestore}bd 
/cp{closepath}bd /tr{translate}bd /sc{scale}bd /co{concat}bd 
/ff{findfont}bd /sf{setfont}bd /sh{show}bd /np{newpath}bd 
/sw{setlinewidth}bd /sj{setlinejoin}bd /sm{setmiterlimit}bd 
/cl{clip}bd /fi{fill}bd 
%%EndProlog 
%%Page: 1 1 
gs np -20 -20 m -20 1299 l 2269 1299 l 2269 -20 l cp cl np 7 0 0 0 ACADColor 
(0) ACADLayer (_Continuous) [ ] (A) ACADLtype 42 329 m 312 960 l 583 329 l 
cp s 1124 960 m 1395 329 l s 854 329 m 1124 960 l s 1395 329 m 854 329 l 
s 2207 329 m 1666 329 l s 1936 960 m 2207 329 l s 1666 329 m 1936 960 l s gs 
18.0427 18.0337 sc -7.6543 -16.7127 tr [ 1 0 0 1 39.685 35 ] co 0.63 sw 
0 sj 10 sm np 0 0 m np 0.315 0 0.315 180 0 a 0.315 0 0.315 0 180 a cp s gr gs 
18.0427 18.0337 sc -7.6543 -16.7127 tr [ 1 0 0 1 9.685 35 ] co 0.63 sw 
0 sj 10 sm np 0 0 m np 0.315 0 0.315 180 0 a 0.315 0 0.315 0 180 a cp s gr gs 
18.0427 18.0337 sc -7.6543 -16.7127 tr [ 1 0 0 1 24.685 70 ] co 0.63 sw 
0 sj 10 sm np 0 0 m np 0.315 0 0.315 180 0 a 0.315 0 0.315 0 180 a cp s gr gs 
18.0427 18.0337 sc -7.6543 -16.7127 tr [ 1 0 0 1 54.685 35 ] co 0.63 sw 
0 sj 10 sm np 0 0 m np 0.315 0 0.315 180 0 a 0.315 0 0.315 0 180 a cp s gr gs 
18.0427 18.0337 sc -7.6543 -16.7127 tr [ 1 0 0 1 84.685 35 ] co 0.63 sw 
0 sj 10 sm np 0 0 m np 0.315 0 0.315 180 0 a 0.315 0 0.315 0 180 a cp s gr gs 
18.0427 18.0337 sc -7.6543 -16.7127 tr [ 1 0 0 1 69.685 70 ] co 0.63 sw 
0 sj 10 sm np 0 0 m np 0.315 0 0.315 180 0 a 0.315 0 0.315 0 180 a cp s gr gs 
18.0427 18.0337 sc -7.6543 -16.7127 tr [ 1 0 0 1 62.185 52.5 ] co 0.63 sw 
0 sj 10 sm np 0 0 m np 0.315 0 0.315 180 0 a 0.315 0 0.315 0 180 a cp s gr gs 
18.0427 18.0337 sc -7.6543 -16.7127 tr [ 1 0 0 1 69.685 35 ] co 0.63 sw 
0 sj 10 sm np 0 0 m np 0.315 0 0.315 180 0 a 0.315 0 0.315 0 180 a cp s gr gs 
18.0427 18.0337 sc -7.6543 -16.7127 tr [ 1 0 0 1 77.185 52.5 ] co 0.63 sw 
0 sj 10 sm np 0 0 m np 0.315 0 0.315 180 0 a 0.315 0 0.315 0 180 a cp s gr gs 
18.0427 18.0337 sc -7.6543 -16.7127 tr [ 1 0 0 1 99.685 35 ] co 0.63 sw 
0 sj 10 sm np 0 0 m np 0.315 0 0.315 180 0 a 0.315 0 0.315 0 180 a cp s gr gs 
18.0427 18.0337 sc -7.6543 -16.7127 tr [ 1 0 0 1 114.685 70 ] co 0.63 sw 
0 sj 10 sm np 0 0 m np 0.315 0 0.315 180 0 a 0.315 0 0.315 0 180 a cp s gr gs 
18.0427 18.0337 sc -7.6543 -16.7127 tr [ 1 0 0 1 129.685 35 ] co 0.63 sw 
0 sj 10 sm np 0 0 m np 0.315 0 0.315 180 0 a 0.315 0 0.315 0 180 a cp s gr gs 
18.0427 18.0337 sc -7.6543 -16.7127 tr [ 1 0 0 1 109.685 35 ] co 0.63 sw 
0 sj 10 sm np 0 0 m np 0.315 0 0.315 180 0 a 0.315 0 0.315 0 180 a cp s gr gs 
18.0427 18.0337 sc -7.6543 -16.7127 tr [ 1 0 0 1 119.685 35 ] co 0.63 sw 
0 sj 10 sm np 0 0 m np 0.315 0 0.315 180 0 a 0.315 0 0.315 0 180 a cp s gr gs 
18.0427 18.0337 sc -7.6543 -16.7127 tr [ 1 0 0 1 104.685 46.66666667 ] co 
0.63 sw 0 sj 10 sm np 0 0 m np 0.315 0 0.315 180 0 a 0.315 0 0.315 0 180 a 
cp s gr gs 18.0427 18.0337 sc -7.6543 -16.7127 tr 
[ 1 0 0 1 109.685 58.33333333 ] co 0.63 sw 0 sj 10 sm np 0 0 m np 
0.315 0 0.315 180 0 a 0.315 0 0.315 0 180 a cp s gr gs 18.0427 18.0337 sc 
-7.6543 -16.7127 tr [ 1 0 0 1 125.315 46.66666667 ] co 0.63 sw 0 sj 10 sm np 
-0.63 0 m np -0.315 0 0.315 0 180 an -0.315 0 0.315 180 0 an cp s gr gs 
18.0427 18.0337 sc -7.6543 -16.7127 tr [ 1 0 0 1 120.315 58.33333333 ] co 
0.63 sw 0 sj 10 sm np -0.63 0 m np -0.315 0 0.315 0 180 an 
-0.315 0 0.315 180 0 an cp s gr 








7 0 0 0 ACADColor /Times-Roman ff 30 scalefont sf 619 275 m (text_0) sh
/Times-Roman ff 30 scalefont sf 1449 275 m (text_1) sh
/Times-Roman ff 30 scalefont sf 2243 275 m (text_2) sh
/Times-Roman ff 30 scalefont sf 6 275 m (text_3) sh
/Times-Roman ff 30 scalefont sf 800 275 m (text_4) sh
/Times-Roman ff 30 scalefont sf 1630 275 m (text_5) sh
/Times-Roman ff 30 scalefont sf 312 998 m (text_6) sh
/Times-Roman ff 30 scalefont sf 1124 998 m (text_7) sh
/Times-Roman ff 30 scalefont sf 1936 998 m (text_8) sh
/Times-Roman ff 30 scalefont sf 1305 636 m (text_9) sh
/Times-Roman ff 30 scalefont sf 2063 744 m (text_10) sh
/Times-Roman ff 30 scalefont sf 2171 528 m (text_11) sh
/Times-Roman ff 30 scalefont sf 1810 744 m (text_12) sh
/Times-Roman ff 30 scalefont sf 1702 528 m (text_13) sh
/Times-Roman ff 30 scalefont sf 944 636 m (text_14) sh
/Times-Roman ff 30 scalefont sf 1124 209 m (text_15) sh
/Times-Roman ff 30 scalefont sf 1846 209 m (text_16) sh
/Times-Roman ff 30 scalefont sf 2027 209 m (text_17) sh

showpage 
%%Trailer 
restore 
%%DocumentFonts: 
%%DocumentNeededFonts: 
