%!PS-Adobe-2.0 EPSF-2.0 
%%BoundingBox: 117 20 480 321
%%HiResBoundingBox: 117.492 20.544 479.562 320.489
%%Title: Z:\home\svn\mueli-da\src_images\koordinaten_acad.eps 
%%Creator: AutoCAD PSOUT 
%%For: , 
%%Pages: 1 
%%DocumentFonts: (atend) 
%%DocumentNeededFonts: (atend) 
%%CreationDate: 2007-02-28 
%%EndComments 
save 
20 20 translate 
0.24 dup scale 
0 setlinewidth 
/ACADLayer { pop } def 
/ACADColor { setrgbcolor pop } def 
/ACADLtype { pop 
userdict /Linedict known not { /Linedict 100 dict def } if 
1 index cvn Linedict exch known not { 
mark 1 index { dup 0 eq { pop 1 72.0 div } if abs } forall 
counttomark 2 add -1 roll astore exch pop 
1 index cvn exch Linedict begin def end } 
{ pop } ifelse 
Linedict begin cvx exec 0 setdash end } bind def 
/bd{bind def}bind def /m{moveto}bd /l{lineto}bd /s{stroke}bd 
/a{arc}bd /an{arcn}bd /gs{gsave}bd /gr{grestore}bd 
/cp{closepath}bd /tr{translate}bd /sc{scale}bd /co{concat}bd 
/ff{findfont}bd /sf{setfont}bd /sh{show}bd /np{newpath}bd 
/sw{setlinewidth}bd /sj{setlinejoin}bd /sm{setmiterlimit}bd 
/cl{clip}bd /fi{fill}bd 
%%EndProlog 
%%Page: 1 1 
gs np -20 -20 m -20 1299 l 2269 1299 l 2269 -20 l cp cl np 7 0 0 0 ACADColor 
(0) ACADLayer (_CONTINUOUS) [ ] (A) ACADLtype gs 10.5683 10.563 sc 
36.4624 8.5905 tr [ 1 0 0 1 9.685 65 ] co 0.63 sw 0 sj 10 sm np 0 0 m np 
0.315 0 0.315 180 0 a 0.315 0 0.315 0 180 a cp s gr gs 10.5683 10.563 sc 
36.4624 8.5905 tr [ 1 0 0 1 26.45403171 98.80287312 ] co 0.63 sw 0 sj 10 sm np 
0 0 m np 0.315 0 0.315 180 0 a 0.315 0 0.315 0 180 a cp s gr gs 
10.5683 10.563 sc 36.4624 8.5905 tr [ 1 0 0 1 57.01093404 73.00839413 ] co 
0.63 sw 0 sj 10 sm np 0 0 m np 0.315 0 0.315 180 0 a 0.315 0 0.315 0 180 a 
cp s gr np 433 1226 m 438 1252 l 442 1226 l cp fi 438 1226 m 438 746 l s 
np 940 728 m 966 724 l 940 720 l cp fi 940 724 m 454 724 l 
s 668 1134 m 603 1054 l 574 1012 l 548 969 l 527 924 l 512 876 l 500 827 l 
491 777 l 620 773 l 684 775 l 747 783 l 809 796 l 870 815 l 991 861 l 898 916 l 
854 945 l 812 977 l 772 1013 l 736 1051 l cp s gs 10.5683 10.563 sc 
36.4624 8.5905 tr [ 1 0 0 1 29.67906004 94.80084097 ] co 0.63 sw 0 sj 10 sm np 
0 0 m np 0.315 0 0.315 180 0 a 0.315 0 0.315 0 180 a cp s gr gs 
10.5683 10.563 sc 36.4624 8.5905 tr [ 1 0 0 1 23.17346037 94.83464112 ] co 
0.63 sw 0 sj 10 sm np 0 0 m np 0.315 0 0.315 180 0 a 0.315 0 0.315 0 180 a 
cp s gr gs 10.5683 10.563 sc 36.4624 8.5905 tr 
[ 1 0 0 1 19.98539263 90.75288223 ] co 0.63 sw 0 sj 10 sm np 0 0 m np 
0.315 0 0.315 180 0 a 0.315 0 0.315 0 180 a cp s gr gs 10.5683 10.563 sc 
36.4624 8.5905 tr [ 1 0 0 1 26.41982809 90.83136755 ] co 0.63 sw 0 sj 10 sm np 
0 0 m np 0.315 0 0.315 180 0 a 0.315 0 0.315 0 180 a cp s gr gs 
10.5683 10.563 sc 36.4624 8.5905 tr [ 1 0 0 1 32.99171304 90.90253202 ] co 
0.63 sw 0 sj 10 sm np 0 0 m np 0.315 0 0.315 180 0 a 0.315 0 0.315 0 180 a 
cp s gr gs 10.5683 10.563 sc 36.4624 8.5905 tr 
[ 1 0 0 1 36.47858649 87.21217128 ] co 0.63 sw 0 sj 10 sm np 0 0 m np 
0.315 0 0.315 180 0 a 0.315 0 0.315 0 180 a cp s gr gs 10.5683 10.563 sc 
36.4624 8.5905 tr [ 1 0 0 1 29.76950365 86.94583054 ] co 0.63 sw 0 sj 10 sm np 
0 0 m np 0.315 0 0.315 180 0 a 0.315 0 0.315 0 180 a cp s gr gs 
10.5683 10.563 sc 36.4624 8.5905 tr [ 1 0 0 1 23.28297909 86.72469538 ] co 
0.63 sw 0 sj 10 sm np 0 0 m np 0.315 0 0.315 180 0 a 0.315 0 0.315 0 180 a 
cp s gr gs 10.5683 10.563 sc 36.4624 8.5905 tr 
[ 1 0 0 1 16.99654413 86.42962452 ] co 0.63 sw 0 sj 10 sm np 0 0 m np 
0.315 0 0.315 180 0 a 0.315 0 0.315 0 180 a cp s gr gs 10.5683 10.563 sc 
36.4624 8.5905 tr [ 1 0 0 1 10.63737627 70.0019551 ] co 0.63 sw 0 sj 10 sm np 
0 0 m np 0.315 0 0.315 180 0 a 0.315 0 0.315 0 180 a cp s gr gs 
10.5683 10.563 sc 36.4624 8.5905 tr [ 1 0 0 1 14.76888525 64.78351961 ] co 
0.63 sw 0 sj 10 sm np 0 0 m np 0.315 0 0.315 180 0 a 0.315 0 0.315 0 180 a 
cp s gr gs 10.5683 10.563 sc 36.4624 8.5905 tr 
[ 1 0 0 1 11.83158239 74.99340283 ] co 0.63 sw 0 sj 10 sm np 0 0 m np 
0.315 0 0.315 180 0 a 0.315 0 0.315 0 180 a cp s gr gs 10.5683 10.563 sc 
36.4624 8.5905 tr [ 1 0 0 1 15.74394468 69.79218845 ] co 0.63 sw 0 sj 10 sm np 
0 0 m np 0.315 0 0.315 180 0 a 0.315 0 0.315 0 180 a cp s gr gs 
10.5683 10.563 sc 36.4624 8.5905 tr [ 1 0 0 1 19.8696838 64.65530574 ] co 
0.63 sw 0 sj 10 sm np 0 0 m np 0.315 0 0.315 180 0 a 0.315 0 0.315 0 180 a 
cp s gr gs 10.5683 10.563 sc 36.4624 8.5905 tr 
[ 1 0 0 1 13.55669746 79.9634059 ] co 0.63 sw 0 sj 10 sm np 0 0 m np 
0.315 0 0.315 180 0 a 0.315 0 0.315 0 180 a cp s gr gs 10.5683 10.563 sc 
36.4624 8.5905 tr [ 1 0 0 1 17.02895459 74.7943275 ] co 0.63 sw 0 sj 10 sm np 
0 0 m np 0.315 0 0.315 180 0 a 0.315 0 0.315 0 180 a cp s gr gs 
10.5683 10.563 sc 36.4624 8.5905 tr [ 1 0 0 1 20.88326593 69.68863539 ] co 
0.63 sw 0 sj 10 sm np 0 0 m np 0.315 0 0.315 180 0 a 0.315 0 0.315 0 180 a 
cp s gr gs 10.5683 10.563 sc 36.4624 8.5905 tr 
[ 1 0 0 1 25.0065313 64.70949877 ] co 0.63 sw 0 sj 10 sm np 0 0 m np 
0.315 0 0.315 180 0 a 0.315 0 0.315 0 180 a cp s gr gs 10.5683 10.563 sc 
36.4624 8.5905 tr [ 1 0 0 1 38.44576829 66.46713 ] co 0.63 sw 0 sj 10 sm np 
0 0 m np 0.315 0 0.315 180 0 a 0.315 0 0.315 0 180 a cp s gr gs 
10.5683 10.563 sc 36.4624 8.5905 tr [ 1 0 0 1 39.35417921 71.91754187 ] co 
0.63 sw 0 sj 10 sm np 0 0 m np 0.315 0 0.315 180 0 a 0.315 0 0.315 0 180 a 
cp s gr gs 10.5683 10.563 sc 36.4624 8.5905 tr 
[ 1 0 0 1 40.25266428 77.44735436 ] co 0.63 sw 0 sj 10 sm np 0 0 m np 
0.315 0 0.315 180 0 a 0.315 0 0.315 0 180 a cp s gr gs 10.5683 10.563 sc 
36.4624 8.5905 tr [ 1 0 0 1 41.17214953 83.06883491 ] co 0.63 sw 0 sj 10 sm np 
0 0 m np 0.315 0 0.315 180 0 a 0.315 0 0.315 0 180 a cp s gr gs 
10.5683 10.563 sc 36.4624 8.5905 tr [ 1 0 0 1 46.1195864 79.51605854 ] co 
0.63 sw 0 sj 10 sm np 0 0 m np 0.315 0 0.315 180 0 a 0.315 0 0.315 0 180 a 
cp s gr gs 10.5683 10.563 sc 36.4624 8.5905 tr 
[ 1 0 0 1 45.51295795 73.91411636 ] co 0.63 sw 0 sj 10 sm np 0 0 m np 
0.315 0 0.315 180 0 a 0.315 0 0.315 0 180 a cp s gr gs 10.5683 10.563 sc 
36.4624 8.5905 tr [ 1 0 0 1 44.9144102 68.36695142 ] co 0.63 sw 0 sj 10 sm np 
0 0 m np 0.315 0 0.315 180 0 a 0.315 0 0.315 0 180 a cp s gr gs 
10.5683 10.563 sc 36.4624 8.5905 tr [ 1 0 0 1 51.04157121 70.61090954 ] co 
0.63 sw 0 sj 10 sm np 0 0 m np 0.315 0 0.315 180 0 a 0.315 0 0.315 0 180 a 
cp s gr gs 10.5683 10.563 sc 36.4624 8.5905 tr 
[ 1 0 0 1 51.46301129 76.19824227 ] co 0.63 sw 0 sj 10 sm np 0 0 m np 
0.315 0 0.315 180 0 a 0.315 0 0.315 0 180 a cp s gr 569 985 m 569 985 l 
s 558 965 m 558 965 l s 548 945 m 548 945 l cp s 802 972 m 802 972 l 
s 788 984 m 788 984 l s 775 996 m 775 996 l cp s 665 785 m 665 785 l 
s 683 786 m 683 786 l s 700 788 m 700 788 l s 717 789 m 717 789 l 
s 733 792 m 733 792 l s 750 794 m 750 794 l s 768 797 m 768 797 l cp s 
np 1279 1226 m 1283 1252 l 1288 1226 l cp fi 1283 1226 m 1283 703 l s 
np 1785 728 m 1812 724 l 1785 720 l cp fi 1785 724 m 1262 724 l 
s 1283 1147 m 1706 724 l s gs 10.5683 10.563 sc 36.4624 8.5905 tr 
[ 1 0 0 1 84.685 100 ] co 0.63 sw 0 sj 10 sm np 0 0 m np 0.315 0 0.315 180 0 a 
0.315 0 0.315 0 180 a cp s gr gs 10.5683 10.563 sc 36.4624 8.5905 tr 
[ 1 0 0 1 124.685 60 ] co 0.63 sw 0 sj 10 sm np 0 0 m np 0.315 0 0.315 180 0 a 
0.315 0 0.315 0 180 a cp s gr gs 10.5683 10.563 sc 36.4624 8.5905 tr 
[ 1 0 0 1 84.685 60 ] co 0.63 sw 0 sj 10 sm np 0 0 m np 0.315 0 0.315 180 0 a 
0.315 0 0.315 0 180 a cp s gr np 1067 592 m 1072 618 l 1076 592 l cp fi 
1072 592 m 1072 228 l s np 1415 253 m 1442 249 l 1415 244 l cp fi 
1415 249 m 1051 249 l s gs 10.5683 10.563 sc 36.4624 8.5905 tr 
[ 1 0 0 1 64.685 40 ] co 0.63 sw 0 sj 10 sm np 0 0 m np 0.315 0 0.315 180 0 a 
0.315 0 0.315 0 180 a cp s gr np 882 53 m 860 37 l 876 59 l cp fi 
879 56 m 1093 270 l s 1072 513 m 1336 249 l 913 90 l cp s gs 10.5683 10.563 sc 
36.4624 8.5905 tr [ 1 0 0 1 49.685 0 ] co 0.63 sw 0 sj 10 sm np 0 0 m np 
0.315 0 0.315 180 0 a 0.315 0 0.315 0 180 a cp s gr gs 10.5683 10.563 sc 
36.4624 8.5905 tr [ 1 0 0 1 89.685 15 ] co 0.63 sw 0 sj 10 sm np 0 0 m np 
0.315 0 0.315 180 0 a 0.315 0 0.315 0 180 a cp s gr gs 10.5683 10.563 sc 
36.4624 8.5905 tr [ 1 0 0 1 84.685 65 ] co 0.63 sw 0 sj 10 sm np 0 0 m np 
0.315 0 0.315 180 0 a 0.315 0 0.315 0 180 a cp s gr gs 10.5683 10.563 sc 
36.4624 8.5905 tr [ 1 0 0 1 84.685 70 ] co 0.63 sw 0 sj 10 sm np 0 0 m np 
0.315 0 0.315 180 0 a 0.315 0 0.315 0 180 a cp s gr gs 10.5683 10.563 sc 
36.4624 8.5905 tr [ 1 0 0 1 89.685 60 ] co 0.63 sw 0 sj 10 sm np 0 0 m np 
0.315 0 0.315 180 0 a 0.315 0 0.315 0 180 a cp s gr gs 10.5683 10.563 sc 
36.4624 8.5905 tr [ 1 0 0 1 94.685 60 ] co 0.63 sw 0 sj 10 sm np 0 0 m np 
0.315 0 0.315 180 0 a 0.315 0 0.315 0 180 a cp s gr gs 10.5683 10.563 sc 
36.4624 8.5905 tr [ 1 0 0 1 89.685 65 ] co 0.63 sw 0 sj 10 sm np 0 0 m np 
0.315 0 0.315 180 0 a 0.315 0 0.315 0 180 a cp s gr gs 10.5683 10.563 sc 
36.4624 8.5905 tr [ 1 0 0 1 84.685 75 ] co 0.63 sw 0 sj 10 sm np 0 0 m np 
0.315 0 0.315 180 0 a 0.315 0 0.315 0 180 a cp s gr gs 10.5683 10.563 sc 
36.4624 8.5905 tr [ 1 0 0 1 89.685 70 ] co 0.63 sw 0 sj 10 sm np 0 0 m np 
0.315 0 0.315 180 0 a 0.315 0 0.315 0 180 a cp s gr gs 10.5683 10.563 sc 
36.4624 8.5905 tr [ 1 0 0 1 94.685 65 ] co 0.63 sw 0 sj 10 sm np 0 0 m np 
0.315 0 0.315 180 0 a 0.315 0 0.315 0 180 a cp s gr gs 10.5683 10.563 sc 
36.4624 8.5905 tr [ 1 0 0 1 99.685 60 ] co 0.63 sw 0 sj 10 sm np 0 0 m np 
0.315 0 0.315 180 0 a 0.315 0 0.315 0 180 a cp s gr gs 10.5683 10.563 sc 
36.4624 8.5905 tr [ 1 0 0 1 119.685 60 ] co 0.63 sw 0 sj 10 sm np 0 0 m np 
0.315 0 0.315 180 0 a 0.315 0 0.315 0 180 a cp s gr gs 10.5683 10.563 sc 
36.4624 8.5905 tr [ 1 0 0 1 119.685 65 ] co 0.63 sw 0 sj 10 sm np 0 0 m np 
0.315 0 0.315 180 0 a 0.315 0 0.315 0 180 a cp s gr gs 10.5683 10.563 sc 
36.4624 8.5905 tr [ 1 0 0 1 114.685 60 ] co 0.63 sw 0 sj 10 sm np 0 0 m np 
0.315 0 0.315 180 0 a 0.315 0 0.315 0 180 a cp s gr gs 10.5683 10.563 sc 
36.4624 8.5905 tr [ 1 0 0 1 114.685 70 ] co 0.63 sw 0 sj 10 sm np 0 0 m np 
0.315 0 0.315 180 0 a 0.315 0 0.315 0 180 a cp s gr gs 10.5683 10.563 sc 
36.4624 8.5905 tr [ 1 0 0 1 114.685 65 ] co 0.63 sw 0 sj 10 sm np 0 0 m np 
0.315 0 0.315 180 0 a 0.315 0 0.315 0 180 a cp s gr gs 10.5683 10.563 sc 
36.4624 8.5905 tr [ 1 0 0 1 109.685 60 ] co 0.63 sw 0 sj 10 sm np 0 0 m np 
0.315 0 0.315 180 0 a 0.315 0 0.315 0 180 a cp s gr gs 10.5683 10.563 sc 
36.4624 8.5905 tr [ 1 0 0 1 109.685 65 ] co 0.63 sw 0 sj 10 sm np 0 0 m np 
0.315 0 0.315 180 0 a 0.315 0 0.315 0 180 a cp s gr gs 10.5683 10.563 sc 
36.4624 8.5905 tr [ 1 0 0 1 109.685 75 ] co 0.63 sw 0 sj 10 sm np 0 0 m np 
0.315 0 0.315 180 0 a 0.315 0 0.315 0 180 a cp s gr gs 10.5683 10.563 sc 
36.4624 8.5905 tr [ 1 0 0 1 84.685 95 ] co 0.63 sw 0 sj 10 sm np 0 0 m np 
0.315 0 0.315 180 0 a 0.315 0 0.315 0 180 a cp s gr gs 10.5683 10.563 sc 
36.4624 8.5905 tr [ 1 0 0 1 89.685 95 ] co 0.63 sw 0 sj 10 sm np 0 0 m np 
0.315 0 0.315 180 0 a 0.315 0 0.315 0 180 a cp s gr gs 10.5683 10.563 sc 
36.4624 8.5905 tr [ 1 0 0 1 94.685 90 ] co 0.63 sw 0 sj 10 sm np 0 0 m np 
0.315 0 0.315 180 0 a 0.315 0 0.315 0 180 a cp s gr gs 10.5683 10.563 sc 
36.4624 8.5905 tr [ 1 0 0 1 89.685 90 ] co 0.63 sw 0 sj 10 sm np 0 0 m np 
0.315 0 0.315 180 0 a 0.315 0 0.315 0 180 a cp s gr gs 10.5683 10.563 sc 
36.4624 8.5905 tr [ 1 0 0 1 84.685 90 ] co 0.63 sw 0 sj 10 sm np 0 0 m np 
0.315 0 0.315 180 0 a 0.315 0 0.315 0 180 a cp s gr gs 10.5683 10.563 sc 
36.4624 8.5905 tr [ 1 0 0 1 84.685 85 ] co 0.63 sw 0 sj 10 sm np 0 0 m np 
0.315 0 0.315 180 0 a 0.315 0 0.315 0 180 a cp s gr gs 10.5683 10.563 sc 
36.4624 8.5905 tr [ 1 0 0 1 89.685 85 ] co 0.63 sw 0 sj 10 sm np 0 0 m np 
0.315 0 0.315 180 0 a 0.315 0 0.315 0 180 a cp s gr gs 10.5683 10.563 sc 
36.4624 8.5905 tr [ 1 0 0 1 99.685 85 ] co 0.63 sw 0 sj 10 sm np 0 0 m np 
0.315 0 0.315 180 0 a 0.315 0 0.315 0 180 a cp s gr gs 10.5683 10.563 sc 
36.4624 8.5905 tr [ 1 0 0 1 94.685 85 ] co 0.63 sw 0 sj 10 sm np 0 0 m np 
0.315 0 0.315 180 0 a 0.315 0 0.315 0 180 a cp s gr gs 10.5683 10.563 sc 
36.4624 8.5905 tr [ 1 0 0 1 109.685 70 ] co 0.63 sw 0 sj 10 sm np 0 0 m np 
0.315 0 0.315 180 0 a 0.315 0 0.315 0 180 a cp s gr gs 10.5683 10.563 sc 
36.4624 8.5905 tr [ 1 0 0 1 67.79191045 36.89308955 ] co 0.63 sw 0 sj 10 sm np 
0 0 m np 0.315 0 0.315 180 0 a 0.315 0 0.315 0 180 a cp s gr gs 
10.5683 10.563 sc 36.4624 8.5905 tr [ 1 0 0 1 62.82085373 35.02894328 ] co 
0.63 sw 0 sj 10 sm np 0 0 m np 0.315 0 0.315 180 0 a 0.315 0 0.315 0 180 a 
cp s gr gs 10.5683 10.563 sc 36.4624 8.5905 tr 
[ 1 0 0 1 60.95670746 30.05788655 ] co 0.63 sw 0 sj 10 sm np 0 0 m np 
0.315 0 0.315 180 0 a 0.315 0 0.315 0 180 a cp s gr gs 10.5683 10.563 sc 
36.4624 8.5905 tr [ 1 0 0 1 65.92776418 31.92203282 ] co 0.63 sw 0 sj 10 sm np 
0 0 m np 0.315 0 0.315 180 0 a 0.315 0 0.315 0 180 a cp s gr gs 
10.5683 10.563 sc 36.4624 8.5905 tr [ 1 0 0 1 70.89882091 33.78617909 ] co 
0.63 sw 0 sj 10 sm np 0 0 m np 0.315 0 0.315 180 0 a 0.315 0 0.315 0 180 a 
cp s gr gs 10.5683 10.563 sc 36.4624 8.5905 tr 
[ 1 0 0 1 74.00573136 30.67926864 ] co 0.63 sw 0 sj 10 sm np 0 0 m np 
0.315 0 0.315 180 0 a 0.315 0 0.315 0 180 a cp s gr gs 10.5683 10.563 sc 
36.4624 8.5905 tr [ 1 0 0 1 69.03467463 28.81512237 ] co 0.63 sw 0 sj 10 sm np 
0 0 m np 0.315 0 0.315 180 0 a 0.315 0 0.315 0 180 a cp s gr gs 
10.5683 10.563 sc 36.4624 8.5905 tr [ 1 0 0 1 64.06361791 26.9509761 ] co 
0.63 sw 0 sj 10 sm np 0 0 m np 0.315 0 0.315 180 0 a 0.315 0 0.315 0 180 a 
cp s gr gs 10.5683 10.563 sc 36.4624 8.5905 tr 
[ 1 0 0 1 59.09256118 25.08682983 ] co 0.63 sw 0 sj 10 sm np 0 0 m np 
0.315 0 0.315 180 0 a 0.315 0 0.315 0 180 a cp s gr gs 10.5683 10.563 sc 
36.4624 8.5905 tr [ 1 0 0 1 80.36426864 24.32073136 ] co 0.63 sw 0 sj 10 sm np 
0 0 m np 0.315 0 0.315 180 0 a 0.315 0 0.315 0 180 a cp s gr gs 
10.5683 10.563 sc 36.4624 8.5905 tr [ 1 0 0 1 83.47117909 21.21382091 ] co 
0.63 sw 0 sj 10 sm np 0 0 m np 0.315 0 0.315 180 0 a 0.315 0 0.315 0 180 a 
cp s gr gs 10.5683 10.563 sc 36.4624 8.5905 tr 
[ 1 0 0 1 86.57808955 18.10691045 ] co 0.63 sw 0 sj 10 sm np 0 0 m np 
0.315 0 0.315 180 0 a 0.315 0 0.315 0 180 a cp s gr gs 10.5683 10.563 sc 
36.4624 8.5905 tr [ 1 0 0 1 81.60703282 16.24276418 ] co 0.63 sw 0 sj 10 sm np 
0 0 m np 0.315 0 0.315 180 0 a 0.315 0 0.315 0 180 a cp s gr gs 
10.5683 10.563 sc 36.4624 8.5905 tr [ 1 0 0 1 78.50012237 19.34967463 ] co 
0.63 sw 0 sj 10 sm np 0 0 m np 0.315 0 0.315 180 0 a 0.315 0 0.315 0 180 a 
cp s gr gs 10.5683 10.563 sc 36.4624 8.5905 tr 
[ 1 0 0 1 76.6359761 14.37861791 ] co 0.63 sw 0 sj 10 sm np 0 0 m np 
0.315 0 0.315 180 0 a 0.315 0 0.315 0 180 a cp s gr gs 10.5683 10.563 sc 
36.4624 8.5905 tr [ 1 0 0 1 74.77182983 9.40756118 ] co 0.63 sw 0 sj 10 sm np 
0 0 m np 0.315 0 0.315 180 0 a 0.315 0 0.315 0 180 a cp s gr gs 
10.5683 10.563 sc 36.4624 8.5905 tr [ 1 0 0 1 89.685 15 ] co 0.63 sw 
0 sj 10 sm np 0 0 m np 0.315 0 0.315 180 0 a 0.315 0 0.315 0 180 a cp s gr gs 
10.5683 10.563 sc 36.4624 8.5905 tr [ 1 0 0 1 79.74288655 11.27170746 ] co 
0.63 sw 0 sj 10 sm np 0 0 m np 0.315 0 0.315 180 0 a 0.315 0 0.315 0 180 a 
cp s gr gs 10.5683 10.563 sc 36.4624 8.5905 tr 
[ 1 0 0 1 84.71394328 13.13585373 ] co 0.63 sw 0 sj 10 sm np 0 0 m np 
0.315 0 0.315 180 0 a 0.315 0 0.315 0 180 a cp s gr gs 10.5683 10.563 sc 
36.4624 8.5905 tr [ 1 0 0 1 51.54914627 4.97105672 ] co 0.63 sw 0 sj 10 sm np 
0 0 m np 0.315 0 0.315 180 0 a 0.315 0 0.315 0 180 a cp s gr gs 
10.5683 10.563 sc 36.4624 8.5905 tr [ 1 0 0 1 54.65605672 1.86414627 ] co 
0.63 sw 0 sj 10 sm np 0 0 m np 0.315 0 0.315 180 0 a 0.315 0 0.315 0 180 a 
cp s gr gs 10.5683 10.563 sc 36.4624 8.5905 tr 
[ 1 0 0 1 59.62711345 3.72829254 ] co 0.63 sw 0 sj 10 sm np 0 0 m np 
0.315 0 0.315 180 0 a 0.315 0 0.315 0 180 a cp s gr gs 10.5683 10.563 sc 
36.4624 8.5905 tr [ 1 0 0 1 56.520203 6.835203 ] co 0.63 sw 0 sj 10 sm np 
0 0 m np 0.315 0 0.315 180 0 a 0.315 0 0.315 0 180 a cp s gr gs 
10.5683 10.563 sc 36.4624 8.5905 tr [ 1 0 0 1 53.41329254 9.94211345 ] co 
0.63 sw 0 sj 10 sm np 0 0 m np 0.315 0 0.315 180 0 a 0.315 0 0.315 0 180 a 
cp s gr gs 10.5683 10.563 sc 36.4624 8.5905 tr 
[ 1 0 0 1 55.27743882 14.91317017 ] co 0.63 sw 0 sj 10 sm np 0 0 m np 
0.315 0 0.315 180 0 a 0.315 0 0.315 0 180 a cp s gr gs 10.5683 10.563 sc 
36.4624 8.5905 tr [ 1 0 0 1 58.38434927 11.80625972 ] co 0.63 sw 0 sj 10 sm np 
0 0 m np 0.315 0 0.315 180 0 a 0.315 0 0.315 0 180 a cp s gr gs 
10.5683 10.563 sc 36.4624 8.5905 tr [ 1 0 0 1 61.49125972 8.69934927 ] co 
0.63 sw 0 sj 10 sm np 0 0 m np 0.315 0 0.315 180 0 a 0.315 0 0.315 0 180 a 
cp s gr gs 10.5683 10.563 sc 36.4624 8.5905 tr 
[ 1 0 0 1 64.59817017 5.59243882 ] co 0.63 sw 0 sj 10 sm np 0 0 m np 
0.315 0 0.315 180 0 a 0.315 0 0.315 0 180 a cp s gr 426 746 m 442 745 l 
448 743 l 450 739 l 452 726 l 462 716 l s 



(0) ACADLayer np 920 401 m 944 387 l 917 392 l cp fi 
919 397 m 834 423 l 813 430 l 795 440 l 778 451 l 764 466 l 751 482 l 741 501 l 
722 542 l 706 584 l 688 625 l s np 1483 600 m 1498 622 l 1491 596 l cp fi 
1487 598 m 1460 523 l 1444 488 l 1433 472 l 1421 458 l 1407 446 l 1391 436 l 
1355 418 l 1318 402 l 1282 385 l s 




(0) ACADLayer gs 10.5683 10.563 sc 36.4624 8.5905 tr 
[ 1 0 0 1 85 100 ] co np 0 0 1.2 0 360 a s gr gs 10.5683 10.563 sc 
36.4624 8.5905 tr [ 1 0 0 1 125 60 ] co np 0 0 1.2 0 360 a s gr gs 
10.5683 10.563 sc 36.4624 8.5905 tr [ 1 0 0 1 85 60 ] co np 
0 0 1.2 0 360 a s gr gs 10.5683 10.563 sc 36.4624 8.5905 tr 
[ 1 0 0 1 57.32593404 73.00839413 ] co np 0 0 1.2 0 360 a s gr gs 
10.5683 10.563 sc 36.4624 8.5905 tr [ 1 0 0 1 26.76903171 98.80287312 ] co np 
0 0 1.2 0 360 a s gr gs 10.5683 10.563 sc 36.4624 8.5905 tr 
[ 1 0 0 1 10 65 ] co np 0 0 1.2 0 360 a s gr gs 10.5683 10.563 sc 
36.4624 8.5905 tr [ 1 0 0 1 65 40 ] co np 0 0 1.2 0 360 a s gr gs 
10.5683 10.563 sc 36.4624 8.5905 tr [ 1 0 0 1 90 15 ] co np 
0 0 1.2 0 360 a s gr gs 10.5683 10.563 sc 36.4624 8.5905 tr 
[ 1 0 0 1 50 0 ] co np 0 0 1.2 0 360 a s gr 
7 0 0 0 ACADColor /Times-Roman ff 30 scalefont sf 998 703 m (text_0) sh
/Times-Roman ff 30 scalefont sf 1843 703 m (text_1) sh
/Times-Roman ff 30 scalefont sf 406 1231 m (text_2) sh
/Times-Roman ff 30 scalefont sf 1251 1231 m (text_3) sh
/Times-Roman ff 30 scalefont sf 1103 597 m (text_4) sh
/Times-Roman ff 30 scalefont sf 1484 238 m (text_5) sh
/Times-Roman ff 30 scalefont sf 829 6 m (text_6) sh
/Times-Roman ff 30 scalefont sf 1695 661 m (text_7) sh
/Times-Roman ff 30 scalefont sf 1315 1147 m (text_8) sh
/Times-Roman ff 30 scalefont sf 1273 661 m (text_9) sh
/Times-Roman ff 30 scalefont sf 702 1125 m (text_10) sh
/Times-Roman ff 30 scalefont sf 1019 851 m (text_11) sh
/Times-Roman ff 30 scalefont sf 469 766 m (text_12) sh
/Times-Roman ff 30 scalefont sf 1357 259 m (text_13) sh
/Times-Roman ff 30 scalefont sf 1103 513 m (text_14) sh
/Times-Roman ff 30 scalefont sf 892 90 m (text_15) sh

showpage 
%%Trailer 
restore 
%%DocumentFonts: 
%%DocumentNeededFonts: 
