%!PS-Adobe-2.0 EPSF-2.0
%%BoundingBox: 20 20 560 328
%%Title: Z:\home\svn\mueli-da\src_images\int_elementkraftdichte_acad.eps 
%%Creator: AutoCAD PSOUT
%%For:  , 
%%Pages: 1
%%DocumentFonts: (atend)
%%DocumentNeededFonts: (atend)
%%CreationDate: 2007-02-28
%%EndComments
save
20 20 translate
0.24 dup scale
0 setlinewidth
/ACADLayer  { pop } def
/ACADColor { setrgbcolor pop } def
/ACADLtype { pop
userdict /Linedict known not { /Linedict 100 dict def } if
1 index cvn Linedict exch known not {
mark 1 index { dup 0 eq { pop 1 72.0 div } if abs } forall
counttomark 2 add -1 roll astore exch pop
1 index cvn exch Linedict begin def end }
{ pop } ifelse 
Linedict begin cvx exec 0 setdash end } bind def
/bd{bind def}bind def /m{moveto}bd /l{lineto}bd /s{stroke}bd
/a{arc}bd /an{arcn}bd /gs{gsave}bd /gr{grestore}bd
/cp{closepath}bd /tr{translate}bd /sc{scale}bd /co{concat}bd
/ff{findfont}bd /sf{setfont}bd /sh{show}bd /np{newpath}bd
/sw{setlinewidth}bd /sj{setlinejoin}bd /sm{setmiterlimit}bd
/cl{clip}bd /fi{fill}bd
%%EndProlog
%%Page: 1 1
gs np -20 -20 m -20 1299 l  2269 1299 l 2269 -20 l cp cl np 1 1 0 0 ACADColor
(0) ACADLayer (_CONTINUOUS) [  ] (A) ACADLtype 144 597 m 174 1070 l
s 570 648 m 450 1164 l s 174 1070 m 243 1086 l 313 1108 l 382 1135 l 450 1164 l
s 5 0 0 1 ACADColor gs 17.2062 17.1976 sc 0.38 -45.279 tr
[ 1 0 0 1 32.48762465 83.01493225 ] co 0.63 sw 0 sj 10 sm np 0 0 m np
0.315 0 0.315 180 0 a 0.315 0 0.315 0 180 a cp s gr gs 17.2062 17.1976 sc
0.38 -45.279 tr [ 1 0 0 1 7.685 80 ] co 0.63 sw 0 sj 10 sm np 0 0 m np
0.315 0 0.315 180 0 a 0.315 0 0.315 0 180 a cp s gr 7 0 0 0 ACADColor
144 597 m 496 230 l 570 648 l s 5 0 0 1 ACADColor 570 648 m 144 597 l s
7 0 0 0 ACADColor gs 17.2062 17.1976 sc 0.38 -45.279 tr
[ 1 0 0 1 28.18815741 58.67123237 ] co 0.63 sw 0 sj 10 sm np 0 0 m np
0.315 0 0.315 180 0 a 0.315 0 0.315 0 180 a cp s gr np 617 174 m 660 167 l
617 160 l cp fi 617 167 m 23 167 l s np 50 726 m 58 769 l 65 726 l cp fi
58 726 m 58 132 l s np 2165 346 m 2208 339 l 2165 331 l cp fi
2165 339 m 1090 339 l s np 1599 915 m 1606 958 l 1613 915 l cp fi
1606 915 m 1606 184 l s (_STRICHLINIE2) [  1.905  -0.9525  ] (A) ACADLtype gs
17.2062 17.1976 sc 0.38 -45.279 tr 68 92.5 m 68 65 l s gr gs 17.2062 17.1976 sc
0.38 -45.279 tr 118 94.4 m 118 58.2 l s gr 3 0 1 0 ACADColor (_CONTINUOUS) [
 ] (A) ACADLtype 174 1070 m 450 1164 l s 1176 812 m 2036 844 l s
1 1 0 0 ACADColor np 164 1027 m 174 1070 l 178 1026 l cp fi
171 1027 m 144 597 l s np 453 1120 m 450 1164 l 467 1124 l cp fi
460 1122 m 570 648 l s 7 0 0 0 ACADColor (font_c) ACADLayer 419 459 m 419 528 l
s (font_l) ACADLayer 2243 287 m 2243 356 l s 694 115 m 694 184 l s
(font_r) ACADLayer 6 734 m 6 803 l s 109 975 m 109 1044 l s (font_l) ACADLayer
522 1078 m 522 1147 l s 2071 224 m 2071 292 l s 2071 734 m 2071 803 l s
(font_r) ACADLayer 1142 365 m 1142 434 l s 1142 700 m 1142 769 l s
3 0 1 0 ACADColor (0) ACADLayer 1176 370 m 2036 222 l s 7 0 0 0 ACADColor
(font_c) ACADLayer 1606 1005 m 1606 1074 l s
showpage
%%Trailer
restore
%%DocumentFonts:
%%DocumentNeededFonts:
