%!PS-Adobe-2.0 EPSF-2.0
%%BoundingBox: 20 20 560 328
%%Title: Z:\home\svn\mueli-da\src_images\aeuszere_lastaufbringung_acad.eps 
%%Creator: AutoCAD PSOUT
%%For:  , 
%%Pages: 1
%%DocumentFonts: (atend)
%%DocumentNeededFonts: (atend)
%%CreationDate: 2007-02-28
%%EndComments
save
20 20 translate
0.24 dup scale
0 setlinewidth
/ACADLayer  { pop } def
/ACADColor { setrgbcolor pop } def
/ACADLtype { pop
userdict /Linedict known not { /Linedict 100 dict def } if
1 index cvn Linedict exch known not {
mark 1 index { dup 0 eq { pop 1 72.0 div } if abs } forall
counttomark 2 add -1 roll astore exch pop
1 index cvn exch Linedict begin def end }
{ pop } ifelse 
Linedict begin cvx exec 0 setdash end } bind def
/bd{bind def}bind def /m{moveto}bd /l{lineto}bd /s{stroke}bd
/a{arc}bd /an{arcn}bd /gs{gsave}bd /gr{grestore}bd
/cp{closepath}bd /tr{translate}bd /sc{scale}bd /co{concat}bd
/ff{findfont}bd /sf{setfont}bd /sh{show}bd /np{newpath}bd
/sw{setlinewidth}bd /sj{setlinejoin}bd /sm{setmiterlimit}bd
/cl{clip}bd /fi{fill}bd
%%EndProlog
%%Page: 1 1
gs np -20 -20 m -20 1299 l  2269 1299 l 2269 -20 l cp cl np 7 0 0 0 ACADColor
(0) ACADLayer (_CONTINUOUS) [  ] (A) ACADLtype 522 386 m 509 402 l
s 504 408 m 492 419 l s 486 425 m 472 434 l s 465 439 m 465 439 l 449 445 l
s 442 449 m 442 449 l 425 451 l s 417 453 m 416 453 l 404 456 l 401 457 l
s 394 460 m 393 460 l 384 467 l 380 470 l s 375 477 m 366 491 l
s 362 498 m 357 514 l s 354 522 m 352 538 l s 351 546 m 350 551 l 350 563 l
s 350 571 m 350 584 l 350 588 l s 351 596 m 353 613 l s 354 621 m 357 637 l
s 358 646 m 360 652 l 363 662 l s 365 670 m 369 685 l 369 686 l
s 372 693 m 378 709 l s 381 717 m 382 717 l 389 732 l s 393 739 m 397 746 l
401 753 l s 406 760 m 414 772 l 415 774 l s 420 780 m 431 793 l
s 437 799 m 449 810 l s 455 816 m 469 826 l s 475 831 m 476 831 l 490 839 l
s 497 844 m 499 845 l 512 851 l s 519 854 m 524 856 l 535 860 l
s 543 863 m 549 865 l 559 867 l s 567 869 m 575 871 l 583 873 l
s 591 874 m 602 875 l 608 876 l s 616 876 m 628 877 l 633 877 l
s 641 877 m 658 876 l s 666 876 m 681 875 l 683 875 l s 691 874 m 707 871 l
s 716 870 m 732 867 l s 740 865 m 756 861 l s 764 859 m 784 853 l 784 853 l s
gs 13.1105 13.1039 sc 9.8888 -34.7857 tr
[ 1 0 0 1 30.56502111 63.43264413 ] co np 0 0 1 0 360 a s gr gs
13.1105 13.1039 sc 9.8888 -34.7857 tr [ 1 0 0 1 78.5635002 53.9518183 ] co np
0 0 1 0 360 a s gr 1146 249 m 1129 247 l s 1121 246 m 1105 244 l
s 1096 243 m 1092 242 l 1080 240 l s 1072 238 m 1056 235 l
s 1047 233 m 1038 232 l 1031 230 l s 1023 227 m 1007 223 l
s 999 220 m 986 217 l 983 216 l s 975 213 m 960 207 l s 952 205 m 936 199 l
936 199 l s 928 196 m 913 190 l s 905 188 m 889 182 l s 882 179 m 866 173 l
s 858 170 m 843 165 l 842 164 l s 834 162 m 819 157 l s 811 155 m 799 151 l
795 150 l s 786 148 m 770 145 l s 762 143 m 759 143 l 745 141 l
s 737 141 m 722 141 l 721 142 l s 712 143 m 705 144 l 696 147 l
s 688 149 m 673 157 l s 667 162 m 659 168 l 654 173 l s 648 179 m 645 182 l
638 191 l s 632 198 m 623 212 l s 619 219 m 610 233 l s 606 240 m 598 255 l
s 594 262 m 586 277 l s 582 284 m 574 299 l s 570 306 m 562 321 l
s 558 328 m 550 342 l s 546 349 m 537 364 l 537 364 l s 1 1 0 0 ACADColor
1080 772 m 1092 952 l s 1243 792 m 1197 988 l s 946 799 m 995 957 l
s 1398 1036 m 1405 821 l s 784 853 m 815 956 l 850 971 l 867 976 l 885 978 l
922 975 l 959 967 l 996 957 l 1034 950 l 1071 949 l 1108 956 l 1144 967 l
1180 981 l 1253 1012 l 1289 1025 l 1325 1035 l 1361 1039 l 1379 1039 l
1398 1036 l s 5 0 0 1 ACADColor gs 13.1105 13.1039 sc 9.8888 -34.7857 tr
[ 1 0 0 1 97.0182772 97.44978574 ] co 0.63 sw 0 sj 10 sm np 0 0 m np
0.315 0 0.315 180 0 a 0.315 0 0.315 0 180 a cp s gr gs 13.1105 13.1039 sc
9.8888 -34.7857 tr [ 1 0 0 1 84.64238229 95.23499629 ] co 0.63 sw 0 sj 10 sm np
0 0 m np 0.315 0 0.315 180 0 a 0.315 0 0.315 0 180 a cp s gr gs
13.1105 13.1039 sc 9.8888 -34.7857 tr [ 1 0 0 1 72.24106997 93.72753017 ] co 
0.63 sw 0 sj 10 sm np 0 0 m np 0.315 0 0.315 180 0 a 0.315 0 0.315 0 180 a
cp s gr gs 13.1105 13.1039 sc 9.8888 -34.7857 tr
[ 1 0 0 1 62.00846112 95.82883386 ] co 0.63 sw 0 sj 10 sm np 0 0 m np
0.315 0 0.315 180 0 a 0.315 0 0.315 0 180 a cp s gr gs 13.1105 13.1039 sc
9.8888 -34.7857 tr [ 1 0 0 1 49.66569676 99.95284628 ] co 0.63 sw 0 sj 10 sm np
0 0 m np 0.315 0 0.315 180 0 a 0.315 0 0.315 0 180 a cp s gr 7 0 0 0 ACADColor
gs 13.1105 13.1039 sc 9.8888 -34.7857 tr
[ 1 0 0 1 52.09982119 88.36823448 ] co 0.63 sw 0 sj 10 sm np 0 0 m np
0.315 0 0.315 180 0 a 0.315 0 0.315 0 180 a cp s gr gs 13.1105 13.1039 sc
9.8888 -34.7857 tr [ 1 0 0 1 62.06753589 81.39193588 ] co 0.63 sw 0 sj 10 sm np
0 0 m np 0.315 0 0.315 180 0 a 0.315 0 0.315 0 180 a cp s gr gs
13.1105 13.1039 sc 9.8888 -34.7857 tr [ 1 0 0 1 95.15762412 80.13678839 ] co 
0.63 sw 0 sj 10 sm np 0 0 m np 0.315 0 0.315 180 0 a 0.315 0 0.315 0 180 a
cp s gr gs 13.1105 13.1039 sc 9.8888 -34.7857 tr
[ 1 0 0 1 72.71067496 75.36869175 ] co 0.63 sw 0 sj 10 sm np 0 0 m np
0.315 0 0.315 180 0 a 0.315 0 0.315 0 180 a cp s gr gs 13.1105 13.1039 sc
9.8888 -34.7857 tr [ 1 0 0 1 88.51045152 68.73177306 ] co 0.63 sw 0 sj 10 sm np
0 0 m np 0.315 0 0.315 180 0 a 0.315 0 0.315 0 180 a cp s gr gs
13.1105 13.1039 sc 9.8888 -34.7857 tr [ 1 0 0 1 60.77172844 66.37039557 ] co 
0.63 sw 0 sj 10 sm np 0 0 m np 0.315 0 0.315 180 0 a 0.315 0 0.315 0 180 a
cp s gr gs 13.1105 13.1039 sc 9.8888 -34.7857 tr
[ 1 0 0 1 50.90928275 71.40947225 ] co 0.63 sw 0 sj 10 sm np 0 0 m np
0.315 0 0.315 180 0 a 0.315 0 0.315 0 180 a cp s gr gs 13.1105 13.1039 sc
9.8888 -34.7857 tr [ 1 0 0 1 39.33907827 81.45687334 ] co 0.63 sw 0 sj 10 sm np
0 0 m np 0.315 0 0.315 180 0 a 0.315 0 0.315 0 180 a cp s gr gs
13.1105 13.1039 sc 9.8888 -34.7857 tr [ 1 0 0 1 39.20313549 92.70886326 ] co 
0.63 sw 0 sj 10 sm np 0 0 m np 0.315 0 0.315 180 0 a 0.315 0 0.315 0 180 a
cp s gr gs 13.1105 13.1039 sc 9.8888 -34.7857 tr
[ 1 0 0 1 26.50324699 86.78144965 ] co 0.63 sw 0 sj 10 sm np 0 0 m np
0.315 0 0.315 180 0 a 0.315 0 0.315 0 180 a cp s gr gs 13.1105 13.1039 sc
9.8888 -34.7857 tr [ 1 0 0 1 20.55055544 77.35991537 ] co 0.63 sw 0 sj 10 sm np
0 0 m np 0.315 0 0.315 180 0 a 0.315 0 0.315 0 180 a cp s gr gs
13.1105 13.1039 sc 9.8888 -34.7857 tr [ 1 0 0 1 39.6153837 69.4113284 ] co 
0.63 sw 0 sj 10 sm np 0 0 m np 0.315 0 0.315 180 0 a 0.315 0 0.315 0 180 a
cp s gr gs 13.1105 13.1039 sc 9.8888 -34.7857 tr
[ 1 0 0 1 30.67013121 75.37643433 ] co 0.63 sw 0 sj 10 sm np 0 0 m np
0.315 0 0.315 180 0 a 0.315 0 0.315 0 180 a cp s gr gs 13.1105 13.1039 sc
9.8888 -34.7857 tr [ 1 0 0 1 42.27787987 56.63253915 ] co 0.63 sw 0 sj 10 sm np
0 0 m np 0.315 0 0.315 180 0 a 0.315 0 0.315 0 180 a cp s gr gs
13.1105 13.1039 sc 9.8888 -34.7857 tr [ 1 0 0 1 53.63393165 57.24148373 ] co 
0.63 sw 0 sj 10 sm np 0 0 m np 0.315 0 0.315 180 0 a 0.315 0 0.315 0 180 a
cp s gr gs 13.1105 13.1039 sc 9.8888 -34.7857 tr
[ 1 0 0 1 67.54135327 58.3007712 ] co 0.63 sw 0 sj 10 sm np 0 0 m np
0.315 0 0.315 180 0 a 0.315 0 0.315 0 180 a cp s gr gs 13.1105 13.1039 sc
9.8888 -34.7857 tr [ 1 0 0 1 79.02673874 63.5434714 ] co 0.63 sw 0 sj 10 sm np
0 0 m np 0.315 0 0.315 180 0 a 0.315 0 0.315 0 180 a cp s gr gs
13.1105 13.1039 sc 9.8888 -34.7857 tr [ 1 0 0 1 91.9888388 59.71527728 ] co 
0.63 sw 0 sj 10 sm np 0 0 m np 0.315 0 0.315 180 0 a 0.315 0 0.315 0 180 a
cp s gr gs 13.1105 13.1039 sc 9.8888 -34.7857 tr
[ 1 0 0 1 107.75748827 63.27720042 ] co 0.63 sw 0 sj 10 sm np 0 0 m np
0.315 0 0.315 180 0 a 0.315 0 0.315 0 180 a cp s gr gs 13.1105 13.1039 sc
9.8888 -34.7857 tr [ 1 0 0 1 105.04475407 73.17726916 ] co 0.63 sw
0 sj 10 sm np 0 0 m np 0.315 0 0.315 180 0 a 0.315 0 0.315 0 180 a cp s gr gs
13.1105 13.1039 sc 9.8888 -34.7857 tr [ 1 0 0 1 105.08688396 86.08877724 ] co 
0.63 sw 0 sj 10 sm np 0 0 m np 0.315 0 0.315 180 0 a 0.315 0 0.315 0 180 a
cp s gr gs 13.1105 13.1039 sc 9.8888 -34.7857 tr
[ 1 0 0 1 30.72186757 100.51570431 ] co 0.63 sw 0 sj 10 sm np 0 0 m np
0.315 0 0.315 180 0 a 0.315 0 0.315 0 180 a cp s gr gs 13.1105 13.1039 sc
9.8888 -34.7857 tr [ 1 0 0 1 17.66751846 86.05974168 ] co 0.63 sw 0 sj 10 sm np
0 0 m np 0.315 0 0.315 180 0 a 0.315 0 0.315 0 180 a cp s gr gs
13.1105 13.1039 sc 9.8888 -34.7857 tr [ 1 0 0 1 17.13255874 73.6053952 ] co 
0.63 sw 0 sj 10 sm np 0 0 m np 0.315 0 0.315 180 0 a 0.315 0 0.315 0 180 a
cp s gr gs 13.1105 13.1039 sc 9.8888 -34.7857 tr
[ 1 0 0 1 23.94892804 68.92857795 ] co 0.63 sw 0 sj 10 sm np 0 0 m np
0.315 0 0.315 180 0 a 0.315 0 0.315 0 180 a cp s gr 784 853 m 647 759 l
536 861 l 481 681 l 365 671 l 403 557 l 358 508 l s 403 557 m 447 447 l
535 531 l cp s 403 557 m 481 681 l 535 531 l 649 611 l 481 681 l 647 759 l
649 611 l 816 702 l 651 756 l s 816 702 m 784 853 l s 816 702 m 946 799 l
947 610 l cp s 816 702 m 801 479 l 649 611 l 653 453 l 535 531 l 530 388 l
s 541 382 m 653 453 l 688 286 l 836 294 l 801 479 l 653 453 l
s 801 479 m 688 286 l s 801 479 m 930 413 l 947 610 l cp s 836 294 m 930 413 l
1019 308 l 1087 531 l 930 413 l s 947 610 m 1087 531 l 1080 772 l cp s
1080 772 m 1215 632 l 1243 792 l 1381 594 l 1405 821 l 1511 672 l 1381 594 l
1215 632 l 1087 531 l 1294 444 l 1215 632 l s 1294 444 m 1381 594 l 1510 503 l
1339 326 l cp s 1294 444 m 1510 503 l s 1546 373 m 1510 503 l 1511 672 l
s 1169 376 m 1087 531 l s 1294 444 m 1169 376 l 1019 308 l
s 1169 376 m 1339 326 l s 688 286 m 541 368 l s 1019 308 m 836 294 l
s 1169 376 m 1158 264 l s 1171 256 m 1339 326 l s 1146 253 m 1019 308 l
s 1339 326 m 1546 373 l s gs 13.1105 13.1039 sc 9.8888 -34.7857 tr
[ 1 0 0 1 36.81067275 51.81880566 ] co 0.63 sw 0 sj 10 sm np 0 0 m np
0.315 0 0.315 180 0 a 0.315 0 0.315 0 180 a cp s gr gs 13.1105 13.1039 sc
9.8888 -34.7857 tr [ 1 0 0 1 47.30643812 45.65840462 ] co 0.63 sw 0 sj 10 sm np
0 0 m np 0.315 0 0.315 180 0 a 0.315 0 0.315 0 180 a cp s gr gs
13.1105 13.1039 sc 9.8888 -34.7857 tr [ 1 0 0 1 60.50184943 49.75792036 ] co 
0.63 sw 0 sj 10 sm np 0 0 m np 0.315 0 0.315 180 0 a 0.315 0 0.315 0 180 a
cp s gr gs 13.1105 13.1039 sc 9.8888 -34.7857 tr
[ 1 0 0 1 95.07025682 54.1698562 ] co 0.63 sw 0 sj 10 sm np 0 0 m np
0.315 0 0.315 180 0 a 0.315 0 0.315 0 180 a cp s gr gs 13.1105 13.1039 sc
9.8888 -34.7857 tr [ 1 0 0 1 108.52374105 54.16614316 ] co 0.63 sw
0 sj 10 sm np 0 0 m np 0.315 0 0.315 180 0 a 0.315 0 0.315 0 180 a cp s gr
688 286 m 616 223 l s 753 142 m 688 286 l s 836 294 m 753 142 l
s 836 294 m 926 196 l 1019 308 l s 1339 326 m 1380 254 l 1546 373 l 1556 253 l
s gs 13.1105 13.1039 sc 9.8888 -34.7857 tr
[ 1 0 0 1 110.13731477 92.4691226 ] co 0.63 sw 0 sj 10 sm np 0 0 m np
0.315 0 0.315 180 0 a 0.315 0 0.315 0 180 a cp s gr gs 13.1105 13.1039 sc
9.8888 -34.7857 tr [ 1 0 0 1 117.98947274 81.67911382 ] co 0.63 sw
0 sj 10 sm np 0 0 m np 0.315 0 0.315 180 0 a 0.315 0 0.315 0 180 a cp s gr gs
13.1105 13.1039 sc 9.8888 -34.7857 tr [ 1 0 0 1 121.90863217 70.20794687 ] co 
0.63 sw 0 sj 10 sm np 0 0 m np 0.315 0 0.315 180 0 a 0.315 0 0.315 0 180 a
cp s gr gs 13.1105 13.1039 sc 9.8888 -34.7857 tr
[ 1 0 0 1 120.87619441 59.36030859 ] co 0.63 sw 0 sj 10 sm np 0 0 m np
0.315 0 0.315 180 0 a 0.315 0 0.315 0 180 a cp s gr 1511 672 m 1577 755 l
s 1511 672 m 1680 614 l 1510 503 l 1732 464 l 1546 373 l 1718 322 l
s 1132 194 m 1153 239 l s 1194 199 m 1166 240 l s 1194 199 m 1132 194 l
s 1132 188 m 1138 195 l s 1136 172 m 1157 196 l s 1154 173 m 1175 197 l
s 1173 174 m 1194 198 l s 1191 176 m 1196 181 l s 502 318 m 524 363 l
s 467 371 m 517 374 l s 462 367 m 471 365 l s 450 356 m 481 350 l
s 460 340 m 491 334 l s 470 325 m 502 319 l s 481 310 m 487 308 l
s 502 318 m 467 371 l s 536 861 m 365 671 l 358 508 l 447 447 l 520 383 l
s 536 363 m 616 223 l 753 142 l 926 196 l 1146 248 l s 1172 251 m 1380 254 l
1556 253 l 1718 322 l 1732 464 l 1680 614 l 1577 755 l 1405 821 l s
5 0 0 1 ACADColor 1405 821 m 1243 792 l 1080 772 l 946 799 l 784 853 l s
7 0 0 0 ACADColor 784 853 m 536 861 l s gs 13.1105 13.1039 sc
9.8888 -34.7857 tr [ 1 0 0 1 82.49264867 83.06314635 ] co 0.63 sw 0 sj 10 sm np
0 0 m np 0.315 0 0.315 180 0 a 0.315 0 0.315 0 180 a cp s gr
1405 821 m 1420 820 l s 1428 820 m 1442 820 l 1445 819 l
s 1453 818 m 1469 815 l s 1478 813 m 1493 808 l s 1501 805 m 1511 801 l
1516 798 l s 1523 794 m 1538 786 l s 1545 781 m 1558 771 l
s 1565 766 m 1576 757 l 1577 755 l s 1583 749 m 1595 737 l
s 1601 731 m 1605 727 l 1612 719 l s 1617 712 m 1627 699 l
s 1632 693 m 1642 679 l s 1646 672 m 1655 658 l s 1660 651 m 1668 636 l
s 1672 629 m 1679 617 l 1680 615 l s 1683 607 m 1690 592 l
s 1694 584 m 1698 576 l 1700 569 l s 1703 561 m 1709 546 l
s 1712 538 m 1713 535 l 1717 522 l s 1719 514 m 1724 498 l
s 1726 490 m 1729 474 l s 1731 466 m 1733 455 l 1734 449 l
s 1734 441 m 1736 424 l s 1737 416 m 1737 399 l s 1736 391 m 1736 383 l
1735 375 l s 1734 366 m 1731 352 l 1730 350 l s 1727 342 m 1721 327 l
s 1716 320 m 1707 306 l s 1701 301 m 1688 290 l s 1681 286 m 1666 278 l
s 1659 274 m 1643 269 l s 1635 266 m 1635 266 l 1619 262 l
s 1611 260 m 1603 259 l 1594 258 l s 1586 257 m 1570 255 l
s 1561 254 m 1545 253 l s 1536 252 m 1532 252 l 1520 252 l
s 1511 252 m 1495 251 l s 1487 251 m 1470 252 l s 1462 252 m 1450 252 l
1445 252 l s 1437 252 m 1420 253 l s 1412 253 m 1395 253 l
s 1387 253 m 1370 254 l s 1362 254 m 1361 254 l 1345 254 l
s 1337 254 m 1320 255 l s 1312 255 m 1295 255 l s 1287 255 m 1270 255 l
s 1262 255 m 1245 254 l s 1237 254 m 1220 253 l s 1212 253 m 1195 253 l
s 1187 252 m 1172 252 l 1172 252 l s 5 0 0 1 ACADColor 784 853 m 798 849 l
s 806 846 m 822 841 l s 830 838 m 846 833 l s 854 830 m 869 825 l
s 877 822 m 893 817 l s 901 814 m 917 809 l s 925 806 m 935 803 l 941 801 l
s 949 799 m 965 795 l s 973 793 m 989 788 l s 997 786 m 1011 782 l 1013 782 l
s 1021 780 m 1037 777 l s 1046 776 m 1049 775 l 1062 774 l
s 1070 773 m 1087 772 l s 1095 772 m 1112 772 l s 1120 772 m 1127 772 l
1137 773 l s 1145 774 m 1162 776 l s 1170 777 m 1186 780 l
s 1194 782 m 1211 785 l s 1219 787 m 1235 790 l s 1243 792 m 1247 793 l
1260 795 l s 1268 797 m 1284 801 l s 1292 803 m 1308 806 l
s 1316 808 m 1327 811 l 1333 812 l s 1341 813 m 1357 816 l
s 1366 817 m 1367 817 l 1382 819 l s 1391 819 m 1405 821 l 1405 821 l s
7 0 0 0 ACADColor np 583 932 m 585 965 l 594 934 l cp fi 589 933 m 596 875 l s
1 1 0 0 ACADColor np 800 926 m 815 956 l 811 923 l cp fi 805 924 m 784 853 l s
np 980 927 m 995 957 l 991 924 l cp fi 986 926 m 946 799 l s np 1084 920 m
1092 952 l 1095 919 l cp fi 1090 919 m 1080 772 l s np 1199 955 m 1197 988 l
1210 957 l cp fi 1205 956 m 1243 792 l s np 1393 1003 m 1398 1036 l 1404 1004 l
cp fi 1399 1004 m 1405 821 l s 7 0 0 0 ACADColor (font_l) ACADLayer
601 959 m 601 1011 l s 1230 906 m 1230 959 l s 890 985 m 890 1038 l
s 1189 697 m 1189 749 l s
showpage
%%Trailer
restore
%%DocumentFonts:
%%DocumentNeededFonts:
