%!PS-Adobe-2.0 EPSF-2.0
%%BoundingBox: 20 20 560 328
%%Title: Z:\home\svn\mueli-da\src_images\kurz_krag_acad.eps 
%%Creator: AutoCAD PSOUT
%%For:  , 
%%Pages: 1
%%DocumentFonts: (atend)
%%DocumentNeededFonts: (atend)
%%CreationDate: 2007-02-28
%%EndComments
save
20 20 translate
0.24 dup scale
0 setlinewidth
/ACADLayer  { pop } def
/ACADColor { setrgbcolor pop } def
/ACADLtype { pop
userdict /Linedict known not { /Linedict 100 dict def } if
1 index cvn Linedict exch known not {
mark 1 index { dup 0 eq { pop 1 72.0 div } if abs } forall
counttomark 2 add -1 roll astore exch pop
1 index cvn exch Linedict begin def end }
{ pop } ifelse 
Linedict begin cvx exec 0 setdash end } bind def
/bd{bind def}bind def /m{moveto}bd /l{lineto}bd /s{stroke}bd
/a{arc}bd /an{arcn}bd /gs{gsave}bd /gr{grestore}bd
/cp{closepath}bd /tr{translate}bd /sc{scale}bd /co{concat}bd
/ff{findfont}bd /sf{setfont}bd /sh{show}bd /np{newpath}bd
/sw{setlinewidth}bd /sj{setlinejoin}bd /sm{setmiterlimit}bd
/cl{clip}bd /fi{fill}bd
%%EndProlog
%%Page: 1 1
gs np -20 -20 m -20 1299 l  2269 1299 l 2269 -20 l cp cl np 7 0 0 0 ACADColor
(0) ACADLayer (_CONTINUOUS) [  ] (A) ACADLtype 729 166 m 1520 166 l 1520 957 l
729 957 l cp s 680 731 m 680 788 l s 680 731 m 729 759 l s 674 788 m 680 782 l
s 659 785 m 680 765 l s 659 769 m 680 748 l s 659 752 m 680 731 l
s 659 735 m 664 731 l s 674 195 m 680 189 l s 659 193 m 680 172 l
s 659 176 m 680 155 l s 659 159 m 680 139 l s 659 142 m 664 138 l
s 680 195 m 729 166 l s 680 138 m 680 195 l s 680 138 m 729 166 l
s 674 392 m 680 386 l s 659 390 m 680 370 l s 659 373 m 680 353 l
s 659 357 m 680 336 l s 659 340 m 664 336 l s 680 336 m 729 364 l
s 680 336 m 680 392 l 729 364 l s 674 590 m 680 584 l s 659 588 m 680 567 l
s 659 571 m 680 551 l s 659 554 m 680 534 l s 659 538 m 664 533 l
s 680 590 m 729 562 l s 680 533 m 680 590 l s 680 533 m 729 562 l
s 680 788 m 729 759 l s 680 928 m 729 957 l s 680 985 m 729 957 l
s 680 928 m 680 985 l s 674 985 m 680 979 l s 659 983 m 680 963 l
s 659 966 m 680 946 l s 659 950 m 680 929 l s 659 933 m 664 928 l
s 723 957 m 568 957 l s 723 166 m 568 166 l s 581 932 m 581 191 l s
np 577 932 m 585 932 l 581 957 l 581 957 l cp fi np 577 191 m 585 191 l
581 166 l 581 166 l cp fi 729 957 m 729 957 l s 729 166 m 729 166 l
s 581 166 m 581 166 l s 729 160 m 729 6 l s 1520 160 m 1520 6 l
s 754 18 m 1495 18 l s np 754 22 m 754 14 l 729 18 l 729 18 l cp fi
np 1495 22 m 1495 14 l 1520 18 l 1520 18 l cp fi 729 166 m 729 166 l
s 1520 166 m 1520 166 l s 1520 18 m 1520 18 l s 1520 1105 m 729 1105 l s
np 733 982 m 729 957 l 725 982 l cp fi 729 982 m 729 1105 l s np 773 982 m
769 957 l 765 982 l cp fi 769 982 m 769 1105 l s np 812 982 m 808 957 l
804 982 l cp fi 808 982 m 808 1105 l s np 852 982 m 848 957 l 844 982 l cp fi
848 982 m 848 1105 l s np 891 982 m 887 957 l 883 982 l cp fi
887 982 m 887 1105 l s np 931 982 m 927 957 l 923 982 l cp fi
927 982 m 927 1105 l s np 971 982 m 966 957 l 962 982 l cp fi
966 982 m 966 1105 l s np 1010 982 m 1006 957 l 1002 982 l cp fi
1006 982 m 1006 1105 l s np 1050 982 m 1046 957 l 1041 982 l cp fi
1046 982 m 1046 1105 l s np 1089 982 m 1085 957 l 1081 982 l cp fi
1085 982 m 1085 1105 l s np 1129 982 m 1125 957 l 1121 982 l cp fi
1125 982 m 1125 1105 l s np 1168 982 m 1164 957 l 1160 982 l cp fi
1164 982 m 1164 1105 l s np 1208 982 m 1204 957 l 1200 982 l cp fi
1204 982 m 1204 1105 l s np 1247 982 m 1243 957 l 1239 982 l cp fi
1243 982 m 1243 1105 l s np 1287 982 m 1283 957 l 1279 982 l cp fi
1283 982 m 1283 1105 l s np 1326 982 m 1322 957 l 1318 982 l cp fi
1322 982 m 1322 1105 l s np 1366 982 m 1362 957 l 1358 982 l cp fi
1362 982 m 1362 1105 l s np 1406 982 m 1401 957 l 1397 982 l cp fi
1401 982 m 1401 1105 l s np 1445 982 m 1441 957 l 1437 982 l cp fi
1441 982 m 1441 1105 l s np 1485 982 m 1481 957 l 1476 982 l cp fi
1481 982 m 1481 1105 l s np 1524 982 m 1520 957 l 1516 982 l cp fi
1520 982 m 1520 1105 l s np 725 1229 m 729 1253 l 733 1229 l cp fi
729 1229 m 729 1105 l s np 1644 170 m 1668 166 l 1644 162 l cp fi
1644 166 m 1520 166 l s (font_c) ACADLayer 1125 48 m 1125 87 l s
(font_r) ACADLayer 551 542 m 551 581 l s (font_l) ACADLayer
1540 1056 m 1540 1095 l s 1698 147 m 1698 186 l s (font_r) ACADLayer
709 1234 m 709 1273 l s (0) ACADLayer gs 9.887 9.882 sc 43.7997 -13.1184 tr
[ 1 0 0 1 30 110 ] co 0.25 sw 0 sj 10 sm np 0 0 m 0 -80 l 80 -80 l 80 0 l 0 0 l
s gr
showpage
%%Trailer
restore
%%DocumentFonts:
%%DocumentNeededFonts:
