%!PS-Adobe-2.0 EPSF-2.0
%%BoundingBox: 20 20 560 328
%%Title: Z:\home\svn\mueli-da\src_images\scheibe_loch_acad.eps 
%%Creator: AutoCAD PSOUT
%%For:  , 
%%Pages: 1
%%DocumentFonts: (atend)
%%DocumentNeededFonts: (atend)
%%CreationDate: 2007-02-28
%%EndComments
save
20 20 translate
0.24 dup scale
0 setlinewidth
/ACADLayer  { pop } def
/ACADColor { setrgbcolor pop } def
/ACADLtype { pop
userdict /Linedict known not { /Linedict 100 dict def } if
1 index cvn Linedict exch known not {
mark 1 index { dup 0 eq { pop 1 72.0 div } if abs } forall
counttomark 2 add -1 roll astore exch pop
1 index cvn exch Linedict begin def end }
{ pop } ifelse 
Linedict begin cvx exec 0 setdash end } bind def
/bd{bind def}bind def /m{moveto}bd /l{lineto}bd /s{stroke}bd
/a{arc}bd /an{arcn}bd /gs{gsave}bd /gr{grestore}bd
/cp{closepath}bd /tr{translate}bd /sc{scale}bd /co{concat}bd
/ff{findfont}bd /sf{setfont}bd /sh{show}bd /np{newpath}bd
/sw{setlinewidth}bd /sj{setlinejoin}bd /sm{setmiterlimit}bd
/cl{clip}bd /fi{fill}bd
%%EndProlog
%%Page: 1 1
gs np -20 -20 m -20 1299 l  2269 1299 l 2269 -20 l cp cl np 7 0 0 0 ACADColor
(0) ACADLayer (_CONTINUOUS) [  ] (A) ACADLtype 561 1203 m 561 76 l 1688 76 l
1688 1203 l cp s (_CENTER) [  9.525  -1.905  1.905  -1.905  ] (A) ACADLtype gs
14.0877 14.0806 sc 9.855 -24.5443 tr 70 115 m 70 25 l s gr gs
14.0877 14.0806 sc 9.855 -24.5443 tr 10 70 m 130 70 l s gr (_CONTINUOUS) [
 ] (A) ACADLtype gs 14.0877 14.0806 sc 9.855 -24.5443 tr
[ 1 0 0 1 70 70 ] co np 0 0 5 0 360 a s gr 1899 76 m 1899 1203 l
s 350 76 m 350 1203 l s np 385 1197 m 350 1203 l 385 1209 l cp fi
385 1203 m 561 1203 l s np 1864 1209 m 1899 1203 l 1864 1197 l cp fi
1864 1203 m 1688 1203 l s np 385 1141 m 350 1146 l 385 1152 l cp fi
385 1146 m 561 1146 l s np 1864 1152 m 1899 1146 l 1864 1141 l cp fi
1864 1146 m 1688 1146 l s np 385 1084 m 350 1090 l 385 1096 l cp fi
385 1090 m 561 1090 l s np 1864 1096 m 1899 1090 l 1864 1084 l cp fi
1864 1090 m 1688 1090 l s np 385 1028 m 350 1034 l 385 1040 l cp fi
385 1034 m 561 1034 l s np 1864 1040 m 1899 1034 l 1864 1028 l cp fi
1864 1034 m 1688 1034 l s np 385 972 m 350 977 l 385 983 l cp fi
385 977 m 561 977 l s np 1864 983 m 1899 977 l 1864 972 l cp fi
1864 977 m 1688 977 l s np 385 915 m 350 921 l 385 927 l cp fi
385 921 m 561 921 l s np 1864 927 m 1899 921 l 1864 915 l cp fi
1864 921 m 1688 921 l s np 385 859 m 350 865 l 385 871 l cp fi
385 865 m 561 865 l s np 1864 871 m 1899 865 l 1864 859 l cp fi
1864 865 m 1688 865 l s np 385 803 m 350 809 l 385 814 l cp fi
385 809 m 561 809 l s np 1864 814 m 1899 809 l 1864 803 l cp fi
1864 809 m 1688 809 l s np 385 746 m 350 752 l 385 758 l cp fi
385 752 m 561 752 l s np 1864 758 m 1899 752 l 1864 746 l cp fi
1864 752 m 1688 752 l s np 385 690 m 350 696 l 385 702 l cp fi
385 696 m 561 696 l s np 1864 702 m 1899 696 l 1864 690 l cp fi
1864 696 m 1688 696 l s np 385 634 m 350 640 l 385 645 l cp fi
385 640 m 561 640 l s np 1864 645 m 1899 640 l 1864 634 l cp fi
1864 640 m 1688 640 l s np 385 577 m 350 583 l 385 589 l cp fi
385 583 m 561 583 l s np 1864 589 m 1899 583 l 1864 577 l cp fi
1864 583 m 1688 583 l s np 385 521 m 350 527 l 385 533 l cp fi
385 527 m 561 527 l s np 1864 533 m 1899 527 l 1864 521 l cp fi
1864 527 m 1688 527 l s np 385 465 m 350 471 l 385 476 l cp fi
385 471 m 561 471 l s np 1864 476 m 1899 471 l 1864 465 l cp fi
1864 471 m 1688 471 l s np 385 408 m 350 414 l 385 420 l cp fi
385 414 m 561 414 l s np 1864 420 m 1899 414 l 1864 408 l cp fi
1864 414 m 1688 414 l s np 385 352 m 350 358 l 385 364 l cp fi
385 358 m 561 358 l s np 1864 364 m 1899 358 l 1864 352 l cp fi
1864 358 m 1688 358 l s np 385 296 m 350 302 l 385 307 l cp fi
385 302 m 561 302 l s np 1864 307 m 1899 302 l 1864 296 l cp fi
1864 302 m 1688 302 l s np 385 239 m 350 245 l 385 251 l cp fi
385 245 m 561 245 l s np 1864 251 m 1899 245 l 1864 239 l cp fi
1864 245 m 1688 245 l s np 385 183 m 350 189 l 385 195 l cp fi
385 189 m 561 189 l s np 1864 195 m 1899 189 l 1864 183 l cp fi
1864 189 m 1688 189 l s np 385 127 m 350 133 l 385 139 l cp fi
385 133 m 561 133 l s np 1864 139 m 1899 133 l 1864 127 l cp fi
1864 133 m 1688 133 l s np 385 70 m 350 76 l 385 82 l cp fi 385 76 m 561 76 l s
np 1864 82 m 1899 76 l 1864 70 l cp fi 1864 76 m 1688 76 l s (font_l) ACADLayer
1942 1146 m 1942 1203 l s (0) ACADLayer 1257 782 m 1196 717 l
s 1124 640 m 1172 691 l s np 1192 721 m 1201 713 l 1172 691 l 1172 691 l cp fi
1172 691 m 1172 691 l s 1124 640 m 1124 640 l s (font_r) ACADLayer
1237 780 m 1237 837 l s (0) ACADLayer gs 14.0877 14.0806 sc 9.855 -24.5443 tr
[ 1 0 0 1 30 110 ] co 0.25 sw 0 sj 10 sm np 0 0 m 0 -80 l 80 -80 l 80 0 l 0 0 l
s gr gs 14.0877 14.0806 sc 9.855 -24.5443 tr [ 1 0 0 1 70 75 ] co 0.25 sw
0 sj 10 sm np 0 0 m np 0 -5 5 90 270 a 0 -5 5 270 90 a s gr
showpage
%%Trailer
restore
%%DocumentFonts:
%%DocumentNeededFonts:
