%!PS-Adobe-2.0 EPSF-2.0
%%BoundingBox: 64 374 411 722
%%HiResBoundingBox: 64.536 374.096 410.892 721.716
%%Creator: dvips(k) 5.96 Copyright 2005 Radical Eye Software
%%Title: /afs/fest.tugraz.at/user/mueli/vcs/svn/mueli-da/src_images/img-temp350681/image.dvi
%%CreationDate: Mon Jul 21 17:31:23 2008
%%DocumentFonts: Times-Roman rtxmi Times-Italic
%%EndComments
%DVIPSWebPage: (www.radicaleye.com)
%DVIPSCommandLine: dvips -R0 -E -P pdf
%+ /afs/fest.tugraz.at/user/mueli/vcs/svn/mueli-da/src_images/img-temp350681/image.dvi
%+ -o
%+ /afs/fest.tugraz.at/user/mueli/vcs/svn/mueli-da/src_images/img-temp350681/image.ps
%DVIPSParameters: dpi=8000
%DVIPSSource:  TeX output 2008.07.21:1731
%%BeginProcSet: tex.pro 0 0
%!
/TeXDict 300 dict def TeXDict begin/N{def}def/B{bind def}N/S{exch}N/X{S
N}B/A{dup}B/TR{translate}N/isls false N/vsize 11 72 mul N/hsize 8.5 72
mul N/landplus90{false}def/@rigin{isls{[0 landplus90{1 -1}{-1 1}ifelse 0
0 0]concat}if 72 Resolution div 72 VResolution div neg scale isls{
landplus90{VResolution 72 div vsize mul 0 exch}{Resolution -72 div hsize
mul 0}ifelse TR}if Resolution VResolution vsize -72 div 1 add mul TR[
matrix currentmatrix{A A round sub abs 0.00001 lt{round}if}forall round
exch round exch]setmatrix}N/@landscape{/isls true N}B/@manualfeed{
statusdict/manualfeed true put}B/@copies{/#copies X}B/FMat[1 0 0 -1 0 0]
N/FBB[0 0 0 0]N/nn 0 N/IEn 0 N/ctr 0 N/df-tail{/nn 8 dict N nn begin
/FontType 3 N/FontMatrix fntrx N/FontBBox FBB N string/base X array
/BitMaps X/BuildChar{CharBuilder}N/Encoding IEn N end A{/foo setfont}2
array copy cvx N load 0 nn put/ctr 0 N[}B/sf 0 N/df{/sf 1 N/fntrx FMat N
df-tail}B/dfs{div/sf X/fntrx[sf 0 0 sf neg 0 0]N df-tail}B/E{pop nn A
definefont setfont}B/Cw{Cd A length 5 sub get}B/Ch{Cd A length 4 sub get
}B/Cx{128 Cd A length 3 sub get sub}B/Cy{Cd A length 2 sub get 127 sub}
B/Cdx{Cd A length 1 sub get}B/Ci{Cd A type/stringtype ne{ctr get/ctr ctr
1 add N}if}B/CharBuilder{save 3 1 roll S A/base get 2 index get S
/BitMaps get S get/Cd X pop/ctr 0 N Cdx 0 Cx Cy Ch sub Cx Cw add Cy
setcachedevice Cw Ch true[1 0 0 -1 -.1 Cx sub Cy .1 sub]{Ci}imagemask
restore}B/D{/cc X A type/stringtype ne{]}if nn/base get cc ctr put nn
/BitMaps get S ctr S sf 1 ne{A A length 1 sub A 2 index S get sf div put
}if put/ctr ctr 1 add N}B/I{cc 1 add D}B/bop{userdict/bop-hook known{
bop-hook}if/SI save N @rigin 0 0 moveto/V matrix currentmatrix A 1 get A
mul exch 0 get A mul add .99 lt{/QV}{/RV}ifelse load def pop pop}N/eop{
SI restore userdict/eop-hook known{eop-hook}if showpage}N/@start{
userdict/start-hook known{start-hook}if pop/VResolution X/Resolution X
1000 div/DVImag X/IEn 256 array N 2 string 0 1 255{IEn S A 360 add 36 4
index cvrs cvn put}for pop 65781.76 div/vsize X 65781.76 div/hsize X}N
/p{show}N/RMat[1 0 0 -1 0 0]N/BDot 260 string N/Rx 0 N/Ry 0 N/V{}B/RV/v{
/Ry X/Rx X V}B statusdict begin/product where{pop false[(Display)(NeXT)
(LaserWriter 16/600)]{A length product length le{A length product exch 0
exch getinterval eq{pop true exit}if}{pop}ifelse}forall}{false}ifelse
end{{gsave TR -.1 .1 TR 1 1 scale Rx Ry false RMat{BDot}imagemask
grestore}}{{gsave TR -.1 .1 TR Rx Ry scale 1 1 false RMat{BDot}
imagemask grestore}}ifelse B/QV{gsave newpath transform round exch round
exch itransform moveto Rx 0 rlineto 0 Ry neg rlineto Rx neg 0 rlineto
fill grestore}B/a{moveto}B/delta 0 N/tail{A/delta X 0 rmoveto}B/M{S p
delta add tail}B/b{S p tail}B/c{-4 M}B/d{-3 M}B/e{-2 M}B/f{-1 M}B/g{0 M}
B/h{1 M}B/i{2 M}B/j{3 M}B/k{4 M}B/w{0 rmoveto}B/l{p -4 w}B/m{p -3 w}B/n{
p -2 w}B/o{p -1 w}B/q{p 1 w}B/r{p 2 w}B/s{p 3 w}B/t{p 4 w}B/x{0 S
rmoveto}B/y{3 2 roll p a}B/bos{/SS save N}B/eos{SS restore}B end

%%EndProcSet
%%BeginProcSet: alt-rule.pro 0 0
%!
% Patch by TVZ
% Makes dvips files draw rules with stroke rather than fill.
% Makes narrow rules more predictable at low resolutions
% after distilling to PDF.
% May have unknown consequences for very thick rules.
% Tested only with dvips 5.85(k).
TeXDict begin
/QV {
  gsave newpath /ruleY X /ruleX X
  Rx Ry gt
  { ruleX ruleY Ry 2 div sub moveto Rx 0 rlineto Ry }
  { ruleX Rx 2 div add ruleY moveto 0 Ry neg rlineto Rx }
  ifelse
  setlinewidth 0 setlinecap stroke grestore
} bind def
end

%%EndProcSet
%%BeginProcSet: psfrag.pro 0 0
%%
%% This is file `psfrag.pro',
%% generated with the docstrip utility.
%%
%% The original source files were:
%%
%% psfrag.dtx  (with options: `filepro')
%% 
%% Copyright (c) 1996 Craig Barratt, Michael C. Grant, and David Carlisle.
%% All rights reserved.
%% 
%% This file is part of the PSfrag package.
%% 
userdict begin
/PSfragLib 90 dict def
/PSfragDict 6 dict def
/PSfrag { PSfragLib begin load exec end } bind def
end
PSfragLib begin
/RO /readonly      load def
/CP /currentpoint  load def
/CM /currentmatrix load def
/B { bind RO def } bind def
/X { exch def } B
/MD { { X } forall } B
/OE { end exec PSfragLib begin } B
/S false def
/tstr 8 string def
/islev2 { languagelevel } stopped { false } { 2 ge } ifelse def
[ /sM /tM /srcM /dstM /dM /idM /srcFM /dstFM ] { matrix def } forall
sM currentmatrix RO pop
dM defaultmatrix RO idM invertmatrix RO pop
srcFM identmatrix pop
/Hide { gsave { CP } stopped not newpath clip { moveto } if } B
/Unhide { { CP } stopped not grestore { moveto } if } B
/setrepl islev2 {{ /glob currentglobal def true setglobal array astore
                   globaldict exch /PSfrags exch put glob setglobal }}
                {{ array astore /PSfrags X }} ifelse B
/getrepl islev2 {{ globaldict /PSfrags get aload length }}
                {{ PSfrags aload length }} ifelse B
/convert {
   /src X src length string
   /c 0 def src length {
      dup c src c get dup 32 lt { pop 32 } if put /c c 1 add def
   } repeat
} B
/Begin {
    /saver save def
    srcFM exch 3 exch put
    0 ne /debugMode X 0 setrepl
    dup /S exch dict def { S 3 1 roll exch convert exch put } repeat
    srcM CM dup invertmatrix pop
    mark { currentdict { end } stopped { pop exit } if } loop
    PSfragDict counttomark { begin } repeat pop
} B
/End {
    mark { currentdict end dup PSfragDict eq { pop exit } if } loop
    counttomark { begin } repeat pop
    getrepl saver restore
    7 idiv dup /S exch dict def {
        6 array astore /mtrx X tstr cvs /K X
        S K [ S K known { S K get aload pop } if mtrx ] put
    } repeat
} B
/Place {
    tstr cvs /K X
    S K known {
        bind /proc X tM CM pop
        CP /cY X /cX X
        0 0 transform idtransform neg /aY X neg /aX X
        S K get dup length /maxiter X
        /iter 1 def {
            iter maxiter ne { /saver save def } if
            tM setmatrix aX aY translate
            [ exch aload pop idtransform ] concat
            cX neg cY neg translate cX cY moveto
            /proc load OE
            iter maxiter ne { saver restore /iter iter 1 add def } if
        } forall
        /noXY { CP /cY X /cX X } stopped def
        tM setmatrix noXY { newpath } { cX cY moveto } ifelse
    } {
        Hide OE Unhide
    } ifelse
} B
/normalize {
    2 index dup mul 2 index dup mul add sqrt div
    dup 4 -1 roll exch mul 3 1 roll mul
} B
/replace {
    aload pop MD
    CP /bY X /lX X gsave sM setmatrix
    str stringwidth abs exch abs add dup 0 eq
        { pop } { 360 exch div dup scale } ifelse
    lX neg bY neg translate newpath lX bY moveto
    str { /ch X ( ) dup 0 ch put false charpath ch Kproc } forall
    flattenpath pathbbox [ /uY /uX /lY /lX ] MD
    CP grestore moveto
    currentfont /FontMatrix get dstFM copy dup
    0 get 0 lt { uX lX /uX X /lX X } if
    3 get 0 lt { uY lY /uY X /lY X } if
    /cX uX lX add 0.5 mul def
    /cY uY lY add 0.5 mul def
    debugMode { gsave 0 setgray 1 setlinewidth
        lX lY moveto lX uY lineto uX uY lineto uX lY lineto closepath
        lX bY moveto uX bY lineto lX cY moveto uX cY lineto
        cX lY moveto cX uY lineto stroke
    grestore } if
    dstFM dup invertmatrix dstM CM srcM
    2 { dstM concatmatrix } repeat pop
    getrepl /temp X
        S str convert get {
            aload pop [ /rot /scl /loc /K ] MD
            /aX cX def /aY cY def
            loc {
                dup 66  eq { /aY bY def } { % B
                dup 98  eq { /aY lY def } { % b
                dup 108 eq { /aX lX def } { % l
                dup 114 eq { /aX uX def } { % r
                dup 116 eq { /aY uY def }   % t
                if } ifelse } ifelse } ifelse } ifelse pop
            } forall
            K srcFM rot tM rotate dstM
            2 { tM concatmatrix } repeat aload pop pop pop
            2 { scl normalize 4 2 roll } repeat
            aX aY transform
            /temp temp 7 add def
        } forall
    temp setrepl
} B
/Rif {
    S 3 index convert known { pop replace } { exch pop OE } ifelse
} B
/XA { bind [ /Kproc /str } B /XC { ] 2 array astore def } B
/xs   { pop } XA XC
/xks  { /kern load OE } XA /kern XC
/xas  { pop ax ay rmoveto } XA /ay /ax XC
/xws  { c eq { cx cy rmoveto } if } XA /c /cy /cx XC
/xaws { ax ay rmoveto c eq { cx cy rmoveto } if }
    XA /ay /ax /c /cy /cx XC
/raws { xaws { awidthshow } Rif } B
/rws  { xws { widthshow } Rif } B
/rks  { xks { kshow } Rif } B
/ras  { xas { ashow } Rif } B
/rs   { xs { show } Rif } B
/rrs { getrepl dup 2 add -1 roll //restore exec setrepl } B
PSfragDict begin
islev2 not { /restore { /rrs PSfrag } B } if
/show       { /rs   PSfrag } B
/kshow      { /rks  PSfrag } B
/ashow      { /ras  PSfrag } B
/widthshow  { /rws  PSfrag } B
/awidthshow { /raws PSfrag } B
end PSfragDict RO pop
end

%%EndProcSet
%%BeginProcSet: pstricks.pro 0 0
%!
% PostScript prologue for pstricks.tex.
% Version 1.01, 2006/01/11
% For distribution, see pstricks.tex.
%
/tx@Dict 200 dict def tx@Dict begin
/ADict 25 dict def
/CM { matrix currentmatrix } bind def
/SLW /setlinewidth load def
/CLW /currentlinewidth load def
/CP /currentpoint load def
/ED { exch def } bind def
/L /lineto load def
/T /translate load def
/TMatrix { } def
/RAngle { 0 } def
/Sqrt { dup 0 lt { pop 0 } { sqrt } ifelse } def  % return 0 for negative arguments 
/Atan { /atan load stopped { pop pop 0 } if } def % return 0 if atan not known
/ATAN1 {neg -1 atan 180 sub } def		% atan(x) (only one parameter)
/Div { dup 0 eq { pop } { div } ifelse } def  	% control the division
/NET { neg exch neg exch T } def	      	% change coordinate system to the negative one		
/Pyth { dup mul exch dup mul add sqrt } def   	% Pythagoras, epects 2 parameter
/PtoC { 2 copy cos mul 3 1 roll sin mul } def 	% Polar to Cartesian
%----------------- hv added 20050516 ---------------
/Pi 3.14159265359 def 
/TwoPi 6.28318530718 def
/Euler 2.71828182846 def 
/RadtoDeg { 180 mul Pi div } bind def % convert from radian to degrees
/DegtoRad { Pi mul 180 div } bind def % viceversa
%----------------- hv end---------------------------
/PathLength@ { /z z y y1 sub x x1 sub Pyth add def /y1 y def /x1 x def } def
/PathLength { flattenpath /z 0 def 
  { /y1 ED /x1 ED /y2 y1 def /x2 x1 def
  }{ /y ED /x ED PathLength@ } {} { /y y2 def /x x2 def PathLength@ }
  /pathforall load stopped { pop pop pop pop } if z } def
/STP { .996264 dup scale } def
/STV { SDict begin normalscale end STP  } def
%
%%-------------- DG begin patch 15 ---------------%%
%/DashLine { dup 0 gt { /a .5 def PathLength exch div } { pop /a 1 def
%PathLength } ifelse /b ED /x ED /y ED /z y x add def b a .5 sub 2 mul y
%mul sub z Div round z mul a .5 sub 2 mul y mul add b exch Div dup y mul
%/y ED x mul /x ED x 0 gt y 0 gt and { [ y x ] 1 a sub y mul } { [ 1 0 ]
%0 } ifelse setdash stroke } def
/DashLine {
  dup 0 gt { /a .5 def PathLength exch div } { pop /a 1 def PathLength } ifelse
  /b ED /x1 ED /y1 ED /x ED /y ED 
  /z y x add y1 add x1 add def
  /Coef b a .5 sub 2 mul y mul sub z Div round 
    z mul a .5 sub 2 mul y mul add b exch Div def 
  /y y Coef mul def 
  /x x Coef mul def 
  /y1 y1 Coef mul def 
  /x1 x1 Coef mul def
  x1 0 gt y1 0 gt or x 0 gt or y 0 gt and 
    { [ y x y1 x1 ] 1 a sub y mul }
    { [ 1 0 ] 0 } ifelse 
  setdash stroke
} def
%%-------------- DG end patch 15 ---------------%%
/DotLine { 
  /b PathLength def 
  /a ED /z ED /y CLW def 
  /z y z add def 
  a 0 gt { 
    /b b a div def 
  }{ 
    a 0 eq { 
      /b b y sub def 
    }{ a -3 eq { 
      /b b y add def } if 
    } ifelse 
  } ifelse 
  [ 0 b b z Div round Div dup 0 le { pop 1 } if ] 
  a 0 gt { 0 }{ y 2 div a -2 gt { neg }if } ifelse 
  setdash 1 setlinecap stroke 
} def
%
/LineFill { % hv ------------ patch 7 -------------
  gsave 
  abs /hatchWidthInc ED
  abs /hatchSepInc ED
  abs CLW add /a ED 
  a 0 dtransform round exch round exch
  2 copy idtransform 
  exch Atan rotate 
  idtransform pop /a ED 
  .25 .25 itransform pathbbox 
  /y2 ED 
  a Div ceiling cvi /x2 ED /y1 ED 
  a Div cvi /x1 ED /y2 y2 y1 sub def 
  clip 
  newpath 
  2 setlinecap 
  systemdict
  /setstrokeadjust known { true setstrokeadjust } if 
  x2 x1 sub 1 add { 
    x1 a mul y1 moveto 0 y2 rlineto stroke 
    /x1 x1 1 add 
      hatchWidthInc 0 gt { CLW add } if 
    def 
    hatchSepInc 0 gt hatchWidthInc 0 gt or { 
      /a a hatchSepInc add def
      CLW hatchWidthInc add SLW 
    } if
  } repeat 
  grestore 
  pop pop } def
%
%gsave abs CLW add /a ED a 0 dtransform round exch round exch
%2 copy idtransform exch Atan rotate idtransform pop /a ED .25 .25
%% DG/SR modification begin - Dec. 12, 1997 - Patch 2
%%itransform translate pathbbox /y2 ED a Div ceiling cvi /x2 ED /y1 ED a
%itransform pathbbox /y2 ED a Div ceiling cvi /x2 ED /y1 ED a
%% DG/SR modification end
%Div cvi /x1 ED /y2 y2 y1 sub def clip newpath 2 setlinecap systemdict
%/setstrokeadjust known { true setstrokeadjust } if x2 x1 sub 1 add { x1
%% DG/SR modification begin - Jun.  1, 1998 - Patch 3 (from Michael Vulis)
%% a mul y1 moveto 0 y2 rlineto stroke /x1 x1 1 add def } repeat grestore }
%% def
%a mul y1 moveto 0 y2 rlineto stroke /x1 x1 1 add def } repeat grestore
%pop pop } def
%% DG/SR modification end
%
/BeginArrow { ADict begin /@mtrx CM def gsave 2 copy T 2 index sub neg
exch 3 index sub exch Atan rotate newpath } def
/EndArrow { @mtrx setmatrix CP grestore end } def
/Arrow { CLW mul add dup 2 div /w ED mul dup /h ED mul /a ED { 0 h T 1 -1
scale } if w neg h moveto 0 0 L w h L w neg a neg rlineto gsave fill
grestore } def
/Tbar { CLW mul add /z ED z -2 div CLW 2 div moveto z 0 rlineto stroke 0
CLW moveto } def
/Bracket { CLW mul add dup CLW sub 2 div /x ED mul CLW add /y ED /z CLW 2
div def x neg y moveto x neg CLW 2 div L x CLW 2 div L x y L stroke 0
CLW moveto } def
/RoundBracket { CLW mul add dup 2 div /x ED mul /y ED /mtrx CM def 0 CLW
2 div T x y mul 0 ne { x y scale } if 1 1 moveto .85 .5 .35 0 0 0
curveto -.35 0 -.85 .5 -1 1 curveto mtrx setmatrix stroke 0 CLW moveto }
def
/SD { 0 360 arc fill } def
/EndDot { % DS is the dot size 
  { /z DS def } { /z 0 def } ifelse 
  /b ED 0 z DS SD b { 0 z DS CLW sub SD } if 
  0 DS z add CLW 4 div sub moveto } def
%
/Shadow { [ { /moveto load } { /lineto load } { /curveto load } {
  /closepath load } /pathforall load stopped { pop pop pop pop CP /moveto
  load } if ] cvx newpath 3 1 roll T exec } def
%
/NArray { aload length 2 div dup dup cvi eq not { exch pop } if /n exch
cvi def } def
/NArray { % holds the coordinates and on top of stack the showpoints boolean
  /f ED 
  counttomark 2 div dup cvi /n ED 
  n eq not { exch pop } if
  f { ] aload /Points ED } { n 2 mul 1 add -1 roll pop } ifelse 
} def
/Line { 
  NArray n 0 eq not 
    { n 1 eq { 0 0 /n 2 def } if ArrowA /n n 2 sub def 
      n { Lineto } repeat 
      CP 4 2 roll ArrowB L pop pop 
    } if 
} def
/Arcto { /a [ 6 -2 roll ] cvx def a r /arcto load stopped { 5 } { 4 }
  ifelse { pop } repeat a } def
/CheckClosed { dup n 2 mul 1 sub index eq 2 index n 2 mul 1 add index eq
  and { pop pop /n n 1 sub def } if } def
/Polygon { NArray n 2 eq { 0 0 /n 3 def } if n 3 lt { n { pop pop }
  repeat } { n 3 gt { CheckClosed } if n 2 mul -2 roll /y0 ED /x0 ED /y1
  ED /x1 ED x1 y1 /x1 x0 x1 add 2 div def /y1 y0 y1 add 2 div def x1 y1
  moveto /n n 2 sub def n { Lineto } repeat x1 y1 x0 y0 6 4 roll Lineto
  Lineto pop pop closepath } ifelse } def
/Diamond { 
  /mtrx CM def 
  T rotate 
  /h ED 
  /w ED 
  dup 0 eq { pop } { CLW mul neg 
    /d ED 
    /a w h Atan def 
    /h d a sin Div h add def 
    /w d a cos Div w add def } ifelse 
  mark w 2 div h 2 div w 0 0 h neg w neg 0 0 h w 2 div h 2 div 
  /ArrowA { moveto } def 
  /ArrowB { } def 
  false Line 
  closepath mtrx setmatrix } def
% DG modification begin - Jan. 15, 1997
%/Triangle { /mtrx CM def translate rotate /h ED 2 div /w ED dup 0 eq {
%pop } { CLW mul /d ED /h h d w h Atan sin Div sub def /w w d h w Atan 2
%div dup cos exch sin Div mul sub def } ifelse mark 0 d w neg d 0 h w d 0
%d /ArrowA { moveto } def /ArrowB { } def false Line closepath mtrx
%setmatrix } def
/Triangle { /mtrx CM def translate rotate /h ED 2 div /w ED dup
CLW mul /d ED /h h d w h Atan sin Div sub def /w w d h w Atan 2
div dup cos exch sin Div mul sub def mark 0 d w neg d 0 h w d 0
d /ArrowA { moveto } def /ArrowB { } def false Line closepath mtrx
% DG/SR modification begin - Jun.  1, 1998 - Patch 3 (from Michael Vulis)
% setmatrix } def
setmatrix pop } def
% DG/SR modification end
/CCA { /y ED /x ED 2 copy y sub /dy1 ED x sub /dx1 ED /l1 dx1 dy1 Pyth
def } def
/CCA { /y ED /x ED 2 copy y sub /dy1 ED x sub /dx1 ED /l1 dx1 dy1 Pyth
def } def
/CC { /l0 l1 def /x1 x dx sub def /y1 y dy sub def /dx0 dx1 def /dy0 dy1
def CCA /dx dx0 l1 c exp mul dx1 l0 c exp mul add def /dy dy0 l1 c exp
mul dy1 l0 c exp mul add def /m dx0 dy0 Atan dx1 dy1 Atan sub 2 div cos
abs b exp a mul dx dy Pyth Div 2 div def /x2 x l0 dx mul m mul sub def
/y2 y l0 dy mul m mul sub def /dx l1 dx mul m mul neg def /dy l1 dy mul
m mul neg def } def
/IC { /c c 1 add def c 0 lt { /c 0 def } { c 3 gt { /c 3 def } if }
ifelse /a a 2 mul 3 div 45 cos b exp div def CCA /dx 0 def /dy 0 def }
def
/BOC { IC CC x2 y2 x1 y1 ArrowA CP 4 2 roll x y curveto } def
/NC { CC x1 y1 x2 y2 x y curveto } def
/EOC { x dx sub y dy sub 4 2 roll ArrowB 2 copy curveto } def
/BAC { IC CC x y moveto CC x1 y1 CP ArrowA } def
/NAC { x2 y2 x y curveto CC x1 y1 } def
/EAC { x2 y2 x y ArrowB curveto pop pop } def
/OpenCurve { 
  NArray n 3 lt 
    { n { pop pop } repeat } 
    { BOC /n n 3 sub def n { NC } repeat EOC } ifelse 
} def
/AltCurve { { false NArray n 2 mul 2 roll [ n 2 mul 3 sub 1 roll ] aload
/Points ED n 2 mul -2 roll } { false NArray } ifelse n 4 lt { n { pop
pop } repeat } { BAC /n n 4 sub def n { NAC } repeat EAC } ifelse } def
/ClosedCurve { NArray n 3 lt { n { pop pop } repeat } { n 3 gt {
CheckClosed } if 6 copy n 2 mul 6 add 6 roll IC CC x y moveto n { NC }
repeat closepath pop pop } ifelse } def
/SQ { /r ED r r moveto r r neg L r neg r neg L r neg r L fill } def
/ST { /y ED /x ED x y moveto x neg y L 0 x L fill } def
/SP { /r ED gsave 0 r moveto 4 { 72 rotate 0 r L } repeat fill grestore }
def
/FontDot { DS 2 mul dup matrix scale matrix concatmatrix exch matrix
rotate matrix concatmatrix exch findfont exch makefont setfont } def
/Rect { x1 y1 y2 add 2 div moveto x1 y2 lineto x2 y2 lineto x2 y1 lineto
x1 y1 lineto closepath } def
/OvalFrame { x1 x2 eq y1 y2 eq or { pop pop x1 y1 moveto x2 y2 L } { y1
y2 sub abs x1 x2 sub abs 2 copy gt { exch pop } { pop } ifelse 2 div
exch { dup 3 1 roll mul exch } if 2 copy lt { pop } { exch pop } ifelse
/b ED x1 y1 y2 add 2 div moveto x1 y2 x2 y2 b arcto x2 y2 x2 y1 b arcto
x2 y1 x1 y1 b arcto x1 y1 x1 y2 b arcto 16 { pop } repeat closepath }
ifelse } def
/Frame { CLW mul /a ED 3 -1 roll 2 copy gt { exch } if a sub /y2 ED a add
/y1 ED 2 copy gt { exch } if a sub /x2 ED a add /x1 ED 1 index 0 eq {
pop pop Rect } { OvalFrame } ifelse } def
/BezierNArray { /f ED counttomark 2 div dup cvi /n ED n eq not { exch pop
} if n 1 sub neg 3 mod 3 add 3 mod { 0 0 /n n 1 add def } repeat f { ]
aload /Points ED } { n 2 mul 1 add -1 roll pop } ifelse } def
/OpenBezier { BezierNArray n 1 eq { pop pop } { ArrowA n 4 sub 3 idiv { 6
2 roll 4 2 roll curveto } repeat 6 2 roll 4 2 roll ArrowB curveto }
ifelse } def
/ClosedBezier { BezierNArray n 1 eq { pop pop } { moveto n 1 sub 3 idiv {
6 2 roll 4 2 roll curveto } repeat closepath } ifelse } def
/BezierShowPoints { gsave Points aload length 2 div cvi /n ED moveto n 1
sub { lineto } repeat CLW 2 div SLW [ 4 4 ] 0 setdash stroke grestore }
def
/Parab { /y0 exch def /x0 exch def /y1 exch def /x1 exch def /dx x0 x1
sub 3 div def /dy y0 y1 sub 3 div def x0 dx sub y0 dy add x1 y1 ArrowA
x0 dx add y0 dy add x0 2 mul x1 sub y1 ArrowB curveto /Points [ x1 y1 x0
y0 x0 2 mul x1 sub y1 ] def } def
/Grid { newpath /a 4 string def /b ED /c ED /n ED cvi dup 1 lt { pop 1 }
if /s ED s div dup 0 eq { pop 1 } if /dy ED s div dup 0 eq { pop 1 } if
/dx ED dy div round dy mul /y0 ED dx div round dx mul /x0 ED dy div
round cvi /y2 ED dx div round cvi /x2 ED dy div round cvi /y1 ED dx div
round cvi /x1 ED /h y2 y1 sub 0 gt { 1 } { -1 } ifelse def /w x2 x1 sub
0 gt { 1 } { -1 } ifelse def b 0 gt { /z1 b 4 div CLW 2 div add def
/Helvetica findfont b scalefont setfont /b b .95 mul CLW 2 div add def }
if systemdict /setstrokeadjust known { true setstrokeadjust /t { } def }
{ /t { transform 0.25 sub round 0.25 add exch 0.25 sub round 0.25 add
exch itransform } bind def } ifelse gsave n 0 gt { 1 setlinecap [ 0 dy n
div ] dy n div 2 div setdash } { 2 setlinecap } ifelse /i x1 def /f y1
dy mul n 0 gt { dy n div 2 div h mul sub } if def /g y2 dy mul n 0 gt {
dy n div 2 div h mul add } if def x2 x1 sub w mul 1 add dup 1000 gt {
pop 1000 } if { i dx mul dup y0 moveto b 0 gt { gsave c i a cvs dup
stringwidth pop /z2 ED w 0 gt {z1} {z1 z2 add neg} ifelse h 0 gt {b neg}
{z1} ifelse rmoveto show grestore } if dup t f moveto g t L stroke /i i
w add def } repeat grestore gsave n 0 gt
% DG/SR modification begin - Nov. 7, 1997 - Patch 1
%{ 1 setlinecap [ 0 dx n div ] dy n div 2 div setdash }
{ 1 setlinecap [ 0 dx n div ] dx n div 2 div setdash }
% DG/SR modification end
{ 2 setlinecap } ifelse /i y1 def /f x1 dx mul
n 0 gt { dx n div 2 div w mul sub } if def /g x2 dx mul n 0 gt { dx n
div 2 div w mul add } if def y2 y1 sub h mul 1 add dup 1000 gt { pop
1000 } if { newpath i dy mul dup x0 exch moveto b 0 gt { gsave c i a cvs
dup stringwidth pop /z2 ED w 0 gt {z1 z2 add neg} {z1} ifelse h 0 gt
{z1} {b neg} ifelse rmoveto show grestore } if dup f exch t moveto g
exch t L stroke /i i h add def } repeat grestore } def
/ArcArrow { /d ED /b ED /a ED gsave newpath 0 -1000 moveto clip newpath 0
1 0 0 b grestore c mul /e ED pop pop pop r a e d PtoC y add exch x add
exch r a PtoC y add exch x add exch b pop pop pop pop a e d CLW 8 div c
mul neg d } def
/Ellipse { /mtrx CM def T scale 0 0 1 5 3 roll arc mtrx setmatrix } def
%
/ArcAdjust { %%%% Vincent Guirardel
% given a target length (targetLength) and an initial angle (angle0) [in the stack],
% let  M(angle0)=(rx*cos(angle0),ry*sin(angle0))=(x0,y0).
% This computes an angle t such that (x0,y0) is at distance 
% targetLength from the point M(t)=(rx*cos(t),ry*sin(t)).
% NOTE: this an absolute angle, it does not have to be added or substracted to angle0
% contrary to TvZ's code.
% To achieve, this, one iterates the following process: start with some angle t,
% compute the point M' at distance targetLength of (x0,y0) on the semi-line [(x0,y0) M(t)].
% Now take t' (= new angle) so that (0,0) M(t') and M' are aligned.
%
% Another difference with TvZ's code is that we need d (=add/sub) to be defined.
% the value of d = add/sub is used to know on which side we have to move.
% It is only used in the initialisation of the angle before the iteration.
%
%%%%%%%%%%%%%%%%%%%%%%%%%%%%%%%%%%%%%%%%%%%%%%%%%%%%%%%%%%%%%%%%
% Input stack:  1: target length 2: initial angle
% variables used : rx, ry, d (=add/sub)
%
  /targetLength ED /angle0 ED
  /x0 rx angle0 cos mul def
  /y0 ry angle0 sin mul def
% we are looking for an angle t such that (x0,y0) is at distance targetLength 
% from the point M(t)=(rx*cos(t),ry*sin(t)))
%initialisation of angle (using 1st order approx = TvZ's code)
  targetLength 57.2958 mul
  angle0 sin rx mul dup mul
  angle0 cos ry mul dup mul
  add sqrt div 
% if initialisation angle is two large (more than 90 degrees) set it to 90 degrees
% (if the ellipse is very curved at the point where we draw the arrow, %
% the value can be much more than 360 degrees !)
% this should avoid going on the wrong side (more than 180 degrees) or go near
% a bad attractive point (at 180 degrees)
  dup 90 ge { pop 90 } if 
  angle0 exch d % add or sub
% maximum number of times to iterate the iterative procedure:
% iterative procedure: takes an angle t on top of stack, computes a 
% better angle (and put it on top of stack)
  30 { dup
% compute distance D between (x0,y0) and M(t)
    dup cos rx mul x0 sub dup mul exch sin ry mul y0 sub dup mul add sqrt
% if D almost equals targetLength, we stop
    dup targetLength sub abs 1e-5 le { pop exit } if
% stack now contains D t
% compute the point M(t') at distance targetLength of (x0,y0) on the semi-line [(x0,y0) M(t)]:
% M(t')= ( (x(t)-x0)*targetLength/d+x0 , (y(t)-y0)*targetLength/d+y0 )
    exch dup cos rx mul x0 sub  exch sin ry mul y0 sub
% stack contains:  y(t)-y0, x(t)-x0, d
    2 index Div targetLength mul y0 add ry Div exch
    2 index Div targetLength mul x0 add rx Div
% stack contains x(t')/rx , y(t')/ry , d
% now compute t', and remove D from stack
    atan exch pop
  } repeat
% we don't look at what happened... in particular, if targetLength is greater 
% than the diameter of the ellipse...
% the final angle will be around /angle0 + 180. maybe we should treat this pathological case...
% after iteration, stack contains an angle t such that M(t) is the tail of the arrow
% to give back the result as a an angle relative to angle0 we could add the following line:
% angle0 sub 0 exch d
%
% begin bug fix 2006-01-11
% we want to adjust the new angle t' by a multiple of 360 so that  | t'-angle0 | <= 180
%(we don't want to make the ellipse turn more or less than it should)...
dup angle0 sub dup abs 180 gt { 180 add 360 div floor 360 mul sub } { pop } ifelse
% end bug fix
} def
%
/EllipticArcArrow {
  /d ED      % add/sub
  /b ED      % arrow procedure
  /a1 ED     % angle
  gsave
  newpath
  0 -1000 moveto
  clip                  % Set clippath far from arrow.
  newpath
  0 1 0 0 b             % Draw arrow to determine length.
  grestore
% Length of arrow is on top of stack. Next 3 numbers are junk.
%
  a1 exch ArcAdjust   % Angular position of base of arrow.
  /a2 ED
  pop pop pop
  a2 cos rx mul x add
  a2 sin ry mul y add
  a1 cos rx mul x add
  a1 sin ry mul y add
% Now arrow tip coor and base coor are on stack.
  b pop pop pop pop       % Draw arrow, and discard coordinates.
  a2 CLW 8 div
% change value of d (test it by looking if  `` 1 1 d '' gives 2 or not )
  1 1 d 2 eq { /d { sub } def } { /d { add } def } ifelse
  ArcAdjust
% resets original value of d
  1 1 d 2 eq { /d { sub } def } { /d { add } def } ifelse  % Adjust angle to give overlap.
} def
%%------------------ tvz/DG/hv (2004-05-10) end -------------------%%
%
/Rot { CP CP translate 3 -1 roll neg rotate NET  } def
/RotBegin { tx@Dict /TMatrix known not { /TMatrix { } def /RAngle { 0 }
def } if /TMatrix [ TMatrix CM ] cvx def /a ED a Rot /RAngle [ RAngle
dup a add ] cvx def } def
/RotEnd { /TMatrix [ TMatrix setmatrix ] cvx def /RAngle [ RAngle pop ]
cvx def } def
/PutCoor { gsave CP T CM STV exch exec moveto setmatrix CP grestore } def
/PutBegin { /TMatrix [ TMatrix CM ] cvx def CP 4 2 roll T moveto } def
/PutEnd { CP /TMatrix [ TMatrix setmatrix ] cvx def moveto } def
/Uput { /a ED add 2 div /h ED 2 div /w ED /s a sin def /c a cos def /b s
abs c abs 2 copy gt dup /q ED { pop } { exch pop } ifelse def /w1 c b
div w mul def /h1 s b div h mul def q { w1 abs w sub dup c mul abs } {
h1 abs h sub dup s mul abs } ifelse } def
/UUput { /z ED abs /y ED /x ED q { x s div c mul abs y gt } { x c div s
mul abs y gt } ifelse { x x mul y y mul sub z z mul add sqrt z add } { q
{ x s div } { x c div } ifelse abs } ifelse a PtoC h1 add exch w1 add
exch } def
/BeginOL { dup (all) eq exch TheOL eq or { IfVisible not { Visible
/IfVisible true def } if } { IfVisible { Invisible /IfVisible false def
} if } ifelse } def
/InitOL { /OLUnit [ 3000 3000 matrix defaultmatrix dtransform ] cvx def
/Visible { CP OLUnit idtransform T moveto } def /Invisible { CP OLUnit
neg exch neg exch idtransform T moveto } def /BOL { BeginOL } def
/IfVisible true def } def
end
% END pstricks.pro

%%EndProcSet
%%BeginProcSet: pst-dots.pro 0 0
%!
%% PostScript prologue for pstricks.tex.
%% Version 2.00,                                    Suggestion of 2006/12/19
%% For distribution, see pstricks.tex.
%%
%% Timothy Van Zandt <tvz@Princeton.EDU>
%%
%% Modified by Etienne Riga  - Dec. 16, 1999
%% Modified by Herbert Voss (hv) - 2004/12/27 
%% Modified by Etienne Riga  - 2005/01/01 (er)
%% to add /Diamond, /SolidDiamond and /BoldDiamond
%
10 dict dup begin
  /FontType 3 def
  /FontMatrix [.001 0 0 .001 0 0] def
  /FontBBox [-571.5 -742.5 571.5 742.5] def
%  /FontBBox [-1000 -1000 1000 1000] def
%                See end of file in /BuildGlyph
  /Encoding 256 array def
  0 1 255 {Encoding exch/.notdef put} for
  Encoding
    dup (b) 0 get /Bullet put
    dup (c) 0 get /Circle put
    dup (C) 0 get /BoldCircle put
    dup (u) 0 get /SolidTriangle put
    dup (t) 0 get /Triangle put
    dup (T) 0 get /BoldTriangle put
    dup (r) 0 get /SolidSquare put
    dup (s) 0 get /Square put
    dup (S) 0 get /BoldSquare put
    dup (q) 0 get /SolidPentagon put
    dup (p) 0 get /Pentagon put
    dup (P) 0 get /BoldPentagon put
%%%		  
    dup (k) 0 get /Asterisk put
    dup (K) 0 get /BoldAsterisk put
    dup (J) 0 get /SolidAsterisk put
    dup (h) 0 get /Hexagon put
    dup (H) 0 get /BoldHexagon put
    dup (G) 0 get /SolidHexagon put
    dup (a) 0 get /Add put
    dup (A) 0 get /BoldAdd put
    dup (x) 0 get /Mul put
    dup (X) 0 get /BoldMul put
    dup (m) 0 get /Oplus put
    dup (M) 0 get /BOplus put
    dup (e) 0 get /SolidOplus put
    dup (n) 0 get /Otimes put
    dup (N) 0 get /BOtimes put
    dup (E) 0 get /SolidOtimes put
    dup (i) 0 get /Bar put
    dup (I) 0 get /BoldBar put
    dup (l) 0 get /SolidDiamond put
    dup (d) 0 get /Diamond put
        (D) 0 get /BoldDiamond put
%%%  
/CharProcs 47 dict def
  CharProcs begin
    /CirclePath {0 0 500 0 360 arc closepath} def
      /Bullet {CirclePath fill} def
	  /Circle {CirclePath .9 .9 scale CirclePath eofill} def
	  /BoldCircle {CirclePath .8 .8 scale CirclePath eofill} def
    /TrianglePath {0 660 moveto -571.5 -330 lineto 571.5 -330 lineto
		closepath} def
	  /SolidTriangle {TrianglePath fill} def
      /Triangle {TrianglePath .85 .85 scale TrianglePath eofill} def
      /BoldTriangle {TrianglePath .7 .7 scale TrianglePath eofill} def
    /SquarePath {-450 450 moveto 450 450 lineto 450 -450 lineto -450 -450 lineto
		closepath} def
      /SolidSquare {SquarePath fill} def
      /Square {SquarePath .89 .89 scale SquarePath eofill} def
      /BoldSquare {SquarePath .78 .78 scale SquarePath eofill} def
    /PentagonPath {-337.8 -465 moveto 337.8 -465 lineto 546.6 177.6 lineto
		0 574.7 lineto -546.6 177.6 lineto closepath} def
      /SolidPentagon {PentagonPath fill} def
      /Pentagon {PentagonPath .89 .89 scale PentagonPath eofill} def
      /BoldPentagon {PentagonPath .78 .78 scale PentagonPath eofill} def
%-------------- hv begin 2004/07/25   from: er 2003/03/24
    /HexagonPath {0 550 moveto -476 275 lineto -476 -275 lineto
		0 -550 lineto 476 -275 lineto 476 275 lineto closepath} def
      /SolidHexagon {HexagonPath fill} def
      /Hexagon {HexagonPath .89 .89 scale HexagonPath eofill} def
      /BoldHexagon {HexagonPath .79 .79 scale HexagonPath eofill} def
	/AsteriskPath {20 0 moveto 10 250 180 500 0 500 curveto
		-180 500 -10 250 -20 0 curveto closepath} def
      /Asterisk {AsteriskPath 60 rotate AsteriskPath 60 rotate AsteriskPath
	    60 rotate AsteriskPath 60 rotate AsteriskPath 60 rotate AsteriskPath 
		fill} def
	/Basterp {50 250 220 500 0 500 curveto
        -220 500 -50 250 -50 30 cos 100 mul curveto} def
	/BoldAsteriskPath {50 30 cos 100 mul moveto  Basterp
                     60 rotate Basterp 60 rotate Basterp
                     60 rotate Basterp 60 rotate Basterp
                     60 rotate Basterp closepath} def
      /BoldAsterisk {BoldAsteriskPath fill} def
	  /SolidAsterisk {CirclePath .9 .9 scale BoldAsteriskPath eofill} def
    /CrossPath {40 550 moveto -40 550 lineto -40 40 lineto -550 40 lineto
        -550 -40 lineto -40 -40 lineto -40 -550 lineto 40 -550 lineto 
		40 -40 lineto 550 -40 lineto 550 40 lineto 40 40 lineto closepath} def
    /BoldCrossPath {80 550 moveto -80 550 lineto -80 80 lineto -550 80 lineto
        -550 -80 lineto -80 -80 lineto -80 -550 lineto 80 -550 lineto 
		80 -80 lineto 550 -80 lineto 550 80 lineto 80 80 lineto closepath} def
      /Add {CrossPath fill} def
      /Mul {45 rotate CrossPath fill} def
      /BoldAdd {BoldCrossPath fill} def
      /BoldMul {45 rotate BoldCrossPath fill} def
	  /Oplus {CirclePath .9 .9 scale CirclePath eofill
		.775 .775 scale CrossPath  fill} def 
	  /SolidOplus {CirclePath .775 .775 scale BoldCrossPath eofill} def 
	  /BOplus {CirclePath .8 .8 scale CirclePath eofill
		.775 .775 scale BoldCrossPath fill} def 
	  /Otimes {CirclePath .9 .9 scale CirclePath eofill
		45 rotate .775 .775 scale CrossPath fill} def 
	  /BOtimes {CirclePath .8 .8 scale CirclePath eofill
		45 rotate .775 .775 scale BoldCrossPath  fill } def 
	  /SolidOtimes {CirclePath 45 rotate .775 .775 scale BoldCrossPath eofill} def 
    /BarPath {40 660 moveto -40 660 lineto -40 -660 lineto 40 -660 lineto
		closepath} def
      /Bar {BarPath fill} def
    /BoldBarPath {80 660 moveto -80 660 lineto -80 -660 lineto 80 -660 lineto
		closepath} def
      /BoldBar {BoldBarPath fill} def
    /DiamondPath {0 742.5 moveto -428.5 0 lineto 0 -742.5 lineto 
		428.5 0 lineto closepath} def
      /SolidDiamond {DiamondPath fill} def
      /Diamond {DiamondPath .865 .865 scale DiamondPath eofill} def
      /BoldDiamond {DiamondPath .73 .73 scale DiamondPath eofill} def
%%%
    /.notdef { } def
  end
  /BuildGlyph {
    exch
    begin
%      Metrics 1 index get exec 0
       0 0
%      BBoxes 3 index get exec
      -1000 -1000 1000 1000
%     -571.5 -742.5 571.5 742.5
      setcachedevice
      CharProcs begin load exec end
    end
  } def
  /BuildChar {
    1 index /Encoding get exch get
    1 index /BuildGlyph get exec
  } bind def
end
/PSTricksDotFont exch definefont pop


%%EndProcSet
%%BeginProcSet: 8r.enc 0 0
% File 8r.enc  TeX Base 1 Encoding  Revision 2.0  2002-10-30
%
% @@psencodingfile@{
%   author    = "S. Rahtz, P. MacKay, Alan Jeffrey, B. Horn, K. Berry,
%                W. Schmidt, P. Lehman",
%   version   = "2.0",
%   date      = "27nov06",
%   filename  = "8r.enc",
%   email     = "tex-fonts@@tug.org",
%   docstring = "This is the encoding vector for Type1 and TrueType
%                fonts to be used with TeX.  This file is part of the
%                PSNFSS bundle, version 9"
% @}
% 
% The idea is to have all the characters normally included in Type 1 fonts
% available for typesetting. This is effectively the characters in Adobe
% Standard encoding, ISO Latin 1, Windows ANSI including the euro symbol,
% MacRoman, and some extra characters from Lucida.
% 
% Character code assignments were made as follows:
% 
% (1) the Windows ANSI characters are almost all in their Windows ANSI
% positions, because some Windows users cannot easily reencode the
% fonts, and it makes no difference on other systems. The only Windows
% ANSI characters not available are those that make no sense for
% typesetting -- rubout (127 decimal), nobreakspace (160), softhyphen
% (173). quotesingle and grave are moved just because it's such an
% irritation not having them in TeX positions.
% 
% (2) Remaining characters are assigned arbitrarily to the lower part
% of the range, avoiding 0, 10 and 13 in case we meet dumb software.
% 
% (3) Y&Y Lucida Bright includes some extra text characters; in the
% hopes that other PostScript fonts, perhaps created for public
% consumption, will include them, they are included starting at 0x12.
% These are /dotlessj /ff /ffi /ffl.
% 
% (4) hyphen appears twice for compatibility with both ASCII and Windows.
%
% (5) /Euro was assigned to 128, as in Windows ANSI
%
% (6) Missing characters from MacRoman encoding incorporated as follows:
%
%     PostScript      MacRoman        TeXBase1
%     --------------  --------------  --------------
%     /notequal       173             0x16
%     /infinity       176             0x17
%     /lessequal      178             0x18
%     /greaterequal   179             0x19
%     /partialdiff    182             0x1A
%     /summation      183             0x1B
%     /product        184             0x1C
%     /pi             185             0x1D
%     /integral       186             0x81
%     /Omega          189             0x8D
%     /radical        195             0x8E
%     /approxequal    197             0x8F
%     /Delta          198             0x9D
%     /lozenge        215             0x9E
%
/TeXBase1Encoding [
% 0x00
 /.notdef /dotaccent /fi /fl
 /fraction /hungarumlaut /Lslash /lslash
 /ogonek /ring /.notdef /breve
 /minus /.notdef /Zcaron /zcaron
% 0x10
 /caron /dotlessi /dotlessj /ff
 /ffi /ffl /notequal /infinity
 /lessequal /greaterequal /partialdiff /summation
 /product /pi /grave /quotesingle
% 0x20
 /space /exclam /quotedbl /numbersign
 /dollar /percent /ampersand /quoteright
 /parenleft /parenright /asterisk /plus
 /comma /hyphen /period /slash
% 0x30
 /zero /one /two /three
 /four /five /six /seven
 /eight /nine /colon /semicolon
 /less /equal /greater /question
% 0x40
 /at /A /B /C
 /D /E /F /G
 /H /I /J /K
 /L /M /N /O
% 0x50
 /P /Q /R /S
 /T /U /V /W
 /X /Y /Z /bracketleft
 /backslash /bracketright /asciicircum /underscore
% 0x60
 /quoteleft /a /b /c
 /d /e /f /g
 /h /i /j /k
 /l /m /n /o
% 0x70
 /p /q /r /s
 /t /u /v /w
 /x /y /z /braceleft
 /bar /braceright /asciitilde /.notdef
% 0x80
 /Euro /integral /quotesinglbase /florin
 /quotedblbase /ellipsis /dagger /daggerdbl
 /circumflex /perthousand /Scaron /guilsinglleft
 /OE /Omega /radical /approxequal
% 0x90
 /.notdef /.notdef /.notdef /quotedblleft
 /quotedblright /bullet /endash /emdash
 /tilde /trademark /scaron /guilsinglright
 /oe /Delta /lozenge /Ydieresis
% 0xA0
 /.notdef /exclamdown /cent /sterling
 /currency /yen /brokenbar /section
 /dieresis /copyright /ordfeminine /guillemotleft
 /logicalnot /hyphen /registered /macron
% 0xB0
 /degree /plusminus /twosuperior /threesuperior
 /acute /mu /paragraph /periodcentered
 /cedilla /onesuperior /ordmasculine /guillemotright
 /onequarter /onehalf /threequarters /questiondown
% 0xC0
 /Agrave /Aacute /Acircumflex /Atilde
 /Adieresis /Aring /AE /Ccedilla
 /Egrave /Eacute /Ecircumflex /Edieresis
 /Igrave /Iacute /Icircumflex /Idieresis
% 0xD0
 /Eth /Ntilde /Ograve /Oacute
 /Ocircumflex /Otilde /Odieresis /multiply
 /Oslash /Ugrave /Uacute /Ucircumflex
 /Udieresis /Yacute /Thorn /germandbls
% 0xE0
 /agrave /aacute /acircumflex /atilde
 /adieresis /aring /ae /ccedilla
 /egrave /eacute /ecircumflex /edieresis
 /igrave /iacute /icircumflex /idieresis
% 0xF0
 /eth /ntilde /ograve /oacute
 /ocircumflex /otilde /odieresis /divide
 /oslash /ugrave /uacute /ucircumflex
 /udieresis /yacute /thorn /ydieresis
] def


%%EndProcSet
%%BeginProcSet: texps.pro 0 0
%!
TeXDict begin/rf{findfont dup length 1 add dict begin{1 index/FID ne 2
index/UniqueID ne and{def}{pop pop}ifelse}forall[1 index 0 6 -1 roll
exec 0 exch 5 -1 roll VResolution Resolution div mul neg 0 0]FontType 0
ne{/Metrics exch def dict begin Encoding{exch dup type/integertype ne{
pop pop 1 sub dup 0 le{pop}{[}ifelse}{FontMatrix 0 get div Metrics 0 get
div def}ifelse}forall Metrics/Metrics currentdict end def}{{1 index type
/nametype eq{exit}if exch pop}loop}ifelse[2 index currentdict end
definefont 3 -1 roll makefont/setfont cvx]cvx def}def/ObliqueSlant{dup
sin S cos div neg}B/SlantFont{4 index mul add}def/ExtendFont{3 -1 roll
mul exch}def/ReEncodeFont{CharStrings rcheck{/Encoding false def dup[
exch{dup CharStrings exch known not{pop/.notdef/Encoding true def}if}
forall Encoding{]exch pop}{cleartomark}ifelse}if/Encoding exch def}def
end

%%EndProcSet
%%BeginProcSet: special.pro 0 0
%!
TeXDict begin/SDict 200 dict N SDict begin/@SpecialDefaults{/hs 612 N
/vs 792 N/ho 0 N/vo 0 N/hsc 1 N/vsc 1 N/ang 0 N/CLIP 0 N/rwiSeen false N
/rhiSeen false N/letter{}N/note{}N/a4{}N/legal{}N}B/@scaleunit 100 N
/@hscale{@scaleunit div/hsc X}B/@vscale{@scaleunit div/vsc X}B/@hsize{
/hs X/CLIP 1 N}B/@vsize{/vs X/CLIP 1 N}B/@clip{/CLIP 2 N}B/@hoffset{/ho
X}B/@voffset{/vo X}B/@angle{/ang X}B/@rwi{10 div/rwi X/rwiSeen true N}B
/@rhi{10 div/rhi X/rhiSeen true N}B/@llx{/llx X}B/@lly{/lly X}B/@urx{
/urx X}B/@ury{/ury X}B/magscale true def end/@MacSetUp{userdict/md known
{userdict/md get type/dicttype eq{userdict begin md length 10 add md
maxlength ge{/md md dup length 20 add dict copy def}if end md begin
/letter{}N/note{}N/legal{}N/od{txpose 1 0 mtx defaultmatrix dtransform S
atan/pa X newpath clippath mark{transform{itransform moveto}}{transform{
itransform lineto}}{6 -2 roll transform 6 -2 roll transform 6 -2 roll
transform{itransform 6 2 roll itransform 6 2 roll itransform 6 2 roll
curveto}}{{closepath}}pathforall newpath counttomark array astore/gc xdf
pop ct 39 0 put 10 fz 0 fs 2 F/|______Courier fnt invertflag{PaintBlack}
if}N/txpose{pxs pys scale ppr aload pop por{noflips{pop S neg S TR pop 1
-1 scale}if xflip yflip and{pop S neg S TR 180 rotate 1 -1 scale ppr 3
get ppr 1 get neg sub neg ppr 2 get ppr 0 get neg sub neg TR}if xflip
yflip not and{pop S neg S TR pop 180 rotate ppr 3 get ppr 1 get neg sub
neg 0 TR}if yflip xflip not and{ppr 1 get neg ppr 0 get neg TR}if}{
noflips{TR pop pop 270 rotate 1 -1 scale}if xflip yflip and{TR pop pop
90 rotate 1 -1 scale ppr 3 get ppr 1 get neg sub neg ppr 2 get ppr 0 get
neg sub neg TR}if xflip yflip not and{TR pop pop 90 rotate ppr 3 get ppr
1 get neg sub neg 0 TR}if yflip xflip not and{TR pop pop 270 rotate ppr
2 get ppr 0 get neg sub neg 0 S TR}if}ifelse scaleby96{ppr aload pop 4
-1 roll add 2 div 3 1 roll add 2 div 2 copy TR .96 dup scale neg S neg S
TR}if}N/cp{pop pop showpage pm restore}N end}if}if}N/normalscale{
Resolution 72 div VResolution 72 div neg scale magscale{DVImag dup scale
}if 0 setgray}N/psfts{S 65781.76 div N}N/startTexFig{/psf$SavedState
save N userdict maxlength dict begin/magscale true def normalscale
currentpoint TR/psf$ury psfts/psf$urx psfts/psf$lly psfts/psf$llx psfts
/psf$y psfts/psf$x psfts currentpoint/psf$cy X/psf$cx X/psf$sx psf$x
psf$urx psf$llx sub div N/psf$sy psf$y psf$ury psf$lly sub div N psf$sx
psf$sy scale psf$cx psf$sx div psf$llx sub psf$cy psf$sy div psf$ury sub
TR/showpage{}N/erasepage{}N/setpagedevice{pop}N/copypage{}N/p 3 def
@MacSetUp}N/doclip{psf$llx psf$lly psf$urx psf$ury currentpoint 6 2 roll
newpath 4 copy 4 2 roll moveto 6 -1 roll S lineto S lineto S lineto
closepath clip newpath moveto}N/endTexFig{end psf$SavedState restore}N
/@beginspecial{SDict begin/SpecialSave save N gsave normalscale
currentpoint TR @SpecialDefaults count/ocount X/dcount countdictstack N}
N/@setspecial{CLIP 1 eq{newpath 0 0 moveto hs 0 rlineto 0 vs rlineto hs
neg 0 rlineto closepath clip}if ho vo TR hsc vsc scale ang rotate
rwiSeen{rwi urx llx sub div rhiSeen{rhi ury lly sub div}{dup}ifelse
scale llx neg lly neg TR}{rhiSeen{rhi ury lly sub div dup scale llx neg
lly neg TR}if}ifelse CLIP 2 eq{newpath llx lly moveto urx lly lineto urx
ury lineto llx ury lineto closepath clip}if/showpage{}N/erasepage{}N
/setpagedevice{pop}N/copypage{}N newpath}N/@endspecial{count ocount sub{
pop}repeat countdictstack dcount sub{end}repeat grestore SpecialSave
restore end}N/@defspecial{SDict begin}N/@fedspecial{end}B/li{lineto}B
/rl{rlineto}B/rc{rcurveto}B/np{/SaveX currentpoint/SaveY X N 1
setlinecap newpath}N/st{stroke SaveX SaveY moveto}N/fil{fill SaveX SaveY
moveto}N/ellipse{/endangle X/startangle X/yrad X/xrad X/savematrix
matrix currentmatrix N TR xrad yrad scale 0 0 1 startangle endangle arc
savematrix setmatrix}N end

%%EndProcSet
%%BeginProcSet: color.pro 0 0
%!
TeXDict begin/setcmykcolor where{pop}{/setcmykcolor{dup 10 eq{pop
setrgbcolor}{1 sub 4 1 roll 3{3 index add neg dup 0 lt{pop 0}if 3 1 roll
}repeat setrgbcolor pop}ifelse}B}ifelse/TeXcolorcmyk{setcmykcolor}def
/TeXcolorrgb{setrgbcolor}def/TeXcolorgrey{setgray}def/TeXcolorgray{
setgray}def/TeXcolorhsb{sethsbcolor}def/currentcmykcolor where{pop}{
/currentcmykcolor{currentrgbcolor 10}B}ifelse/DC{exch dup userdict exch
known{pop pop}{X}ifelse}B/GreenYellow{0.15 0 0.69 0 setcmykcolor}DC
/Yellow{0 0 1 0 setcmykcolor}DC/Goldenrod{0 0.10 0.84 0 setcmykcolor}DC
/Dandelion{0 0.29 0.84 0 setcmykcolor}DC/Apricot{0 0.32 0.52 0
setcmykcolor}DC/Peach{0 0.50 0.70 0 setcmykcolor}DC/Melon{0 0.46 0.50 0
setcmykcolor}DC/YellowOrange{0 0.42 1 0 setcmykcolor}DC/Orange{0 0.61
0.87 0 setcmykcolor}DC/BurntOrange{0 0.51 1 0 setcmykcolor}DC
/Bittersweet{0 0.75 1 0.24 setcmykcolor}DC/RedOrange{0 0.77 0.87 0
setcmykcolor}DC/Mahogany{0 0.85 0.87 0.35 setcmykcolor}DC/Maroon{0 0.87
0.68 0.32 setcmykcolor}DC/BrickRed{0 0.89 0.94 0.28 setcmykcolor}DC/Red{
0 1 1 0 setcmykcolor}DC/OrangeRed{0 1 0.50 0 setcmykcolor}DC/RubineRed{
0 1 0.13 0 setcmykcolor}DC/WildStrawberry{0 0.96 0.39 0 setcmykcolor}DC
/Salmon{0 0.53 0.38 0 setcmykcolor}DC/CarnationPink{0 0.63 0 0
setcmykcolor}DC/Magenta{0 1 0 0 setcmykcolor}DC/VioletRed{0 0.81 0 0
setcmykcolor}DC/Rhodamine{0 0.82 0 0 setcmykcolor}DC/Mulberry{0.34 0.90
0 0.02 setcmykcolor}DC/RedViolet{0.07 0.90 0 0.34 setcmykcolor}DC
/Fuchsia{0.47 0.91 0 0.08 setcmykcolor}DC/Lavender{0 0.48 0 0
setcmykcolor}DC/Thistle{0.12 0.59 0 0 setcmykcolor}DC/Orchid{0.32 0.64 0
0 setcmykcolor}DC/DarkOrchid{0.40 0.80 0.20 0 setcmykcolor}DC/Purple{
0.45 0.86 0 0 setcmykcolor}DC/Plum{0.50 1 0 0 setcmykcolor}DC/Violet{
0.79 0.88 0 0 setcmykcolor}DC/RoyalPurple{0.75 0.90 0 0 setcmykcolor}DC
/BlueViolet{0.86 0.91 0 0.04 setcmykcolor}DC/Periwinkle{0.57 0.55 0 0
setcmykcolor}DC/CadetBlue{0.62 0.57 0.23 0 setcmykcolor}DC
/CornflowerBlue{0.65 0.13 0 0 setcmykcolor}DC/MidnightBlue{0.98 0.13 0
0.43 setcmykcolor}DC/NavyBlue{0.94 0.54 0 0 setcmykcolor}DC/RoyalBlue{1
0.50 0 0 setcmykcolor}DC/Blue{1 1 0 0 setcmykcolor}DC/Cerulean{0.94 0.11
0 0 setcmykcolor}DC/Cyan{1 0 0 0 setcmykcolor}DC/ProcessBlue{0.96 0 0 0
setcmykcolor}DC/SkyBlue{0.62 0 0.12 0 setcmykcolor}DC/Turquoise{0.85 0
0.20 0 setcmykcolor}DC/TealBlue{0.86 0 0.34 0.02 setcmykcolor}DC
/Aquamarine{0.82 0 0.30 0 setcmykcolor}DC/BlueGreen{0.85 0 0.33 0
setcmykcolor}DC/Emerald{1 0 0.50 0 setcmykcolor}DC/JungleGreen{0.99 0
0.52 0 setcmykcolor}DC/SeaGreen{0.69 0 0.50 0 setcmykcolor}DC/Green{1 0
1 0 setcmykcolor}DC/ForestGreen{0.91 0 0.88 0.12 setcmykcolor}DC
/PineGreen{0.92 0 0.59 0.25 setcmykcolor}DC/LimeGreen{0.50 0 1 0
setcmykcolor}DC/YellowGreen{0.44 0 0.74 0 setcmykcolor}DC/SpringGreen{
0.26 0 0.76 0 setcmykcolor}DC/OliveGreen{0.64 0 0.95 0.40 setcmykcolor}
DC/RawSienna{0 0.72 1 0.45 setcmykcolor}DC/Sepia{0 0.83 1 0.70
setcmykcolor}DC/Brown{0 0.81 1 0.60 setcmykcolor}DC/Tan{0.14 0.42 0.56 0
setcmykcolor}DC/Gray{0 0 0 0.50 setcmykcolor}DC/Black{0 0 0 1
setcmykcolor}DC/White{0 0 0 0 setcmykcolor}DC end

%%EndProcSet
TeXDict begin @defspecial

 TeXDict begin /landplus90{true}store end
 
@fedspecial end TeXDict begin
40258437 52099154 1000 8000 8000
(/afs/fest.tugraz.at/user/mueli/vcs/svn/mueli-da/src_images/img-temp350681/image.dvi)
@start /Fa 134[590 590 7[664 2[959 109[{TeXBase1Encoding ReEncodeFont}4
1328.35 /Times-Italic rf /Fc 139[369 517 442 1[664 1[664
1033 369 4[664 442 590 1[590 1[590 13[739 2[739 30[664
49[{TeXBase1Encoding ReEncodeFont}15 1328.35 /Times-Roman
rf end
%%EndProlog
%%BeginSetup
%%Feature: *Resolution 8000dpi
TeXDict begin
 end
%%EndSetup
TeXDict begin 1 0 bop 0 TeXcolorgray Black 0 TeXcolorgray
0 TeXcolorgray 1568 38491 a
 /PSfrag where{pop(text_0)[[0(bl)1 0]](text_1)[[1(bl)1 0]](text_2)[[2(bl)1 0]](text_3)[[3(bl)1 0]](text_4)[[4(bl)1 0]]5 0 -1/Begin PSfrag}{userdict /PSfrag{pop}put}ifelse
 1568 38491 a @beginspecial
152 @llx 21 @lly 446 @urx 322 @ury 3401 @rwi @setspecial
%%BeginDocument: /afs/fest.tugraz.at/user/mueli/vcs/svn/mueli-da/src_images/kurz_krag_img.eps
%!PS-Adobe-2.0 EPSF-2.0 
%%BoundingBox: 152 21 446 322
%%HiResBoundingBox: 152.286 21.440 445.038 321.018
%%Title: Z:\home\svn\mueli-da\src_images\kurz_krag_acad.eps 
%%Creator: AutoCAD PSOUT 
%%For: , 
%%Pages: 1 
%%DocumentFonts: (atend) 
%%DocumentNeededFonts: (atend) 
%%CreationDate: 2007-02-28 
%%EndComments 
save 
20 20 translate 
0.24 dup scale 
0 setlinewidth 
/ACADLayer { pop } def 
/ACADColor { setrgbcolor pop } def 
/ACADLtype { pop 
userdict /Linedict known not { /Linedict 100 dict def } if 
1 index cvn Linedict exch known not { 
mark 1 index { dup 0 eq { pop 1 72.0 div } if abs } forall 
counttomark 2 add -1 roll astore exch pop 
1 index cvn exch Linedict begin def end } 
{ pop } ifelse 
Linedict begin cvx exec 0 setdash end } bind def 
/bd{bind def}bind def /m{moveto}bd /l{lineto}bd /s{stroke}bd 
/a{arc}bd /an{arcn}bd /gs{gsave}bd /gr{grestore}bd 
/cp{closepath}bd /tr{translate}bd /sc{scale}bd /co{concat}bd 
/ff{findfont}bd /sf{setfont}bd /sh{show}bd /np{newpath}bd 
/sw{setlinewidth}bd /sj{setlinejoin}bd /sm{setmiterlimit}bd 
/cl{clip}bd /fi{fill}bd 
%%EndProlog 
%%Page: 1 1 
gs np -20 -20 m -20 1299 l 2269 1299 l 2269 -20 l cp cl np 7 0 0 0 ACADColor 
(0) ACADLayer (_CONTINUOUS) [ ] (A) ACADLtype 729 166 m 1520 166 l 1520 957 l 
729 957 l cp s 680 731 m 680 788 l s 680 731 m 729 759 l s 674 788 m 680 782 l 
s 659 785 m 680 765 l s 659 769 m 680 748 l s 659 752 m 680 731 l 
s 659 735 m 664 731 l s 674 195 m 680 189 l s 659 193 m 680 172 l 
s 659 176 m 680 155 l s 659 159 m 680 139 l s 659 142 m 664 138 l 
s 680 195 m 729 166 l s 680 138 m 680 195 l s 680 138 m 729 166 l 
s 674 392 m 680 386 l s 659 390 m 680 370 l s 659 373 m 680 353 l 
s 659 357 m 680 336 l s 659 340 m 664 336 l s 680 336 m 729 364 l 
s 680 336 m 680 392 l 729 364 l s 674 590 m 680 584 l s 659 588 m 680 567 l 
s 659 571 m 680 551 l s 659 554 m 680 534 l s 659 538 m 664 533 l 
s 680 590 m 729 562 l s 680 533 m 680 590 l s 680 533 m 729 562 l 
s 680 788 m 729 759 l s 680 928 m 729 957 l s 680 985 m 729 957 l 
s 680 928 m 680 985 l s 674 985 m 680 979 l s 659 983 m 680 963 l 
s 659 966 m 680 946 l s 659 950 m 680 929 l s 659 933 m 664 928 l 
s 723 957 m 568 957 l s 723 166 m 568 166 l s 581 932 m 581 191 l s 
np 577 932 m 585 932 l 581 957 l 581 957 l cp fi np 577 191 m 585 191 l 
581 166 l 581 166 l cp fi 729 957 m 729 957 l s 729 166 m 729 166 l 
s 581 166 m 581 166 l s 729 160 m 729 6 l s 1520 160 m 1520 6 l 
s 754 18 m 1495 18 l s np 754 22 m 754 14 l 729 18 l 729 18 l cp fi 
np 1495 22 m 1495 14 l 1520 18 l 1520 18 l cp fi 729 166 m 729 166 l 
s 1520 166 m 1520 166 l s 1520 18 m 1520 18 l s 1520 1105 m 729 1105 l s 
np 733 982 m 729 957 l 725 982 l cp fi 729 982 m 729 1105 l s np 773 982 m 
769 957 l 765 982 l cp fi 769 982 m 769 1105 l s np 812 982 m 808 957 l 
804 982 l cp fi 808 982 m 808 1105 l s np 852 982 m 848 957 l 844 982 l cp fi 
848 982 m 848 1105 l s np 891 982 m 887 957 l 883 982 l cp fi 
887 982 m 887 1105 l s np 931 982 m 927 957 l 923 982 l cp fi 
927 982 m 927 1105 l s np 971 982 m 966 957 l 962 982 l cp fi 
966 982 m 966 1105 l s np 1010 982 m 1006 957 l 1002 982 l cp fi 
1006 982 m 1006 1105 l s np 1050 982 m 1046 957 l 1041 982 l cp fi 
1046 982 m 1046 1105 l s np 1089 982 m 1085 957 l 1081 982 l cp fi 
1085 982 m 1085 1105 l s np 1129 982 m 1125 957 l 1121 982 l cp fi 
1125 982 m 1125 1105 l s np 1168 982 m 1164 957 l 1160 982 l cp fi 
1164 982 m 1164 1105 l s np 1208 982 m 1204 957 l 1200 982 l cp fi 
1204 982 m 1204 1105 l s np 1247 982 m 1243 957 l 1239 982 l cp fi 
1243 982 m 1243 1105 l s np 1287 982 m 1283 957 l 1279 982 l cp fi 
1283 982 m 1283 1105 l s np 1326 982 m 1322 957 l 1318 982 l cp fi 
1322 982 m 1322 1105 l s np 1366 982 m 1362 957 l 1358 982 l cp fi 
1362 982 m 1362 1105 l s np 1406 982 m 1401 957 l 1397 982 l cp fi 
1401 982 m 1401 1105 l s np 1445 982 m 1441 957 l 1437 982 l cp fi 
1441 982 m 1441 1105 l s np 1485 982 m 1481 957 l 1476 982 l cp fi 
1481 982 m 1481 1105 l s np 1524 982 m 1520 957 l 1516 982 l cp fi 
1520 982 m 1520 1105 l s np 725 1229 m 729 1253 l 733 1229 l cp fi 
729 1229 m 729 1105 l s np 1644 170 m 1668 166 l 1644 162 l cp fi 
1644 166 m 1520 166 l s 


(0) ACADLayer gs 9.887 9.882 sc 43.7997 -13.1184 tr 
[ 1 0 0 1 30 110 ] co 0.25 sw 0 sj 10 sm np 0 0 m 0 -80 l 80 -80 l 80 0 l 0 0 l 
s gr 
7 0 0 0 ACADColor /Times-Roman ff 30 scalefont sf 1125 48 m (text_0) sh
/Times-Roman ff 30 scalefont sf 551 542 m (text_1) sh
/Times-Roman ff 30 scalefont sf 1540 1056 m (text_2) sh
/Times-Roman ff 30 scalefont sf 1698 147 m (text_3) sh
/Times-Roman ff 30 scalefont sf 709 1234 m (text_4) sh

showpage 
%%Trailer 
restore 
%%DocumentFonts: 
%%DocumentNeededFonts: 

%%EndDocument
 @endspecial 1568 38491 a
 /End PSfrag
 1568 38491 a 1568 26090 a
 /Hide PSfrag
 1568
26090 a -9388 26996 a Fc(PSfrag)332 b(replacements)p
-9388 27583 10957 75 v 1568 27657 a
 /Unhide PSfrag
 1568 27657 a 277
29824 a
  {
 277 29824 a 0 TeXcolorgray -1014 29814 a Fc(1)p
Fa(mm)p 0 TeXcolorgray 277 29824 a
  } 0/Place PSfrag
 277 29824 a 1568 31991
a
  {
 1568 31991 a 0 TeXcolorgray -1014 31981 a Fc(1)p Fa(mm)p
0 TeXcolorgray 1568 31991 a
  } 1/Place PSfrag
 1568 31991 a 804 34158 a
  {

804 34158 a 0 TeXcolorgray 904 33884 a Fa(p)p 0 TeXcolorgray
804 34158 a
  } 2/Place PSfrag
 804 34158 a 908 36325 a
  {
 908 36325 a 0 TeXcolorgray
974 36315 a Fa(x)p 0 TeXcolorgray 908 36325 a
  } 3/Place PSfrag
 908 36325
a 1568 38491 a
  {
 1568 38491 a 0 TeXcolorgray 978 38218
a Fa(y)p 0 TeXcolorgray 1568 38491 a
  } 4/Place PSfrag
 1568 38491 a 0 TeXcolorgray
0 TeXcolorgray 0 TeXcolorgray eop end
%%Trailer

userdict /end-hook known{end-hook}if
%%EOF
