1 4 4
2 4 1.84083
3 1.84083 4
4 2.85737 1.97601
5 1.98158 2.81143
6 3.14371 0.909639
7 0.893985 3.13123
8 1.56595 1.53877
9 0.854445 2.17031
10 2.22256 0.731351
11 4 0
12 0 4
13 2.63862 0
14 0 2.63862
15 1.32586 0.650557
16 0.685159 1.16463
17 1.73715 0
18 0 1.73715
19 0.71256 0.468583
20 0.350254 0.703711
21 1.03178 0
22 0 1.03178
23 0.353553 0.353553
24 0.5 0
25 0 0.5
26 0.191342 0.46194
27 0.351904 0.528632
28 0.175127 0.601856
29 0.46194 0.191342
30 0.60628 0.234291
31 0.533056 0.411068
32 0.531407 0.586147
33 0.175127 0.867748
34 0 0.765892
35 0.517707 0.934173
36 0.34258 1.09821
37 0.765892 0
38 0.872172 0.234291
39 1.17882 0.325278
40 1.01921 0.55957
41 0.34258 1.45089
42 0 1.38447
43 0.698859 0.816609
44 1.00551 0.907596
45 1.38447 0
46 1.53151 0.325278
47 1.97985 0.365675
48 1.77421 0.690954
49 0.769802 1.66747
50 0.427223 1.95373
51 1.12555 1.3517
52 1.2102 1.85454
53 0.427223 2.40446
54 0 2.18789
55 2.18789 0
56 2.43059 0.365675
57 2.89117 0.454819
58 2.68313 0.820495
59 1.89425 1.13506
60 1.4459 1.09466
61 2.53996 1.35368
62 2.21166 1.75739
63 1.77376 2.1751
64 1.41801 2.49087
65 0.446992 3.56562
66 1.36741 3.56562
67 0.920417 4
68 1.43778 2.97133
69 0.874215 2.65077
70 1.91121 3.40571
71 2.99079 3.40571
72 2.92042 4
73 3.00054 1.44282
74 3.57185 1.37524
75 3.57185 0.454819
76 4 0.920417
77 2.41947 2.39372
78 0.446992 2.88493
79 0 3.31931
80 3.42868 1.90842
81 3.31931 0
82 3.42868 2.98801
83 4 2.92042
84 0.0975452 0.490393
85 0.183234 0.531898
86 0.0875636 0.550928
87 0.352729 0.441093
88 0.271623 0.495286
89 0.277785 0.415735
90 0.262691 0.652783
91 0.263516 0.565244
92 0.351079 0.616172
93 0.415735 0.277785
94 0.497498 0.301205
95 0.443305 0.382311
96 0.55314 0.117146
97 0.53411 0.212817
98 0.490393 0.0975452
99 0.622808 0.439826
100 0.569668 0.32268
101 0.65942 0.351437
102 0.441655 0.55739
103 0.440831 0.644929
104 0.44248 0.46985
105 0.621983 0.527365
106 0.532232 0.498608
107 0.0875636 0.683874
108 0 0.632946
109 0.262691 0.785729
110 0.175127 0.734802
111 0 0.898838
112 0.0875636 0.81682
113 0.0875636 0.949766
114 0.258853 0.982979
115 0.17129 1.065
116 0.433981 0.818942
117 0.346417 0.90096
118 0.513869 1.13142
119 0.430143 1.01619
120 0.601433 1.0494
121 0.739226 0.234291
122 0.792366 0.351437
123 0.632946 0
124 0.686086 0.117146
125 0.951978 0.117146
126 0.819032 0.117146
127 0.898838 0
128 0.945691 0.396931
129 0.865885 0.514076
130 1.1053 0.162639
131 1.0255 0.279785
132 1.17253 0.605063
133 1.09902 0.442424
134 1.25234 0.487917
135 0.17129 1.24134
136 0 1.20813
137 0.513869 1.30776
138 0.34258 1.27455
139 0 1.56081
140 0.17129 1.41768
141 0.17129 1.59402
142 0.692009 0.990622
143 0.852184 0.862102
144 0.845334 1.03612
145 0.859035 0.688089
146 0.705709 0.642596
147 1.16568 0.779076
148 1.01236 0.733583
149 1.35516 0.325278
150 1.42868 0.487917
151 1.20813 0
152 1.28164 0.162639
153 1.63433 0.162639
154 1.45799 0.162639
155 1.56081 0
156 0.615133 0.701378
157 0.608283 0.875391
158 0.524557 0.76016
159 1.65286 0.508116
160 1.55003 0.670755
161 1.8585 0.182838
162 1.75568 0.345477
163 1.99838 0.711152
164 1.87703 0.528314
165 2.10121 0.548513
166 0.384901 1.70231
167 0.213611 1.84544
168 0.727481 1.41605
169 0.556191 1.55918
170 0.640834 2.06202
171 0.598512 1.8106
172 0.812124 1.91889
173 0.989999 1.761
174 1.03232 2.01242
175 0.905356 1.25817
176 0.947678 1.50959
177 1.16787 1.60312
178 0.213611 2.07081
179 0 1.96252
180 0.640834 2.28739
181 0.427223 2.1791
182 0.213611 2.29618
183 2.20522 0.365675
184 2.32658 0.548513
185 1.96252 0
186 2.08387 0.182838
187 2.30924 0.182838
188 2.76489 0.22741
189 2.66088 0.410247
190 2.53461 0.182838
191 2.55686 0.593085
192 2.78715 0.637657
193 1.61006 0.892809
194 1.38588 0.87261
195 2.05841 0.933206
196 1.83423 0.913007
197 1.50593 1.31672
198 1.67008 1.11486
199 1.7301 1.33692
200 2.05296 1.44623
201 1.8888 1.64808
202 2.38126 1.04252
203 2.21711 1.24437
204 2.53451 1.8667
205 2.37581 1.55554
206 2.69867 1.66485
207 1.22571 1.00113
208 1.34575 1.44524
209 1.28573 1.22318
210 1.06553 1.12965
211 1.3141 2.1727
212 1.13623 2.33059
213 1.66986 1.85694
214 1.49198 2.01482
215 1.38807 1.69666
216 0.223496 3.78281
217 0.683704 3.78281
218 0.460208 4
219 1.1307 3.34842
220 0.907201 3.56562
221 0.670489 3.34842
222 1.14391 3.78281
223 1.14611 2.57082
224 0.86433 2.41054
225 2.48619 3.10857
226 2.451 3.40571
227 1.94639 3.10857
228 2.45285 0.775923
229 2.61155 1.08709
230 3.07212 1.17623
231 2.84184 1.13166
232 2.91342 0.865067
233 3.78593 1.60803
234 3.78593 1.14783
235 4 1.38062
236 3.35778 0.682229
237 3.57185 0.915028
238 3.35778 1.14244
239 4 0.460208
240 3.78593 0.687618
241 3.78593 0.22741
242 2.63842 2.18487
243 2.31557 2.07556
244 1.99271 1.96625
245 2.09662 2.28441
246 0.213611 2.52154
247 0.437108 2.6447
248 0.223496 2.76177
249 0.650719 2.52762
250 0.660604 2.76785
251 0.446992 3.22527
252 0.670489 3.00808
253 0.223496 3.10212
254 0.223496 3.44246
255 3.44558 0.22741
256 3.65966 0
257 3.01744 0.682229
258 3.23151 0.454819
259 3.10524 0.22741
260 0 2.41325
261 2.41325 0
262 1.59589 2.33298
263 2.77025 1.39825
264 0.8841 2.891
265 0 2.97897
266 0 3.65966
267 3.2862 1.40903
268 2.97897 0
269 2.92895 1.70942
270 1.70968 2.89138
271 1.4279 2.7311
272 1.6998 2.65115
273 3.46021 4
274 2.9556 3.70286
275 3.4954 3.70286
276 1.60412 3.78281
277 1.63931 3.48566
278 1.87602 3.70286
279 1.4026 3.26847
280 1.67449 3.18852
281 2.70513 2.89972
282 2.92408 2.69086
283 3.20974 3.19686
284 3.14303 1.94222
285 3.42868 2.44821
286 3.14303 2.48201
287 3.71434 3.494
288 3.71434 2.95421
289 4 3.46021
290 3.71434 2.41442
291 0.0490085 0.497592
292 0.0925544 0.52066
293 0.0437818 0.525464
294 0.187288 0.496919
295 0.14039 0.511145
296 0.145142 0.47847
297 0.131345 0.576392
298 0.135399 0.541413
299 0.179181 0.566877
300 0.353141 0.397323
301 0.315257 0.428414
302 0.317197 0.386505
303 0.311763 0.511959
304 0.312176 0.468189
305 0.352316 0.484863
306 0.235698 0.440961
307 0.274704 0.45551
308 0.231482 0.478613
309 0.306473 0.678247
310 0.306885 0.634477
311 0.350667 0.659941
312 0.219321 0.58355
313 0.263103 0.609014
314 0.218909 0.627319
315 0.351492 0.572402
316 0.307297 0.590708
317 0.30771 0.546938
318 0.223375 0.548571
319 0.227429 0.513592
320 0.267569 0.530265
321 0.386505 0.317197
322 0.42952 0.330048
323 0.398429 0.367932
324 0.479719 0.246273
325 0.456616 0.289495
326 0.440961 0.235699
327 0.488181 0.396689
328 0.470402 0.341758
329 0.515277 0.356137
330 0.52657 0.0585729
331 0.521766 0.107345
332 0.497592 0.0490088
333 0.570195 0.223554
334 0.543625 0.164981
335 0.57971 0.175719
336 0.47847 0.145143
337 0.512251 0.155181
338 0.498025 0.202079
339 0.667684 0.454204
340 0.641114 0.395631
341 0.68599 0.41001
342 0.551362 0.366874
343 0.596238 0.381253
344 0.577932 0.425447
345 0.63285 0.292864
346 0.614544 0.337058
347 0.587974 0.278486
348 0.533583 0.311942
349 0.515804 0.257011
350 0.551889 0.267748
351 0.395955 0.63055
352 0.395543 0.67432
353 0.39678 0.543011
354 0.396367 0.586781
355 0.486119 0.615538
356 0.441243 0.601159
357 0.486531 0.571768
358 0.398017 0.411702
359 0.487768 0.440459
360 0.442893 0.42608
361 0.397604 0.455471
362 0.397192 0.499241
363 0.667271 0.497974
364 0.622396 0.483595
365 0.531819 0.542377
366 0.577108 0.512986
367 0.576695 0.556756
368 0.57752 0.469217
369 0.532644 0.454838
370 0.486944 0.527999
371 0.442068 0.51362
372 0.487356 0.484229
373 0.0437818 0.591937
374 0 0.566473
375 0.131345 0.642865
376 0.0875636 0.617401
377 0 0.699419
378 0.0437818 0.65841
379 0.0437818 0.724883
380 0.306473 0.74472
381 0.262691 0.719256
382 0.175127 0.801275
383 0.218909 0.760265
384 0.218909 0.826739
385 0.218909 0.693792
386 0.175127 0.668329
387 0.0437818 0.791356
388 0.0437818 0.857829
389 0 0.832365
390 0.131345 0.908757
391 0.0875636 0.883293
392 0.131345 0.842284
393 0.0437818 0.924302
394 0.0875636 0.750347
395 0.131345 0.709338
396 0.131345 0.775811
397 0.0437818 0.990775
398 0.129427 1.00738
399 0.0856449 1.04839
400 0.21699 0.925363
401 0.173209 0.966372
402 0.215072 1.02399
403 0.392118 0.761326
404 0.348336 0.802336
405 0.432062 0.917567
406 0.390199 0.859951
407 0.475844 0.876557
408 0.304554 0.843345
409 0.260772 0.884354
410 0.599514 1.14803
411 0.557651 1.09041
412 0.643296 1.10702
413 0.386361 1.0572
414 0.472006 1.07381
415 0.428224 1.11482
416 0.55957 0.991788
417 0.515788 1.0328
418 0.473925 0.975182
419 0.300716 1.04059
420 0.344498 0.999585
421 0.302635 0.941969
422 0.38828 0.958576
423 0.725893 0.351437
424 0.752463 0.41001
425 0.672753 0.234291
426 0.699323 0.292864
427 0.832269 0.292864
428 0.765796 0.292864
429 0.805699 0.234291
430 0.566473 0
431 0.593043 0.0585729
432 0.725989 0.0585729
433 0.659516 0.0585729
434 0.699419 0
435 0.619613 0.117146
436 0.646183 0.175719
437 0.991881 0.0585729
438 0.925408 0.0585729
439 0.965311 0
440 0.845602 0.175719
441 0.885505 0.117146
442 0.912075 0.175719
443 0.832365 0
444 0.858935 0.0585729
445 0.792462 0.0585729
446 0.779129 0.175719
447 0.712656 0.175719
448 0.752559 0.117146
449 0.829125 0.432757
450 0.789222 0.49133
451 0.908931 0.315611
452 0.869028 0.374184
453 0.942547 0.536823
454 0.905788 0.455503
455 0.98245 0.47825
456 1.06854 0.0813196
457 1.02864 0.139892
458 1.10216 0.302532
459 1.0654 0.221212
460 1.14206 0.243959
461 0.988738 0.198465
462 0.948835 0.257038
463 1.2492 0.62781
464 1.21244 0.54649
465 1.2891 0.569237
466 1.05911 0.500997
467 1.13578 0.523744
468 1.09587 0.582316
469 1.21558 0.406598
470 1.17568 0.465171
471 1.13892 0.383851
472 1.02235 0.419677
473 0.985594 0.338358
474 1.06226 0.361104
475 0.256935 1.16977
476 0.17129 1.15317
477 0.256935 1.0816
478 0.0856449 1.13656
479 0.0856449 1.22473
480 0.599514 1.2362
481 0.513869 1.21959
482 0.34258 1.36272
483 0.428224 1.29116
484 0.428224 1.37933
485 0.428224 1.20299
486 0.34258 1.18638
487 0.256935 1.52246
488 0.17129 1.50585
489 0.256935 1.43429
490 0.0856449 1.57741
491 0.0856449 1.48924
492 0.0856449 1.3129
493 0.17129 1.32951
494 0.0856449 1.40107
495 0.256935 1.25794
496 0.256935 1.34612
497 0.775522 0.839355
498 0.772097 0.926362
499 0.695434 0.903615
500 0.925422 0.971855
501 0.848759 0.949109
502 0.928847 0.884849
503 0.768672 1.01337
504 0.785797 0.578336
505 0.709135 0.555589
506 0.939122 0.62383
507 0.86246 0.601083
508 0.702284 0.729602
509 0.782372 0.665343
510 0.778947 0.752349
511 1.24577 0.714816
512 1.16911 0.69207
513 1.00893 0.820589
514 1.08902 0.756329
515 1.0856 0.843336
516 1.09245 0.669323
517 1.01578 0.646576
518 0.932272 0.797842
519 0.85561 0.775096
520 0.935697 0.710836
521 1.34051 0.487917
522 1.37727 0.569237
523 1.26699 0.325278
524 1.30375 0.406598
525 1.48009 0.406598
526 1.39192 0.406598
527 1.44333 0.325278
528 1.11996 0
529 1.15671 0.0813196
530 1.33306 0.0813196
531 1.24489 0.0813196
532 1.2963 0
533 1.19347 0.162639
534 1.23023 0.243959
535 1.49475 0.243959
536 1.54616 0.162639
537 1.58292 0.243959
538 1.47264 0
539 1.5094 0.0813196
540 1.42123 0.0813196
541 1.59757 0.0813196
542 1.40657 0.243959
543 1.3184 0.243959
544 1.36982 0.162639
545 0.663846 0.58498
546 0.656996 0.758993
547 0.660421 0.671987
548 0.618558 0.614371
549 0.57327 0.643762
550 0.646721 1.02001
551 0.688584 1.07763
552 0.562995 0.904782
553 0.604858 0.962397
554 0.650146 0.933006
555 0.653571 0.846
556 0.437406 0.731935
557 0.527982 0.673153
558 0.482694 0.702544
559 0.479269 0.789551
560 0.521132 0.847166
561 0.569845 0.730769
562 0.611708 0.788384
563 0.56642 0.817775
564 1.48936 0.579336
565 1.43795 0.660656
566 1.59218 0.416697
567 1.54077 0.498017
568 1.66212 0.680854
569 1.60145 0.589436
570 1.71353 0.599535
571 1.79783 0.0914188
572 1.74642 0.172738
573 1.68574 0.0813196
574 1.80709 0.264157
575 1.695 0.254058
576 1.82562 0.609634
577 1.93771 0.619733
578 1.8863 0.701053
579 1.76494 0.518215
580 1.64359 0.335378
581 1.70427 0.426796
582 1.92844 0.446995
583 1.81636 0.436896
584 1.86777 0.355576
585 0.0856449 1.66559
586 0.192451 1.71973
587 0.106806 1.79129
588 0.278095 1.64817
589 0.299256 1.77387
590 0.70632 1.29034
591 0.620675 1.36191
592 0.662997 1.61333
593 0.641836 1.48762
594 0.748641 1.54176
595 0.53503 1.43347
596 0.449385 1.50504
597 0.406062 1.82802
598 0.491707 1.75645
599 0.512868 1.88216
600 0.470546 1.63075
601 0.36374 1.5766
602 0.684157 1.73903
603 0.577352 1.68489
604 0.879901 1.71424
605 0.901062 1.83995
606 0.790963 1.79318
607 0.795258 1.2114
608 0.816418 1.33711
609 0.837579 1.46282
610 0.85874 1.58853
611 0.926517 1.38388
612 1.14671 1.47741
613 1.05778 1.55635
614 1.03662 1.43065
615 0.320417 2.01227
616 0.213611 1.95812
617 0.320417 1.89958
618 0.106806 1.90398
619 0.106806 2.01666
620 1.91051 0.0914188
621 2.02319 0.0914188
622 1.97119 0.182838
623 1.46796 0.771683
624 1.35587 0.761584
625 1.69213 0.791881
626 1.58005 0.781782
627 1.41589 0.983637
628 1.49797 0.88271
629 1.52798 0.993737
630 2.14048 0.832278
631 2.0284 0.822179
632 2.11047 0.721251
633 1.86424 1.02403
634 1.94632 0.923107
635 1.97633 1.03413
636 1.91631 0.81208
637 1.80422 0.801981
638 1.81218 1.23599
639 1.70009 1.22589
640 1.78217 1.12496
641 1.64007 1.00384
642 1.55799 1.10476
643 1.72214 0.902908
644 1.75216 1.01394
645 1.64802 1.43784
646 1.80945 1.4925
647 1.72737 1.59343
648 1.9736 1.29064
649 1.89153 1.39157
650 2.13776 1.08879
651 2.05568 1.18972
652 2.21983 0.987861
653 2.29919 1.14344
654 2.13503 1.3453
655 1.27578 0.825843
656 1.33581 1.0479
657 1.30579 0.93687
658 1.1957 0.890103
659 1.11561 0.954363
660 1.45585 1.492
661 1.42584 1.38098
662 1.53594 1.42774
663 1.20564 1.28744
664 1.31574 1.33421
665 1.23565 1.39847
666 1.47591 1.20569
667 1.39583 1.26995
668 1.36582 1.15892
669 0.765247 1.10037
670 0.875345 1.14714
671 1.03552 1.01862
672 0.955433 1.08288
673 1.01545 1.30494
674 0.985444 1.19391
675 1.09554 1.24068
676 1.14562 1.06539
677 1.25572 1.11216
678 1.17563 1.17642
679 1.6179 1.69785
680 1.52896 1.7768
681 1.47701 1.61771
682 0.111748 3.8914
683 0.341852 3.8914
684 0.230104 4
685 0.565348 3.67421
686 0.4536 3.78281
687 0.335244 3.67421
688 0.690312 4
689 0.571956 3.8914
690 0.80206 3.8914
691 0.913809 3.78281
692 1.03216 3.8914
693 0.677096 3.56562
694 0.795453 3.67421
695 2.23388 2.96
696 2.21629 3.10857
697 1.96399 2.96
698 1.9288 3.25714
699 2.1987 3.25714
700 2.1811 3.40571
701 2.3377 0.753637
702 2.41705 0.909219
703 2.30191 0.886933
704 3.57185 0.684924
705 3.46482 0.798628
706 3.46482 0.568524
707 3.35778 0.912333
708 3.46482 1.02873
709 4 0.230104
710 3.89296 0.343809
711 3.89296 0.113705
712 3.89296 0.804017
713 3.89296 0.573913
714 4 0.690312
715 3.67889 0.341115
716 3.78593 0.457514
717 3.67889 0.571219
718 3.89296 1.03412
719 3.78593 0.917722
720 3.67889 0.801323
721 3.67889 1.03143
722 2.74789 2.08044
723 2.58647 2.02578
724 2.69594 1.92136
725 2.36752 2.23464
726 2.47699 2.13021
727 2.52895 2.28929
728 2.25805 2.33906
729 2.20609 2.17998
730 1.38062 4
731 1.156 2.81105
732 1.16588 3.05128
733 1.87767 2.49326
734 2.20053 2.60257
735 3.21461 1.67562
736 3.71434 1.87463
737 3.50027 1.64183
738 4 2.38062
739 0 0.965311
740 0 1.11996
741 0 1.2963
742 0 1.64898
743 0 1.47264
744 1.64898 0
745 1.91918 0.274256
746 0.705318 1.86474
747 0.968839 1.6353
748 1.07894 1.68206
749 0 1.84983
750 1.84983 0
751 2.03186 0.274256
752 1.61801 1.32682
753 1.588 1.21579
754 1.97088 1.54715
755 1.02556 3.67421
756 2.46859 3.25714
757 2.42504 1.97113
758 1.36691 1.57095
759 1.25681 1.52418
760 1.27797 1.64989
761 1.77933 1.75251
762 2.41581 3.70286
763 2.38062 4
764 0.74764 2.11616
765 0.726479 1.99045
766 0.833285 2.0446
767 0.922222 1.96566
768 0.943383 2.09136
769 1.12126 1.93348
770 1.01116 1.88671
771 1.1001 1.80777
772 0.74764 2.22885
773 0.640834 2.1747
774 0.427223 2.29178
775 0.534028 2.23324
776 0.534028 2.34592
777 0.534028 2.00787
778 0.534028 2.12056
779 0.427223 2.06641
780 0.106806 2.12935
781 0.213611 2.18349
782 0.106806 2.24203
783 0.320417 2.12495
784 0.320417 2.23764
785 2.16188 0.639932
786 2.21389 0.548513
787 2.27457 0.639932
788 2.09254 0.365675
789 2.15322 0.457094
790 2.04053 0.457094
791 2.37858 0.457094
792 2.2659 0.457094
793 2.31791 0.365675
794 2.25723 0.274256
795 2.36991 0.274256
796 2.24856 0.0914188
797 2.19655 0.182838
798 2.13588 0.0914188
799 2.14455 0.274256
800 2.70176 0.113705
801 2.64975 0.205124
802 2.58661 0.0914188
803 2.61931 1.50926
804 2.53724 1.61019
805 2.45789 1.45461
806 2.29646 1.39995
807 2.37854 1.29903
808 1.26215 2.01362
809 1.17321 2.09256
810 1.08427 2.1715
811 1.22517 2.25165
812 1.63287 2.09496
813 1.58092 1.93588
814 1.72181 2.01602
815 1.29913 1.7756
816 1.44003 1.85574
817 1.35109 1.93468
818 1.1373 3.56562
819 1.01895 3.45702
820 1.24905 3.45702
821 0.995337 2.25045
822 1.00028 2.37056
823 0.859388 2.29042
824 0.869273 2.53065
825 1.00522 2.49068
826 1.01016 2.61079
827 2.64734 0.953791
828 2.5322 0.931505
829 2.56799 0.798209
830 2.79828 0.842781
831 2.87763 0.998363
832 2.76249 0.976077
833 3.67889 1.26153
834 3.78593 1.37793
835 3.67889 1.49164
836 3.89296 1.49433
837 3.89296 1.26423
838 0.106806 2.58008
839 0.218554 2.64166
840 0.111748 2.7002
841 0.538971 2.46604
842 0.543913 2.58616
843 0.432165 2.52458
844 0.782237 3.23983
845 0.670489 3.17825
846 0.782237 3.06965
847 0.55874 2.9465
848 0.55874 3.11667
849 0.446992 3.0551
850 0.55874 3.28685
851 0.111748 3.21072
852 0.223496 3.27229
853 0.111748 3.38089
854 3.72279 0.113705
855 3.61576 0.22741
856 3.55262 0.113705
857 3.08057 0.795934
858 3.18761 0.682229
859 3.25075 0.795934
860 3.06134 0.454819
861 3.12447 0.568524
862 2.9543 0.568524
863 3.29465 0.568524
864 3.38245 0.113705
865 3.27541 0.22741
866 3.21227 0.113705
867 2.9982 0.341115
868 3.16837 0.341115
869 3.33855 0.341115
870 0.320417 2.463
871 0.213611 2.40886
872 0.320417 2.35032
873 0.106806 2.4674
874 0.106806 2.35471
875 2.47393 0.0914188
876 2.42192 0.182838
877 2.36125 0.0914188
878 2.38971 0.662218
879 2.44172 0.570799
880 2.50486 0.684504
881 0.752582 2.34896
882 0.757525 2.46908
883 0.645776 2.4075
884 0.335244 2.99352
885 0.223496 2.93195
886 0.335244 2.82335
887 0.111748 2.87037
888 0.111748 3.04054
889 0.111748 3.72123
890 0.111748 3.55106
891 0.223496 3.61264
892 2.82803 0.341115
893 2.93507 0.22741
894 2.87193 0.113705
895 3.0421 0.113705
896 3.31921 3.09243
897 3.06691 2.94386
898 3.17638 2.83943
899 3.0002 1.95911
900 3.14303 2.21211
901 3.0002 2.22901
902 3.42868 2.17832
903 3.28585 2.19522
904 3.28585 1.92532
905 3.28585 2.46511
906 0.0245337 0.499398
907 0.0463952 0.511528
908 0.0218909 0.512732
909 0.0950498 0.505526
910 0.0707815 0.509126
911 0.073365 0.494588
912 0.0656727 0.538196
913 0.0681681 0.523062
914 0.090059 0.535794
915 0.189315 0.479429
916 0.166215 0.487694
917 0.168445 0.470772
918 0.161812 0.521521
919 0.163839 0.504032
920 0.185261 0.514408
921 0.12149 0.485016
922 0.142766 0.494808
923 0.118967 0.500769
924 0.153236 0.589124
925 0.155263 0.571634
926 0.177154 0.584366
927 0.111481 0.54617
928 0.133372 0.558902
929 0.109455 0.56366
930 0.181208 0.549387
931 0.15729 0.554145
932 0.159317 0.536655
933 0.113977 0.531036
934 0.116472 0.515903
935 0.137894 0.526279
936 0.353347 0.375438
937 0.335169 0.391914
938 0.335779 0.370476
939 0.333993 0.434753
940 0.334199 0.412868
941 0.352935 0.419208
942 0.297849 0.401604
943 0.316227 0.40746
944 0.296521 0.422074
945 0.331834 0.520296
946 0.33204 0.498411
947 0.35211 0.506747
948 0.291899 0.481738
949 0.31197 0.490074
950 0.291693 0.503623
951 0.352522 0.462978
952 0.332246 0.476526
953 0.332452 0.454641
954 0.213777 0.451995
955 0.23359 0.459787
956 0.211412 0.470276
957 0.276245 0.435623
958 0.255201 0.448236
959 0.257051 0.428865
960 0.251553 0.486949
961 0.253093 0.467062
962 0.273163 0.475398
963 0.29498 0.441962
964 0.313716 0.448302
965 0.29344 0.46185
966 0.284788 0.64363
967 0.306679 0.656362
968 0.284582 0.665515
969 0.350873 0.638056
970 0.328776 0.647209
971 0.328982 0.625325
972 0.197224 0.592703
973 0.219115 0.605435
974 0.197018 0.614587
975 0.263309 0.587129
976 0.241212 0.596282
977 0.241418 0.574397
978 0.2408 0.640051
979 0.241006 0.618166
980 0.262897 0.630898
981 0.351698 0.550517
982 0.329601 0.55967
983 0.329807 0.537785
984 0.329188 0.60344
985 0.329394 0.581555
986 0.351285 0.594287
987 0.285613 0.556091
988 0.307504 0.568823
989 0.285406 0.577976
990 0.307091 0.612593
991 0.284994 0.621746
992 0.2852 0.599861
993 0.199251 0.575213
994 0.203305 0.540234
995 0.201278 0.557724
996 0.221348 0.56606
997 0.243445 0.556907
998 0.209385 0.487766
999 0.249526 0.504439
1000 0.229455 0.496102
1001 0.207358 0.505255
1002 0.205332 0.522745
1003 0.309737 0.529449
1004 0.265542 0.547754
1005 0.287639 0.538601
1006 0.289666 0.521112
1007 0.269596 0.512775
1008 0.245472 0.539418
1009 0.225402 0.531081
1010 0.247499 0.521928
1011 0.370475 0.33578
1012 0.392467 0.342564
1013 0.375991 0.360743
1014 0.422627 0.303917
1015 0.408013 0.323622
1016 0.401604 0.29785
1017 0.420867 0.375121
1018 0.413975 0.34899
1019 0.436412 0.356179
1020 0.470829 0.218808
1021 0.46034 0.240986
1022 0.451994 0.213778
1023 0.477057 0.29535
1024 0.468168 0.267884
1025 0.488609 0.273739
1026 0.428864 0.257052
1027 0.448789 0.262597
1028 0.436176 0.28364
1029 0.510619 0.403879
1030 0.501729 0.376413
1031 0.524167 0.383602
1032 0.456853 0.362034
1033 0.479291 0.369224
1034 0.465743 0.3895
1035 0.506388 0.328671
1036 0.492839 0.348947
1037 0.48395 0.321481
1038 0.449961 0.335903
1039 0.443068 0.309772
1040 0.463509 0.315626
1041 0.513285 0.0292864
1042 0.512081 0.0537908
1043 0.499398 0.0245343
1044 0.537453 0.112246
1045 0.524168 0.0829592
1046 0.539855 0.0878593
1047 0.494588 0.073366
1048 0.509679 0.0781771
1049 0.506079 0.102445
1050 0.566425 0.146432
1051 0.561667 0.17035
1052 0.548382 0.141063
1053 0.574952 0.199636
1054 0.55691 0.194268
1055 0.470772 0.168445
1056 0.488247 0.173611
1057 0.479982 0.19671
1058 0.501322 0.126363
1059 0.495361 0.150162
1060 0.485016 0.121491
1061 0.516067 0.207448
1062 0.505138 0.17863
1063 0.523181 0.183999
1064 0.517009 0.131263
1065 0.532696 0.136163
1066 0.527938 0.160081
1067 0.538867 0.188899
1068 0.690122 0.461394
1069 0.676837 0.432107
1070 0.699275 0.439296
1071 0.631961 0.417728
1072 0.654399 0.424918
1073 0.645246 0.447015
1074 0.672705 0.380724
1075 0.663552 0.402821
1076 0.650267 0.373534
1077 0.542209 0.388971
1078 0.564647 0.39616
1079 0.555494 0.418257
1080 0.582953 0.351966
1081 0.5738 0.374063
1082 0.560515 0.344777
1083 0.60037 0.432636
1084 0.587085 0.40335
1085 0.609523 0.410539
1086 0.619565 0.263578
1087 0.610412 0.285675
1088 0.597127 0.256389
1089 0.636982 0.344248
1090 0.623697 0.314961
1091 0.646135 0.322151
1092 0.578821 0.300583
1093 0.601259 0.307772
1094 0.592106 0.329869
1095 0.627829 0.366345
1096 0.618676 0.388442
1097 0.605391 0.359156
1098 0.53332 0.361505
1099 0.515541 0.306574
1100 0.52443 0.334039
1101 0.542473 0.339408
1102 0.551626 0.317311
1103 0.488872 0.224176
1104 0.524957 0.234914
1105 0.506914 0.229545
1106 0.497761 0.251642
1107 0.506651 0.279108
1108 0.579084 0.25102
1109 0.588237 0.228923
1110 0.560779 0.295214
1111 0.569931 0.273117
1112 0.552152 0.218185
1113 0.561042 0.245651
1114 0.542999 0.240282
1115 0.542736 0.289845
1116 0.524694 0.284477
1117 0.533846 0.262379
1118 0.374342 0.535822
1119 0.374136 0.557706
1120 0.396574 0.564896
1121 0.373929 0.579591
1122 0.508763 0.600842
1123 0.486325 0.593653
1124 0.508969 0.578958
1125 0.441449 0.579274
1126 0.418805 0.59397
1127 0.419011 0.572085
1128 0.375785 0.382628
1129 0.420661 0.397006
1130 0.398223 0.389817
1131 0.375579 0.404512
1132 0.375373 0.426397
1133 0.510412 0.425764
1134 0.487975 0.418574
1135 0.442686 0.447965
1136 0.46533 0.43327
1137 0.465124 0.455155
1138 0.465537 0.411385
1139 0.443099 0.404196
1140 0.374754 0.492052
1141 0.374548 0.513937
1142 0.375167 0.448282
1143 0.37496 0.470167
1144 0.419836 0.484546
1145 0.397398 0.477356
1146 0.420042 0.462661
1147 0.397811 0.433587
1148 0.420455 0.418891
1149 0.420248 0.440776
1150 0.689916 0.483278
1151 0.667478 0.476089
1152 0.622189 0.50548
1153 0.644834 0.490785
1154 0.644627 0.512669
1155 0.531613 0.564262
1156 0.554257 0.549567
1157 0.554051 0.571451
1158 0.599339 0.54206
1159 0.576901 0.534871
1160 0.599545 0.520176
1161 0.555288 0.440142
1162 0.53285 0.432953
1163 0.532438 0.476723
1164 0.555082 0.462027
1165 0.554876 0.483912
1166 0.577726 0.447332
1167 0.622602 0.46171
1168 0.599958 0.476406
1169 0.600164 0.454521
1170 0.577314 0.491101
1171 0.55467 0.505797
1172 0.599752 0.498291
1173 0.4643 0.542694
1174 0.486737 0.549883
1175 0.464093 0.564579
1176 0.532026 0.520492
1177 0.509381 0.535188
1178 0.509588 0.513303
1179 0.396986 0.521126
1180 0.442274 0.491735
1181 0.41963 0.506431
1182 0.419218 0.5502
1183 0.419424 0.528315
1184 0.441862 0.535505
1185 0.510206 0.447649
1186 0.509794 0.491418
1187 0.51 0.469533
1188 0.487562 0.462344
1189 0.464918 0.47704
1190 0.464712 0.498924
1191 0.48715 0.506114
1192 0.464506 0.520809
1193 0.0218909 0.545968
1194 0 0.533237
1195 0.0656727 0.571432
1196 0.0437818 0.5587
1197 0 0.59971
1198 0.0218909 0.579205
1199 0.0218909 0.612442
1200 0.153236 0.62236
1201 0.131345 0.609628
1202 0.0875636 0.650637
1203 0.109455 0.630133
1204 0.109455 0.663369
1205 0.109455 0.596896
1206 0.0875636 0.584164
1207 0 0.732656
1208 0.0218909 0.712151
1209 0.0218909 0.745388
1210 0.0218909 0.645678
1211 0.0218909 0.678915
1212 0 0.666183
1213 0.0656727 0.704378
1214 0.0437818 0.691646
1215 0.0656727 0.671142
1216 0.0437818 0.625173
1217 0.0656727 0.604669
1218 0.0656727 0.637905
1219 0.262691 0.752493
1220 0.284582 0.731988
1221 0.284582 0.765225
1222 0.284582 0.698752
1223 0.262691 0.68602
1224 0.306473 0.711484
1225 0.175127 0.834511
1226 0.197018 0.814007
1227 0.197018 0.847243
1228 0.197018 0.747534
1229 0.197018 0.78077
1230 0.175127 0.768038
1231 0.2408 0.806234
1232 0.218909 0.793502
1233 0.2408 0.772997
1234 0.197018 0.647824
1235 0.175127 0.635092
1236 0.2408 0.673288
1237 0.218909 0.660556
1238 0.175127 0.701565
1239 0.197018 0.681061
1240 0.197018 0.714297
1241 0.2408 0.706524
1242 0.2408 0.739761
1243 0.218909 0.727029
1244 0.0218909 0.811861
1245 0.0437818 0.824593
1246 0.0218909 0.845097
1247 0.0437818 0.75812
1248 0.0218909 0.778624
1249 0.0656727 0.737615
1250 0.0656727 0.770851
1251 0.153236 0.655597
1252 0.153236 0.688833
1253 0.131345 0.676101
1254 0.153236 0.821779
1255 0.131345 0.809047
1256 0.153236 0.788543
1257 0.0875636 0.783583
1258 0.109455 0.763079
1259 0.109455 0.796315
1260 0.109455 0.696606
1261 0.109455 0.729842
1262 0.0875636 0.71711
1263 0.153236 0.755306
1264 0.131345 0.742574
1265 0.153236 0.72207
1266 0.0218909 1.01128
1267 0.0647133 1.01958
1268 0.0428224 1.04009
1269 0.108495 0.978574
1270 0.0866043 0.999078
1271 0.0656727 0.970271
1272 0.107536 1.02789
1273 0.196059 0.896555
1274 0.174168 0.91706
1275 0.153236 0.888252
1276 0.109455 0.929261
1277 0.152277 0.937565
1278 0.130386 0.958069
1279 0.151318 0.986877
1280 0.371186 0.732519
1281 0.349295 0.753023
1282 0.328364 0.724216
1283 0.370227 0.781831
1284 0.327404 0.773528
1285 0.239841 0.855546
1286 0.21795 0.876051
1287 0.261731 0.835042
1288 0.282663 0.863849
1289 0.305513 0.794033
1290 0.326445 0.82284
1291 0.283622 0.814537
1292 0.41209 0.839447
1293 0.369267 0.831143
1294 0.391158 0.810639
1295 0.238881 0.904859
1296 0.719226 0.41001
1297 0.732511 0.439296
1298 0.692656 0.351437
1299 0.705941 0.380724
1300 0.772414 0.380724
1301 0.739178 0.380724
1302 0.759129 0.351437
1303 0.639516 0.234291
1304 0.652801 0.263578
1305 0.719274 0.263578
1306 0.686038 0.263578
1307 0.705989 0.234291
1308 0.666086 0.292864
1309 0.679371 0.322151
1310 0.85222 0.263578
1311 0.818984 0.263578
1312 0.838935 0.234291
1313 0.779081 0.322151
1314 0.799032 0.292864
1315 0.812317 0.322151
1316 0.772462 0.234291
1317 0.785747 0.263578
1318 0.752511 0.263578
1319 0.745844 0.322151
1320 0.712608 0.322151
1321 0.732559 0.292864
1322 0.533237 0
1323 0.546521 0.0292864
1324 0.612995 0.0292864
1325 0.579758 0.0292864
1326 0.59971 0
1327 0.559806 0.0585729
1328 0.573091 0.0878593
1329 0.672801 0.0878593
1330 0.692753 0.0585729
1331 0.706038 0.0878593
1332 0.712704 0.0292864
1333 0.679468 0.0292864
1334 0.592995 0.205005
1335 0.612946 0.175719
1336 0.626231 0.205005
1337 0.586376 0.117146
1338 0.599661 0.146432
1339 0.666134 0.146432
1340 0.632898 0.146432
1341 0.652849 0.117146
1342 0.606328 0.0878593
1343 0.646231 0.0292864
1344 0.62628 0.0585729
1345 0.639564 0.0878593
1346 0.978596 0.0292864
1347 0.958645 0.0585729
1348 0.94536 0.0292864
1349 0.858887 0.205005
1350 0.878839 0.175719
1351 0.892124 0.205005
1352 0.852269 0.117146
1353 0.865554 0.146432
1354 0.832317 0.146432
1355 0.932027 0.146432
1356 0.89879 0.146432
1357 0.918742 0.117146
1358 0.805747 0.0878593
1359 0.825699 0.0585729
1360 0.838984 0.0878593
1361 0.812414 0.0292864
1362 0.84565 0.0292864
1363 0.912123 0.0292864
1364 0.892172 0.0585729
1365 0.878887 0.0292864
1366 0.905457 0.0878593
1367 0.938693 0.0878593
1368 0.87222 0.0878593
1369 0.82565 0.205005
1370 0.759177 0.205005
1371 0.792414 0.205005
1372 0.812366 0.175719
1373 0.799081 0.146432
1374 0.659468 0.205005
1375 0.699371 0.146432
1376 0.679419 0.175719
1377 0.692704 0.205005
1378 0.725941 0.205005
1379 0.779177 0.0292864
1380 0.759226 0.0585729
1381 0.745941 0.0292864
1382 0.785796 0.117146
1383 0.772511 0.0878593
1384 0.739274 0.0878593
1385 0.719323 0.117146
1386 0.765844 0.146432
1387 0.745892 0.175719
1388 0.732607 0.146432
1389 0.770842 0.45067
1390 0.750891 0.479956
1391 0.810746 0.392097
1392 0.790794 0.421383
1393 0.827553 0.502703
1394 0.809174 0.462043
1395 0.847505 0.473417
1396 0.90736 0.385557
1397 0.88898 0.344897
1398 0.927311 0.356271
1399 0.850649 0.333524
1400 0.830697 0.362811
1401 0.8706 0.304238
1402 0.980879 0.548196
1403 0.962499 0.507537
1404 1.00083 0.51891
1405 0.885836 0.48479
1406 0.924168 0.496163
1407 0.904216 0.52545
1408 0.964071 0.43759
1409 0.944119 0.466877
1410 0.925739 0.426217
1411 0.867457 0.44413
1412 0.849077 0.40347
1413 0.887408 0.414844
1414 1.05016 0.0406598
1415 1.03021 0.0699462
1416 1.01183 0.0292864
1417 0.97193 0.0878593
1418 1.01026 0.0992327
1419 0.990309 0.128519
1420 0.970358 0.157806
1421 0.950406 0.187092
1422 0.930455 0.216378
1423 0.968786 0.227752
1424 1.03916 0.530283
1425 1.07749 0.541657
1426 1.05754 0.570943
1427 1.1174 0.483084
1428 1.09744 0.51237
1429 1.07906 0.47171
1430 1.11582 0.55303
1431 1.02078 0.489624
1432 0.984022 0.408304
1433 1.0024 0.448964
1434 1.04073 0.460337
1435 1.06068 0.431051
1436 0.910503 0.245665
1437 0.928883 0.286325
1438 0.890552 0.274951
1439 1.00555 0.309071
1440 0.967214 0.297698
1441 0.987166 0.268412
1442 0.947263 0.326984
1443 0.965642 0.367644
1444 1.04231 0.390391
1445 1.08064 0.401764
1446 1.00397 0.379018
1447 1.02393 0.349731
1448 0.299757 1.13399
1449 0.256935 1.12569
1450 0.299757 1.08991
1451 0.17129 1.19725
1452 0.214112 1.16147
1453 0.214112 1.20556
1454 0.214112 1.0733
1455 0.214112 1.11739
1456 0.17129 1.10908
1457 0.0428224 1.17234
1458 0.0856449 1.18065
1459 0.0428224 1.21643
1460 0.128467 1.14486
1461 0.128467 1.10078
1462 0.128467 1.23304
1463 0.128467 1.18895
1464 0.513869 1.26368
1465 0.556692 1.2279
1466 0.556692 1.27198
1467 0.556692 1.13973
1468 0.556692 1.18381
1469 0.513869 1.17551
1470 0.599514 1.19211
1471 0.34258 1.40681
1472 0.385402 1.37102
1473 0.385402 1.41511
1474 0.385402 1.28285
1475 0.385402 1.32694
1476 0.34258 1.31864
1477 0.471047 1.34355
1478 0.428224 1.33524
1479 0.471047 1.29946
1480 0.385402 1.10651
1481 0.385402 1.1506
1482 0.34258 1.14229
1483 0.471047 1.1672
1484 0.428224 1.1589
1485 0.471047 1.12312
1486 0.34258 1.23047
1487 0.385402 1.19468
1488 0.385402 1.23877
1489 0.471047 1.21129
1490 0.428224 1.24707
1491 0.471047 1.25537
1492 0.299757 1.17808
1493 0.299757 1.26625
1494 0.299757 1.22216
1495 0.256935 1.21386
1496 0.214112 1.24964
1497 0.299757 1.3985
1498 0.256935 1.3902
1499 0.299757 1.35442
1500 0.214112 1.29373
1501 0.17129 1.28542
1502 0.299757 1.31033
1503 0.256935 1.30203
1504 0.735478 0.871485
1505 0.773809 0.882859
1506 0.733766 0.914989
1507 0.749178 0.523459
1508 0.710847 0.512086
1509 0.825841 0.546206
1510 0.78751 0.534833
1511 0.707422 0.599093
1512 0.747466 0.566963
1513 0.745753 0.610466
1514 0.979166 0.5917
1515 0.940835 0.580326
1516 0.860747 0.644586
1517 0.900791 0.612456
1518 0.899078 0.655959
1519 0.902503 0.568953
1520 0.864172 0.55758
1521 0.744041 0.653969
1522 0.742328 0.697472
1523 0.703997 0.686099
1524 0.818991 0.720219
1525 0.78066 0.708846
1526 0.820703 0.676716
1527 0.740616 0.740976
1528 0.784085 0.621839
1529 0.824128 0.589709
1530 0.822416 0.633213
1531 1.28582 0.682687
1532 1.24748 0.671313
1533 1.28753 0.639183
1534 1.1674 0.735573
1535 1.20744 0.703443
1536 1.20573 0.746946
1537 1.21087 0.616437
1538 1.20915 0.65994
1539 1.17082 0.648566
1540 1.00722 0.864092
1541 1.04727 0.831963
1542 1.04555 0.875466
1543 1.05069 0.744956
1544 1.04898 0.788459
1545 1.01065 0.777086
1546 1.12564 0.811206
1547 1.08731 0.799833
1548 1.12735 0.767703
1549 1.05583 0.614446
1550 1.0175 0.603073
1551 1.13249 0.637193
1552 1.09416 0.62582
1553 1.1342 0.59369
1554 1.01407 0.690079
1555 1.05412 0.65795
1556 1.0524 0.701453
1557 1.13078 0.680696
1558 1.12907 0.7242
1559 1.09073 0.712826
1560 0.967178 0.896222
1561 0.968891 0.852719
1562 0.892228 0.829972
1563 0.93056 0.841346
1564 0.890516 0.873476
1565 0.970603 0.809216
1566 0.972316 0.765713
1567 0.738903 0.784479
1568 0.777234 0.795852
1569 0.737191 0.827982
1570 0.857322 0.731593
1571 0.817278 0.763722
1572 0.813853 0.850729
1573 0.815566 0.807226
1574 0.853897 0.818599
1575 0.977453 0.635203
1576 0.974028 0.722209
1577 0.975741 0.678706
1578 0.93741 0.667333
1579 0.897366 0.699463
1580 0.933985 0.754339
1581 0.893941 0.786469
1582 0.895653 0.742966
1583 1.30748 0.609897
1584 1.33319 0.569237
1585 1.35157 0.609897
1586 1.29643 0.487917
1587 1.31481 0.528577
1588 1.27072 0.528577
1589 1.40298 0.528577
1590 1.35889 0.528577
1591 1.3846 0.487917
1592 1.22291 0.325278
1593 1.24129 0.365938
1594 1.1972 0.365938
1595 1.32946 0.365938
1596 1.28537 0.365938
1597 1.31108 0.325278
1598 1.23396 0.447258
1599 1.25967 0.406598
1600 1.27805 0.447258
1601 1.4103 0.447258
1602 1.43601 0.406598
1603 1.45439 0.447258
1604 1.32213 0.447258
1605 1.36622 0.447258
1606 1.34784 0.406598
1607 1.08692 0.121979
1608 1.11263 0.0813196
1609 1.13101 0.121979
1610 1.09425 0.0406598
1611 1.13833 0.0406598
1612 1.31468 0.0406598
1613 1.28897 0.0813196
1614 1.27059 0.0406598
1615 1.16044 0.284619
1616 1.18615 0.243959
1617 1.20453 0.284619
1618 1.14939 0.162639
1619 1.16777 0.203299
1620 1.12368 0.203299
1621 1.25594 0.203299
1622 1.21185 0.203299
1623 1.23756 0.162639
1624 1.22651 0.0406598
1625 1.2008 0.0813196
1626 1.18242 0.0406598
1627 1.17509 0.121979
1628 1.21918 0.121979
1629 1.24861 0.284619
1630 1.27432 0.243959
1631 1.2927 0.284619
1632 1.40285 0.0406598
1633 1.37714 0.0813196
1634 1.35876 0.0406598
1635 0.688203 0.526782
1636 0.684778 0.613788
1637 0.68649 0.570285
1638 0.665559 0.541477
1639 0.677928 0.787801
1640 0.67964 0.744298
1641 0.700572 0.773106
1642 0.637777 0.686682
1643 0.658709 0.71549
1644 0.636065 0.730186
1645 0.681353 0.700795
1646 0.683065 0.657291
1647 0.574983 0.600259
1648 0.552339 0.614955
1649 0.620271 0.570868
1650 0.597627 0.585564
1651 0.594202 0.67257
1652 0.595914 0.629067
1653 0.616846 0.657875
1654 0.642915 0.556173
1655 0.641202 0.599676
1656 0.63949 0.643179
1657 0.662134 0.628484
1658 0.690297 1.03412
1659 0.667653 1.04882
1660 0.669365 1.00532
1661 0.540351 0.919477
1662 0.561282 0.948285
1663 0.538638 0.962981
1664 0.606571 0.918894
1665 0.583926 0.93359
1666 0.585639 0.890086
1667 0.582214 0.977093
1668 0.697147 0.860112
1669 0.674503 0.874808
1670 0.676215 0.831304
1671 0.671078 0.961814
1672 0.67279 0.918311
1673 0.693722 0.947118
1674 0.630927 0.860695
1675 0.651859 0.889503
1676 0.629215 0.904199
1677 0.627502 0.947702
1678 0.648434 0.976509
1679 0.62579 0.991205
1680 0.372899 0.689016
1681 0.39383 0.717823
1682 0.439118 0.688432
1683 0.416474 0.703128
1684 0.418187 0.659625
1685 0.413049 0.790134
1686 0.414762 0.746631
1687 0.435693 0.775439
1688 0.529694 0.62965
1689 0.50705 0.644346
1690 0.503625 0.731352
1691 0.505338 0.687849
1692 0.526269 0.716657
1693 0.463475 0.630234
1694 0.484406 0.659041
1695 0.461762 0.673737
1696 0.496775 0.905365
1697 0.498488 0.861862
1698 0.519419 0.89067
1699 0.456625 0.804246
1700 0.477556 0.833054
1701 0.454912 0.84775
1702 0.522844 0.803663
1703 0.5002 0.818359
1704 0.501913 0.774855
1705 0.458337 0.760743
1706 0.46005 0.71724
1707 0.480981 0.746048
1708 0.550626 0.658458
1709 0.592489 0.716073
1710 0.571558 0.687266
1711 0.548914 0.701961
1712 0.547201 0.745464
1713 0.655284 0.802497
1714 0.609996 0.831888
1715 0.63264 0.817192
1716 0.634352 0.773689
1717 0.613421 0.744881
1718 0.542063 0.875974
1719 0.545488 0.788968
1720 0.543776 0.832471
1721 0.564707 0.861279
1722 0.587352 0.846583
1723 0.568133 0.774272
1724 0.590777 0.759577
1725 0.589064 0.80308
1726 1.40761 0.614946
1727 1.43332 0.574287
1728 1.46365 0.619996
1729 0.567272 1.33484
1730 0.577853 1.39769
1731 0.52445 1.37062
1732 1.3819 0.655606
1733 1.39691 0.71112
1734 1.34087 0.70607
1735 1.509 0.721219
1736 1.45295 0.716169
1737 1.49399 0.665706
1738 1.37088 0.817097
1739 1.41191 0.766633
1740 1.42692 0.822147
1741 1.60608 0.675805
1742 1.62108 0.731318
1743 1.56504 0.726269
1744 1.48296 0.827196
1745 1.44193 0.87766
1746 1.524 0.776732
1747 1.53901 0.832246
1748 1.30082 0.7382
1749 1.33083 0.849227
1750 1.31583 0.793713
1751 1.26078 0.77033
1752 1.40089 0.928124
1753 1.36084 0.960254
1754 1.34584 0.90474
1755 1.1006 0.898849
1756 1.06056 0.930979
1757 1.18069 0.83459
1758 1.14065 0.866719
1759 1.17066 0.977746
1760 1.15565 0.922233
1761 1.2107 0.945616
1762 1.22073 0.80246
1763 1.23574 0.857973
1764 1.29079 0.881357
1765 1.25075 0.913487
1766 0.725203 1.1325
1767 0.780252 1.15589
1768 0.740208 1.18802
1769 0.86034 1.09163
1770 0.820296 1.12376
1771 0.805291 1.06824
1772 1.02052 0.963109
1773 0.980471 0.995239
1774 0.965466 0.939726
1775 0.885378 1.00399
1776 0.940427 1.02737
1777 0.900384 1.0595
1778 4 0.115052
1779 3.94648 0.171904
1780 3.94648 0.0568524
1781 3.94648 0.977269
1782 3.89296 0.919069
1783 3.94648 0.862217
1784 1.49237 3.8914
1785 1.26227 3.8914
1786 1.37402 3.78281
1787 3.85717 1.85773
1788 3.75013 1.74133
1789 3.89296 1.72443
1790 2.5623 2.64672
1791 2.45283 2.75115
1792 2.31 2.49815
1793 3.03355 2.58644
1794 3.28585 2.73501
1795 2.89072 2.33344
1796 2.78125 2.43786
1797 3.85717 2.66742
1798 3.85717 2.39752
1799 4 2.65052
1800 3.57151 1.89152
1801 3.71434 2.14452
1802 3.57151 2.16142
1803 0.0856449 1.09248
1804 0.128467 1.05669
1805 0.0428224 1.08417
1806 0.0428224 1.12826
1807 0.0428224 1.3046
1808 0.0428224 1.26051
1809 0.0856449 1.26882
1810 1.18904 1.72883
1811 2.0752 0
1812 2.05023 1.70274
1813 2.13231 1.60181
1814 2.21438 1.50088
1815 0.55874 3.45702
1816 0.788845 3.45702
1817 4 1.15052
1818 1.94076 1.80716
1819 1.83128 1.91159
1820 2.67178 2.54229
1821 2.29373 1.65646
1822 0.900593 3.34842
1823 1.14117 2.4507
1824 4 1.61073
1825 0.325359 2.58312
1826 0.330302 2.70323
1827 0.446992 3.39544
1828 0.335244 3.16369
1829 0.335244 3.33387
1830 3.48948 0
1831 0 2.52594
1832 0 2.30057
1833 2.52594 0
1834 2.4826 0.274256
1835 2.30057 0
1836 2.49373 0.47938
1837 2.62 0.70679
1838 1.40304 2.09376
1839 2.72669 1.10937
1840 2.10218 1.86182
1841 1.88324 2.07067
1842 0.762467 2.58919
1843 0 2.80879
1844 0 3.14914
1845 0 3.48948
1846 2.80879 0
1847 3.14914 0
1848 2.81461 2.79529
1849 2.95743 3.04829
1850 3.42868 2.71811
1851 3.57151 2.43132
1852 0.32857 0.669094
1853 0.373723 0.601476
1854 0.463887 0.586464
1855 0.463681 0.608349
1856 0.64504 0.4689
1857 0.554463 0.527682
1858 0.509175 0.557073
1859 0.328364 0.690979
1860 0 0.799129
1861 0.0656727 0.804088
1862 0.153236 0.855016
1863 0.109455 0.829552
1864 0.150358 1.03619
1865 0.195099 0.945868
1866 0.433021 0.868254
1867 0.347376 0.851648
1868 0.732656 0
1869 0.666183 0
1870 0.998548 0
1871 0.932075 0
1872 0.799129 0
1873 0.865602 0
1874 1.04859 0.110606
1875 1.00712 0.239125
1876 1.00869 0.169179
1877 1.26915 0.598523
1878 1.15416 0.564403
1879 1.04388 0.320445
1880 0.299757 1.44259
1881 0.214112 1.33781
1882 0.812141 0.894232
1883 0.732053 0.958492
1884 0.927135 0.928352
1885 1.37354 0.365938
1886 1.07587 0
1887 1.16404 0
1888 1.34038 0
1889 1.25221 0
1890 1.26326 0.121979
1891 1.30002 0.203299
1892 1.33678 0.284619
1893 1.45902 0.533627
1894 1.5197 0.625046
1895 0.610095 1.29905
1896 0.481627 1.4064
1897 1.45693 0.933173
1898 1.26575 0.969
1899 0.835301 1.17927
1900 0.995477 1.05075
1901 1.07556 0.986493
1902 3.85717 2.12763
1903 0 1.07587
1904 0 1.16404
1905 0 1.25221
1906 0.128467 1.27712
1907 0.915389 1.11501
1908 2.0498 0.629833
1909 1.98912 0.538414
1910 0.619673 1.93631
1911 0 2.0752
1912 2.46061 1.1981
1913 1.25566 3.67421
1914 2.49641 1.0648
1915 3.25075 1.02604
1916 3.57185 1.14513
1917 3.82983 0
1918 3.50872 0.341115
1919 3.40168 0.454819
1920 0 3.82983
1921 0.335244 3.50404
1922 1.15052 4
1923 2.14857 2.44349
1924 1.01234 3.23983
1925 2.57576 1.22038
1926 0.44205 2.76481
1927 0.350461 0.681826
1928 0.373105 0.667131
1929 0.441037 0.623044
1930 0.0656727 0.837325
1931 0.131345 0.87552
1932 1.06697 0.151266
1933 0.128467 1.32121
1934 1.30735 0.121979
1935 1.48576 3.67421
1936 4 2.11073
1937 3.46482 1.25884