%!PS-Adobe-3.0 EPSF-3.0
%%Creator: MATLAB, The Mathworks, Inc. Version 7.3.0.298 (R2006b). Operating System: Linux 2.6.19-gentoo-r5 #2 SMP Wed Jan 31 08:26:24 CET 2007 x86_64.
%%Title: /home/mueli/svn/mueli-da/src_images/th_cyl_anal_img.eps
%%CreationDate: 02/13/2007  09:17:05
%%DocumentNeededFonts: Helvetica
%%DocumentProcessColors: Cyan Magenta Yellow Black
%%LanguageLevel: 2
%%Pages: 1
%%BoundingBox:   192   282   419   509
%%EndComments

%%BeginProlog
% MathWorks dictionary
/MathWorks 160 dict begin
% definition operators
/bdef {bind def} bind def
/ldef {load def} bind def
/xdef {exch def} bdef
/xstore {exch store} bdef
% operator abbreviations
/c  /clip ldef
/cc /concat ldef
/cp /closepath ldef
/gr /grestore ldef
/gs /gsave ldef
/mt /moveto ldef
/np /newpath ldef
/cm /currentmatrix ldef
/sm /setmatrix ldef
/rm /rmoveto ldef
/rl /rlineto ldef
/s {show newpath} bdef
/sc {setcmykcolor} bdef
/sr /setrgbcolor ldef
/sg /setgray ldef
/w /setlinewidth ldef
/j /setlinejoin ldef
/cap /setlinecap ldef
/rc {rectclip} bdef
/rf {rectfill} bdef
% page state control
/pgsv () def
/bpage {/pgsv save def} bdef
/epage {pgsv restore} bdef
/bplot /gsave ldef
/eplot {stroke grestore} bdef
% orientation switch
/portraitMode 0 def /landscapeMode 1 def /rotateMode 2 def
% coordinate system mappings
/dpi2point 0 def
% font control
/FontSize 0 def
/FMS {/FontSize xstore findfont [FontSize 0 0 FontSize neg 0 0]
  makefont setfont} bdef
/reencode {exch dup where {pop load} {pop StandardEncoding} ifelse
  exch dup 3 1 roll findfont dup length dict begin
  { 1 index /FID ne {def}{pop pop} ifelse } forall
  /Encoding exch def currentdict end definefont pop} bdef
/isroman {findfont /CharStrings get /Agrave known} bdef
/FMSR {3 1 roll 1 index dup isroman {reencode} {pop pop} ifelse
  exch FMS} bdef
/csm {1 dpi2point div -1 dpi2point div scale neg translate
 dup landscapeMode eq {pop -90 rotate}
  {rotateMode eq {90 rotate} if} ifelse} bdef
% line types: solid, dotted, dashed, dotdash
/SO { [] 0 setdash } bdef
/DO { [.5 dpi2point mul 4 dpi2point mul] 0 setdash } bdef
/DA { [6 dpi2point mul] 0 setdash } bdef
/DD { [.5 dpi2point mul 4 dpi2point mul 6 dpi2point mul 4
  dpi2point mul] 0 setdash } bdef
% macros for lines and objects
/L {lineto stroke} bdef
/MP {3 1 roll moveto 1 sub {rlineto} repeat} bdef
/AP {{rlineto} repeat} bdef
/PDlw -1 def
/W {/PDlw currentlinewidth def setlinewidth} def
/PP {closepath eofill} bdef
/DP {closepath stroke} bdef
/MR {4 -2 roll moveto dup  0 exch rlineto exch 0 rlineto
  neg 0 exch rlineto closepath} bdef
/FR {MR stroke} bdef
/PR {MR fill} bdef
/L1i {{currentfile picstr readhexstring pop} image} bdef
/tMatrix matrix def
/MakeOval {newpath tMatrix currentmatrix pop translate scale
0 0 1 0 360 arc tMatrix setmatrix} bdef
/FO {MakeOval stroke} bdef
/PO {MakeOval fill} bdef
/PD {currentlinewidth 2 div 0 360 arc fill
   PDlw -1 eq not {PDlw w /PDlw -1 def} if} def
/FA {newpath tMatrix currentmatrix pop translate scale
  0 0 1 5 -2 roll arc tMatrix setmatrix stroke} bdef
/PA {newpath tMatrix currentmatrix pop	translate 0 0 moveto scale
  0 0 1 5 -2 roll arc closepath tMatrix setmatrix fill} bdef
/FAn {newpath tMatrix currentmatrix pop translate scale
  0 0 1 5 -2 roll arcn tMatrix setmatrix stroke} bdef
/PAn {newpath tMatrix currentmatrix pop translate 0 0 moveto scale
  0 0 1 5 -2 roll arcn closepath tMatrix setmatrix fill} bdef
/vradius 0 def /hradius 0 def /lry 0 def
/lrx 0 def /uly 0 def /ulx 0 def /rad 0 def
/MRR {/vradius xdef /hradius xdef /lry xdef /lrx xdef /uly xdef
  /ulx xdef newpath tMatrix currentmatrix pop ulx hradius add uly
  vradius add translate hradius vradius scale 0 0 1 180 270 arc 
  tMatrix setmatrix lrx hradius sub uly vradius add translate
  hradius vradius scale 0 0 1 270 360 arc tMatrix setmatrix
  lrx hradius sub lry vradius sub translate hradius vradius scale
  0 0 1 0 90 arc tMatrix setmatrix ulx hradius add lry vradius sub
  translate hradius vradius scale 0 0 1 90 180 arc tMatrix setmatrix
  closepath} bdef
/FRR {MRR stroke } bdef
/PRR {MRR fill } bdef
/MlrRR {/lry xdef /lrx xdef /uly xdef /ulx xdef /rad lry uly sub 2 div def
  newpath tMatrix currentmatrix pop ulx rad add uly rad add translate
  rad rad scale 0 0 1 90 270 arc tMatrix setmatrix lrx rad sub lry rad
  sub translate rad rad scale 0 0 1 270 90 arc tMatrix setmatrix
  closepath} bdef
/FlrRR {MlrRR stroke } bdef
/PlrRR {MlrRR fill } bdef
/MtbRR {/lry xdef /lrx xdef /uly xdef /ulx xdef /rad lrx ulx sub 2 div def
  newpath tMatrix currentmatrix pop ulx rad add uly rad add translate
  rad rad scale 0 0 1 180 360 arc tMatrix setmatrix lrx rad sub lry rad
  sub translate rad rad scale 0 0 1 0 180 arc tMatrix setmatrix
  closepath} bdef
/FtbRR {MtbRR stroke } bdef
/PtbRR {MtbRR fill } bdef
/stri 6 array def /dtri 6 array def
/smat 6 array def /dmat 6 array def
/tmat1 6 array def /tmat2 6 array def /dif 3 array def
/asub {/ind2 exch def /ind1 exch def dup dup
  ind1 get exch ind2 get sub exch } bdef
/tri_to_matrix {
  2 0 asub 3 1 asub 4 0 asub 5 1 asub
  dup 0 get exch 1 get 7 -1 roll astore } bdef
/compute_transform {
  dmat dtri tri_to_matrix tmat1 invertmatrix 
  smat stri tri_to_matrix tmat2 concatmatrix } bdef
/ds {stri astore pop} bdef
/dt {dtri astore pop} bdef
/db {2 copy /cols xdef /rows xdef mul dup 3 mul string
  currentfile 
  3 index 0 eq {/ASCIIHexDecode filter}
  {/ASCII85Decode filter 3 index 2 eq {/RunLengthDecode filter} if }
  ifelse exch readstring pop
  dup 0 3 index getinterval /rbmap xdef
  dup 2 index dup getinterval /gbmap xdef
  1 index dup 2 mul exch getinterval /bbmap xdef pop pop}bdef
/it {gs np dtri aload pop moveto lineto lineto cp c
  cols rows 8 compute_transform 
  rbmap gbmap bbmap true 3 colorimage gr}bdef
/il {newpath moveto lineto stroke}bdef
currentdict end def
%%EndProlog

%%BeginSetup
MathWorks begin

0 cap

end
%%EndSetup

%%Page: 1 1
%%BeginPageSetup
%%PageBoundingBox:   192   282   419   509
MathWorks begin
bpage
%%EndPageSetup

%%BeginObject: obj1
bplot

/dpi2point 12 def
portraitMode 2304 6108 csm

    0     0  2727  2724 rc
85 dict begin %Colortable dictionary
/c0 { 0.000000 0.000000 0.000000 sr} bdef
/c1 { 1.000000 1.000000 1.000000 sr} bdef
/c2 { 0.900000 0.000000 0.000000 sr} bdef
/c3 { 0.000000 0.820000 0.000000 sr} bdef
/c4 { 0.000000 0.000000 0.800000 sr} bdef
/c5 { 0.910000 0.820000 0.320000 sr} bdef
/c6 { 1.000000 0.260000 0.820000 sr} bdef
/c7 { 0.000000 0.820000 0.820000 sr} bdef
c0
1 j
1 sg
   0    0 2728 2725 rf
6 w
0 2220 2113 0 0 -2220 355 2424 4 MP
PP
-2113 0 0 2220 2113 0 0 -2220 355 2424 5 MP stroke
4 w
DO
0 sg
 355 2424 mt  355  204 L
 355  204 mt  355  204 L
1059 2424 mt 1059  204 L
1059  204 mt 1059  204 L
1763 2424 mt 1763  204 L
1763  204 mt 1763  204 L
2468 2424 mt 2468  204 L
2468  204 mt 2468  204 L
 355 2424 mt 2468 2424 L
2468 2424 mt 2468 2424 L
 355 1980 mt 2468 1980 L
2468 1980 mt 2468 1980 L
 355 1536 mt 2468 1536 L
2468 1536 mt 2468 1536 L
 355 1092 mt 2468 1092 L
2468 1092 mt 2468 1092 L
 355  648 mt 2468  648 L
2468  648 mt 2468  648 L
 355  204 mt 2468  204 L
2468  204 mt 2468  204 L
SO
6 w
 355 2424 mt 2468 2424 L
 355  204 mt 2468  204 L
 355 2424 mt  355  204 L
2468 2424 mt 2468  204 L
 355 2424 mt 2468 2424 L
 355 2424 mt  355  204 L
 355 2424 mt  355 2401 L
 355  204 mt  355  226 L
%%IncludeResource: font Helvetica
/Helvetica /ISOLatin1Encoding 96 FMSR

 329 2547 mt 
(5) s
1059 2424 mt 1059 2401 L
1059  204 mt 1059  226 L
1006 2547 mt 
(10) s
1763 2424 mt 1763 2401 L
1763  204 mt 1763  226 L
1710 2547 mt 
(15) s
2468 2424 mt 2468 2401 L
2468  204 mt 2468  226 L
2415 2547 mt 
(20) s
 355 2424 mt  377 2424 L
2468 2424 mt 2445 2424 L
 211 2459 mt 
(-1) s
 355 1980 mt  377 1980 L
2468 1980 mt 2445 1980 L
 131 2015 mt 
(-0.5) s
 355 1536 mt  377 1536 L
2468 1536 mt 2445 1536 L
 267 1571 mt 
(0) s
 355 1092 mt  377 1092 L
2468 1092 mt 2445 1092 L
 187 1127 mt 
(0.5) s
 355  648 mt  377  648 L
2468  648 mt 2445  648 L
 267  683 mt 
(1) s
 355  204 mt  377  204 L
2468  204 mt 2445  204 L
 187  239 mt 
(1.5) s
 355 2424 mt 2468 2424 L
 355  204 mt 2468  204 L
 355 2424 mt  355  204 L
2468 2424 mt 2468  204 L
gs 355 204 2114 2221 rc
/c8 { 0.000000 0.000000 1.000000 sr} bdef
c8
71 -3 70 -3 71 -3 70 -4 71 -5 70 -4 71 -5 70 -6 
70 -6 71 -7 70 -7 71 -8 70 -9 71 -10 70 -12 70 -13 
71 -14 70 -17 71 -19 70 -22 71 -26 70 -30 70 -35 71 -42 
70 -51 71 -63 70 -77 71 -97 70 -125 70 -165 355 2424 31 MP stroke
/c9 { 0.000000 0.500000 0.000000 sr} bdef
c9
71 3 70 3 71 4 70 4 71 4 70 5 71 5 70 5 
70 6 71 7 70 7 71 9 70 9 71 10 70 11 70 13 
71 15 70 16 71 19 70 22 71 26 70 30 70 35 71 43 
70 51 71 62 70 77 71 97 70 126 70 164 355 529 31 MP stroke
gr

c9
0 sg
 342 2459 mt 
( ) s
2456  238 mt 
( ) s
1 sg
0 278 868 0 0 -278 1541 542 4 MP
PP
-868 0 0 278 868 0 0 -278 1541 542 5 MP stroke
4 w
DO
SO
6 w
0 sg
1541  542 mt 2409  542 L
1541  264 mt 2409  264 L
1541  542 mt 1541  264 L
2409  542 mt 2409  264 L
1541  542 mt 2409  542 L
1541  542 mt 1541  264 L
1541  542 mt 2409  542 L
1541  264 mt 2409  264 L
1541  542 mt 1541  264 L
2409  542 mt 2409  264 L
2025  375 mt 
(sigmarr) s
gs 1541 264 869 279 rc
c8
372 0 1615 341 2 MP stroke
gr

c8
0 sg
2025  500 mt 
(sigmapp) s
gs 1541 264 869 279 rc
c9
372 0 1615 464 2 MP stroke
gr

c9

end %%Color Dict

eplot
%%EndObject

epage
end

showpage

%%Trailer
%%EOF
