%!PS-Adobe-3.0 EPSF-3.0
%%Creator: MATLAB, The Mathworks, Inc. Version 7.3.0.298 (R2006b). Operating System: Linux 2.6.19-gentoo-r5 #2 SMP Wed Jan 31 08:26:24 CET 2007 x86_64.
%%Title: /home/mueli/svn/mueli-da/src_images/th_cyl_2_sigma_rr_img.eps
%%CreationDate: 02/13/2007  08:34:27
%%DocumentNeededFonts: Helvetica
%%DocumentProcessColors: Cyan Magenta Yellow Black
%%LanguageLevel: 2
%%Pages: 1
%%BoundingBox:   110   300   500   492
%%EndComments

%%BeginProlog
% MathWorks dictionary
/MathWorks 160 dict begin
% definition operators
/bdef {bind def} bind def
/ldef {load def} bind def
/xdef {exch def} bdef
/xstore {exch store} bdef
% operator abbreviations
/c  /clip ldef
/cc /concat ldef
/cp /closepath ldef
/gr /grestore ldef
/gs /gsave ldef
/mt /moveto ldef
/np /newpath ldef
/cm /currentmatrix ldef
/sm /setmatrix ldef
/rm /rmoveto ldef
/rl /rlineto ldef
/s {show newpath} bdef
/sc {setcmykcolor} bdef
/sr /setrgbcolor ldef
/sg /setgray ldef
/w /setlinewidth ldef
/j /setlinejoin ldef
/cap /setlinecap ldef
/rc {rectclip} bdef
/rf {rectfill} bdef
% page state control
/pgsv () def
/bpage {/pgsv save def} bdef
/epage {pgsv restore} bdef
/bplot /gsave ldef
/eplot {stroke grestore} bdef
% orientation switch
/portraitMode 0 def /landscapeMode 1 def /rotateMode 2 def
% coordinate system mappings
/dpi2point 0 def
% font control
/FontSize 0 def
/FMS {/FontSize xstore findfont [FontSize 0 0 FontSize neg 0 0]
  makefont setfont} bdef
/reencode {exch dup where {pop load} {pop StandardEncoding} ifelse
  exch dup 3 1 roll findfont dup length dict begin
  { 1 index /FID ne {def}{pop pop} ifelse } forall
  /Encoding exch def currentdict end definefont pop} bdef
/isroman {findfont /CharStrings get /Agrave known} bdef
/FMSR {3 1 roll 1 index dup isroman {reencode} {pop pop} ifelse
  exch FMS} bdef
/csm {1 dpi2point div -1 dpi2point div scale neg translate
 dup landscapeMode eq {pop -90 rotate}
  {rotateMode eq {90 rotate} if} ifelse} bdef
% line types: solid, dotted, dashed, dotdash
/SO { [] 0 setdash } bdef
/DO { [.5 dpi2point mul 4 dpi2point mul] 0 setdash } bdef
/DA { [6 dpi2point mul] 0 setdash } bdef
/DD { [.5 dpi2point mul 4 dpi2point mul 6 dpi2point mul 4
  dpi2point mul] 0 setdash } bdef
% macros for lines and objects
/L {lineto stroke} bdef
/MP {3 1 roll moveto 1 sub {rlineto} repeat} bdef
/AP {{rlineto} repeat} bdef
/PDlw -1 def
/W {/PDlw currentlinewidth def setlinewidth} def
/PP {closepath eofill} bdef
/DP {closepath stroke} bdef
/MR {4 -2 roll moveto dup  0 exch rlineto exch 0 rlineto
  neg 0 exch rlineto closepath} bdef
/FR {MR stroke} bdef
/PR {MR fill} bdef
/L1i {{currentfile picstr readhexstring pop} image} bdef
/tMatrix matrix def
/MakeOval {newpath tMatrix currentmatrix pop translate scale
0 0 1 0 360 arc tMatrix setmatrix} bdef
/FO {MakeOval stroke} bdef
/PO {MakeOval fill} bdef
/PD {currentlinewidth 2 div 0 360 arc fill
   PDlw -1 eq not {PDlw w /PDlw -1 def} if} def
/FA {newpath tMatrix currentmatrix pop translate scale
  0 0 1 5 -2 roll arc tMatrix setmatrix stroke} bdef
/PA {newpath tMatrix currentmatrix pop	translate 0 0 moveto scale
  0 0 1 5 -2 roll arc closepath tMatrix setmatrix fill} bdef
/FAn {newpath tMatrix currentmatrix pop translate scale
  0 0 1 5 -2 roll arcn tMatrix setmatrix stroke} bdef
/PAn {newpath tMatrix currentmatrix pop translate 0 0 moveto scale
  0 0 1 5 -2 roll arcn closepath tMatrix setmatrix fill} bdef
/vradius 0 def /hradius 0 def /lry 0 def
/lrx 0 def /uly 0 def /ulx 0 def /rad 0 def
/MRR {/vradius xdef /hradius xdef /lry xdef /lrx xdef /uly xdef
  /ulx xdef newpath tMatrix currentmatrix pop ulx hradius add uly
  vradius add translate hradius vradius scale 0 0 1 180 270 arc 
  tMatrix setmatrix lrx hradius sub uly vradius add translate
  hradius vradius scale 0 0 1 270 360 arc tMatrix setmatrix
  lrx hradius sub lry vradius sub translate hradius vradius scale
  0 0 1 0 90 arc tMatrix setmatrix ulx hradius add lry vradius sub
  translate hradius vradius scale 0 0 1 90 180 arc tMatrix setmatrix
  closepath} bdef
/FRR {MRR stroke } bdef
/PRR {MRR fill } bdef
/MlrRR {/lry xdef /lrx xdef /uly xdef /ulx xdef /rad lry uly sub 2 div def
  newpath tMatrix currentmatrix pop ulx rad add uly rad add translate
  rad rad scale 0 0 1 90 270 arc tMatrix setmatrix lrx rad sub lry rad
  sub translate rad rad scale 0 0 1 270 90 arc tMatrix setmatrix
  closepath} bdef
/FlrRR {MlrRR stroke } bdef
/PlrRR {MlrRR fill } bdef
/MtbRR {/lry xdef /lrx xdef /uly xdef /ulx xdef /rad lrx ulx sub 2 div def
  newpath tMatrix currentmatrix pop ulx rad add uly rad add translate
  rad rad scale 0 0 1 180 360 arc tMatrix setmatrix lrx rad sub lry rad
  sub translate rad rad scale 0 0 1 0 180 arc tMatrix setmatrix
  closepath} bdef
/FtbRR {MtbRR stroke } bdef
/PtbRR {MtbRR fill } bdef
/stri 6 array def /dtri 6 array def
/smat 6 array def /dmat 6 array def
/tmat1 6 array def /tmat2 6 array def /dif 3 array def
/asub {/ind2 exch def /ind1 exch def dup dup
  ind1 get exch ind2 get sub exch } bdef
/tri_to_matrix {
  2 0 asub 3 1 asub 4 0 asub 5 1 asub
  dup 0 get exch 1 get 7 -1 roll astore } bdef
/compute_transform {
  dmat dtri tri_to_matrix tmat1 invertmatrix 
  smat stri tri_to_matrix tmat2 concatmatrix } bdef
/ds {stri astore pop} bdef
/dt {dtri astore pop} bdef
/db {2 copy /cols xdef /rows xdef mul dup 3 mul string
  currentfile 
  3 index 0 eq {/ASCIIHexDecode filter}
  {/ASCII85Decode filter 3 index 2 eq {/RunLengthDecode filter} if }
  ifelse exch readstring pop
  dup 0 3 index getinterval /rbmap xdef
  dup 2 index dup getinterval /gbmap xdef
  1 index dup 2 mul exch getinterval /bbmap xdef pop pop}bdef
/it {gs np dtri aload pop moveto lineto lineto cp c
  cols rows 8 compute_transform 
  rbmap gbmap bbmap true 3 colorimage gr}bdef
/il {newpath moveto lineto stroke}bdef
currentdict end def
%%EndProlog

%%BeginSetup
MathWorks begin

0 cap

end
%%EndSetup

%%Page: 1 1
%%BeginPageSetup
%%PageBoundingBox:   110   300   500   492
MathWorks begin
bpage
%%EndPageSetup

%%BeginObject: obj1
bplot

/dpi2point 12 def
portraitMode 1320 5904 csm

    0     0  4689  2297 rc
87 dict begin %Colortable dictionary
/c0 { 0.000000 0.000000 0.000000 sr} bdef
/c1 { 1.000000 1.000000 1.000000 sr} bdef
/c2 { 0.900000 0.000000 0.000000 sr} bdef
/c3 { 0.000000 0.820000 0.000000 sr} bdef
/c4 { 0.000000 0.000000 0.800000 sr} bdef
/c5 { 0.910000 0.820000 0.320000 sr} bdef
/c6 { 1.000000 0.260000 0.820000 sr} bdef
/c7 { 0.000000 0.820000 0.820000 sr} bdef
c0
1 j
1 sg
   0    0 4690 2298 rf
6 w
0 1872 3634 0 0 -1872 610 2044 4 MP
PP
-3634 0 0 1872 3634 0 0 -1872 610 2044 5 MP stroke
4 w
DO
SO
6 w
0 sg
 610 2044 mt 4244 2044 L
 610 2044 mt  610  172 L
 610 2044 mt  610 2007 L
%%IncludeResource: font Helvetica
/Helvetica /ISOLatin1Encoding 96 FMSR

 584 2167 mt 
(5) s
1821 2044 mt 1821 2007 L
1768 2167 mt 
(10) s
3032 2044 mt 3032 2007 L
2979 2167 mt 
(15) s
4244 2044 mt 4244 2007 L
4191 2167 mt 
(20) s
 610 2044 mt  646 2044 L
 279 2079 mt 
(-0.015) s
 610 1810 mt  646 1810 L
 333 1845 mt 
(-0.01) s
 610 1576 mt  646 1576 L
 279 1611 mt 
(-0.005) s
 610 1342 mt  646 1342 L
 522 1377 mt 
(0) s
 610 1108 mt  646 1108 L
 335 1143 mt 
(0.005) s
 610  874 mt  646  874 L
 389  909 mt 
(0.01) s
 610  640 mt  646  640 L
 335  675 mt 
(0.015) s
 610  405 mt  646  405 L
 389  440 mt 
(0.02) s
 610  172 mt  646  172 L
 335  207 mt 
(0.025) s
gs 610 172 3635 1873 rc
/c8 { 1.000000 0.000000 0.000000 sr} bdef
c8
959 -119 958 670 546 -1117 547 1455 312 -889 312 -681 610 1870 7 MP stroke
/c9 { 0.000000 1.000000 0.000000 sr} bdef
c9
480 -36 479 123 479 -133 479 247 273 -174 273 58 274 -326 273 586 
156 -28 156 -160 156 -216 156 -151 610 1546 13 MP stroke
/c10 { 0.000000 0.000000 1.000000 sr} bdef
c10
240 -12 240 30 239 -32 240 45 239 -55 240 62 239 -60 240 73 
136 -42 137 4 137 -14 136 17 137 -22 137 52 137 -129 136 184 
78 -9 78 -72 78 81 78 -127 78 174 78 -163 78 25 78 -87 
610 1417 25 MP stroke
/c11 { 0.000000 1.000000 1.000000 sr} bdef
c11
240 -12 240 30 239 -32 240 37 239 -60 240 91 239 -78 240 60 
136 -41 137 22 68 -19 69 3 68 -2 68 3 69 -2 68 3 
68 -3 69 5 68 -6 69 19 68 -42 68 45 39 13 39 -32 
39 17 39 -25 39 28 39 -30 39 35 39 -37 39 43 39 -44 
39 53 39 -55 39 65 39 -60 39 17 39 -34 610 1365 39 MP stroke
gr

c11
0 sg
 597 2079 mt 
( ) s
4232  206 mt 
( ) s
1 sg
0 514 799 0 0 -514 3386 746 4 MP
PP
-799 0 0 514 799 0 0 -514 3386 746 5 MP stroke
4 w
DO
SO
6 w
0 sg
3386  746 mt 4185  746 L
3386  232 mt 4185  232 L
3386  746 mt 3386  232 L
4185  746 mt 4185  232 L
3386  746 mt 4185  746 L
3386  746 mt 3386  232 L
3386  746 mt 4185  746 L
3386  232 mt 4185  232 L
3386  746 mt 3386  232 L
4185  746 mt 4185  232 L
3861  342 mt 
(refine0) s
gs 3386 232 800 515 rc
c8
365 0 3458 307 2 MP stroke
gr

c8
0 sg
3861  463 mt 
(refine1) s
gs 3386 232 800 515 rc
c9
365 0 3458 428 2 MP stroke
gr

c9
0 sg
3861  584 mt 
(refine2) s
gs 3386 232 800 515 rc
c10
365 0 3458 549 2 MP stroke
gr

c10
0 sg
3861  705 mt 
(refine3) s
gs 3386 232 800 515 rc
c11
365 0 3458 670 2 MP stroke
gr

c11

end %%Color Dict

eplot
%%EndObject

epage
end

showpage

%%Trailer
%%EOF
