%!PS-Adobe-3.0 EPSF-3.0
%%Creator: MATLAB, The Mathworks, Inc. Version 7.3.0.298 (R2006b). Operating System: Linux 2.6.19-gentoo-r5 #2 SMP Wed Jan 31 08:26:24 CET 2007 x86_64.
%%Title: /home/mueli/svn/mueli-da/src_images/kirsch_1_sigma_pp_pi2_img.eps
%%CreationDate: 02/13/2007  15:27:19
%%DocumentNeededFonts: Helvetica
%%DocumentProcessColors: Cyan Magenta Yellow Black
%%LanguageLevel: 2
%%Pages: 1
%%BoundingBox:   206   296   404   495
%%EndComments

%%BeginProlog
% MathWorks dictionary
/MathWorks 160 dict begin
% definition operators
/bdef {bind def} bind def
/ldef {load def} bind def
/xdef {exch def} bdef
/xstore {exch store} bdef
% operator abbreviations
/c  /clip ldef
/cc /concat ldef
/cp /closepath ldef
/gr /grestore ldef
/gs /gsave ldef
/mt /moveto ldef
/np /newpath ldef
/cm /currentmatrix ldef
/sm /setmatrix ldef
/rm /rmoveto ldef
/rl /rlineto ldef
/s {show newpath} bdef
/sc {setcmykcolor} bdef
/sr /setrgbcolor ldef
/sg /setgray ldef
/w /setlinewidth ldef
/j /setlinejoin ldef
/cap /setlinecap ldef
/rc {rectclip} bdef
/rf {rectfill} bdef
% page state control
/pgsv () def
/bpage {/pgsv save def} bdef
/epage {pgsv restore} bdef
/bplot /gsave ldef
/eplot {stroke grestore} bdef
% orientation switch
/portraitMode 0 def /landscapeMode 1 def /rotateMode 2 def
% coordinate system mappings
/dpi2point 0 def
% font control
/FontSize 0 def
/FMS {/FontSize xstore findfont [FontSize 0 0 FontSize neg 0 0]
  makefont setfont} bdef
/reencode {exch dup where {pop load} {pop StandardEncoding} ifelse
  exch dup 3 1 roll findfont dup length dict begin
  { 1 index /FID ne {def}{pop pop} ifelse } forall
  /Encoding exch def currentdict end definefont pop} bdef
/isroman {findfont /CharStrings get /Agrave known} bdef
/FMSR {3 1 roll 1 index dup isroman {reencode} {pop pop} ifelse
  exch FMS} bdef
/csm {1 dpi2point div -1 dpi2point div scale neg translate
 dup landscapeMode eq {pop -90 rotate}
  {rotateMode eq {90 rotate} if} ifelse} bdef
% line types: solid, dotted, dashed, dotdash
/SO { [] 0 setdash } bdef
/DO { [.5 dpi2point mul 4 dpi2point mul] 0 setdash } bdef
/DA { [6 dpi2point mul] 0 setdash } bdef
/DD { [.5 dpi2point mul 4 dpi2point mul 6 dpi2point mul 4
  dpi2point mul] 0 setdash } bdef
% macros for lines and objects
/L {lineto stroke} bdef
/MP {3 1 roll moveto 1 sub {rlineto} repeat} bdef
/AP {{rlineto} repeat} bdef
/PDlw -1 def
/W {/PDlw currentlinewidth def setlinewidth} def
/PP {closepath eofill} bdef
/DP {closepath stroke} bdef
/MR {4 -2 roll moveto dup  0 exch rlineto exch 0 rlineto
  neg 0 exch rlineto closepath} bdef
/FR {MR stroke} bdef
/PR {MR fill} bdef
/L1i {{currentfile picstr readhexstring pop} image} bdef
/tMatrix matrix def
/MakeOval {newpath tMatrix currentmatrix pop translate scale
0 0 1 0 360 arc tMatrix setmatrix} bdef
/FO {MakeOval stroke} bdef
/PO {MakeOval fill} bdef
/PD {currentlinewidth 2 div 0 360 arc fill
   PDlw -1 eq not {PDlw w /PDlw -1 def} if} def
/FA {newpath tMatrix currentmatrix pop translate scale
  0 0 1 5 -2 roll arc tMatrix setmatrix stroke} bdef
/PA {newpath tMatrix currentmatrix pop	translate 0 0 moveto scale
  0 0 1 5 -2 roll arc closepath tMatrix setmatrix fill} bdef
/FAn {newpath tMatrix currentmatrix pop translate scale
  0 0 1 5 -2 roll arcn tMatrix setmatrix stroke} bdef
/PAn {newpath tMatrix currentmatrix pop translate 0 0 moveto scale
  0 0 1 5 -2 roll arcn closepath tMatrix setmatrix fill} bdef
/vradius 0 def /hradius 0 def /lry 0 def
/lrx 0 def /uly 0 def /ulx 0 def /rad 0 def
/MRR {/vradius xdef /hradius xdef /lry xdef /lrx xdef /uly xdef
  /ulx xdef newpath tMatrix currentmatrix pop ulx hradius add uly
  vradius add translate hradius vradius scale 0 0 1 180 270 arc 
  tMatrix setmatrix lrx hradius sub uly vradius add translate
  hradius vradius scale 0 0 1 270 360 arc tMatrix setmatrix
  lrx hradius sub lry vradius sub translate hradius vradius scale
  0 0 1 0 90 arc tMatrix setmatrix ulx hradius add lry vradius sub
  translate hradius vradius scale 0 0 1 90 180 arc tMatrix setmatrix
  closepath} bdef
/FRR {MRR stroke } bdef
/PRR {MRR fill } bdef
/MlrRR {/lry xdef /lrx xdef /uly xdef /ulx xdef /rad lry uly sub 2 div def
  newpath tMatrix currentmatrix pop ulx rad add uly rad add translate
  rad rad scale 0 0 1 90 270 arc tMatrix setmatrix lrx rad sub lry rad
  sub translate rad rad scale 0 0 1 270 90 arc tMatrix setmatrix
  closepath} bdef
/FlrRR {MlrRR stroke } bdef
/PlrRR {MlrRR fill } bdef
/MtbRR {/lry xdef /lrx xdef /uly xdef /ulx xdef /rad lrx ulx sub 2 div def
  newpath tMatrix currentmatrix pop ulx rad add uly rad add translate
  rad rad scale 0 0 1 180 360 arc tMatrix setmatrix lrx rad sub lry rad
  sub translate rad rad scale 0 0 1 0 180 arc tMatrix setmatrix
  closepath} bdef
/FtbRR {MtbRR stroke } bdef
/PtbRR {MtbRR fill } bdef
/stri 6 array def /dtri 6 array def
/smat 6 array def /dmat 6 array def
/tmat1 6 array def /tmat2 6 array def /dif 3 array def
/asub {/ind2 exch def /ind1 exch def dup dup
  ind1 get exch ind2 get sub exch } bdef
/tri_to_matrix {
  2 0 asub 3 1 asub 4 0 asub 5 1 asub
  dup 0 get exch 1 get 7 -1 roll astore } bdef
/compute_transform {
  dmat dtri tri_to_matrix tmat1 invertmatrix 
  smat stri tri_to_matrix tmat2 concatmatrix } bdef
/ds {stri astore pop} bdef
/dt {dtri astore pop} bdef
/db {2 copy /cols xdef /rows xdef mul dup 3 mul string
  currentfile 
  3 index 0 eq {/ASCIIHexDecode filter}
  {/ASCII85Decode filter 3 index 2 eq {/RunLengthDecode filter} if }
  ifelse exch readstring pop
  dup 0 3 index getinterval /rbmap xdef
  dup 2 index dup getinterval /gbmap xdef
  1 index dup 2 mul exch getinterval /bbmap xdef pop pop}bdef
/it {gs np dtri aload pop moveto lineto lineto cp c
  cols rows 8 compute_transform 
  rbmap gbmap bbmap true 3 colorimage gr}bdef
/il {newpath moveto lineto stroke}bdef
currentdict end def
%%EndProlog

%%BeginSetup
MathWorks begin

0 cap

end
%%EndSetup

%%Page: 1 1
%%BeginPageSetup
%%PageBoundingBox:   206   296   404   495
MathWorks begin
bpage
%%EndPageSetup

%%BeginObject: obj1
bplot

/dpi2point 12 def
portraitMode 2472 5940 csm

    0     0  2381  2379 rc
88 dict begin %Colortable dictionary
/c0 { 0.000000 0.000000 0.000000 sr} bdef
/c1 { 1.000000 1.000000 1.000000 sr} bdef
/c2 { 0.900000 0.000000 0.000000 sr} bdef
/c3 { 0.000000 0.820000 0.000000 sr} bdef
/c4 { 0.000000 0.000000 0.800000 sr} bdef
/c5 { 0.910000 0.820000 0.320000 sr} bdef
/c6 { 1.000000 0.260000 0.820000 sr} bdef
/c7 { 0.000000 0.820000 0.820000 sr} bdef
c0
1 j
1 sg
   0    0 2382 2380 rf
6 w
0 1939 1845 0 0 -1939 310 2117 4 MP
PP
-1845 0 0 1939 1845 0 0 -1939 310 2117 5 MP stroke
4 w
DO
SO
6 w
0 sg
 310 2117 mt 2155 2117 L
 310 2117 mt  310  178 L
 573 2117 mt  573 2097 L
%%IncludeResource: font Helvetica
/Helvetica /ISOLatin1Encoding 96 FMSR

 547 2240 mt 
(1) s
1100 2117 mt 1100 2097 L
1074 2240 mt 
(2) s
1627 2117 mt 1627 2097 L
1601 2240 mt 
(3) s
2155 2117 mt 2155 2097 L
2129 2240 mt 
(4) s
 310 2117 mt  329 2117 L
  86 2152 mt 
(-1.4) s
 310 1874 mt  329 1874 L
  86 1909 mt 
(-1.2) s
 310 1632 mt  329 1632 L
 166 1667 mt 
(-1) s
 310 1389 mt  329 1389 L
  86 1424 mt 
(-0.8) s
 310 1147 mt  329 1147 L
  86 1182 mt 
(-0.6) s
 310  905 mt  329  905 L
  86  940 mt 
(-0.4) s
 310  662 mt  329  662 L
  86  697 mt 
(-0.2) s
 310  420 mt  329  420 L
 222  455 mt 
(0) s
 310  178 mt  329  178 L
 142  213 mt 
(0.2) s
gs 310 178 1846 1940 rc
/c8 { 1.000000 0.000000 0.000000 sr} bdef
c8
718 18 475 21 372 -25 280 -1633 310 2056 5 MP stroke
/c9 { 0.000000 1.000000 0.000000 sr} bdef
c9
359 25 359 21 238 16 237 10 186 24 186 -20 140 89 140 -1128 
310 1427 9 MP stroke
/c10 { 0.000000 0.000000 1.000000 sr} bdef
c10
180 20 179 20 180 16 179 10 119 9 119 6 119 6 118 4 
93 10 93 7 93 11 93 -11 70 19 70 32 70 66 70 -659 
310 918 17 MP stroke
/c11 { 0.000000 1.000000 1.000000 sr} bdef
c11
180 22 179 21 180 16 179 10 119 9 119 7 119 4 59 4 
59 3 47 4 46 2 47 3 46 3 47 3 46 4 47 6 
46 -6 35 6 35 6 35 8 35 13 35 19 35 30 35 39 
35 -347 310 599 26 MP stroke
/c12 { 1.000000 0.000000 1.000000 sr} bdef
c12
90 12 90 13 90 11 89 10 90 8 90 8 89 7 90 4 
60 5 59 4 59 3 60 3 59 4 60 3 59 2 59 3 
47 4 46 3 47 3 46 4 47 -2 23 3 23 1 23 2 
24 2 23 3 23 0 35 4 35 7 35 -10 18 15 17 5 
18 7 17 8 18 9 17 13 18 16 17 20 18 22 17 -174 
310 427 41 MP stroke
gr

c12
0 sg
 297 2152 mt 
( ) s
2143  212 mt 
( ) s
1 sg
0 632 799 0 0 -632 1297 870 4 MP
PP
-799 0 0 632 799 0 0 -632 1297 870 5 MP stroke
4 w
DO
SO
6 w
0 sg
1297  870 mt 2096  870 L
1297  238 mt 2096  238 L
1297  870 mt 1297  238 L
2096  870 mt 2096  238 L
1297  870 mt 2096  870 L
1297  870 mt 1297  238 L
1297  870 mt 2096  870 L
1297  238 mt 2096  238 L
1297  870 mt 1297  238 L
2096  870 mt 2096  238 L
1772  347 mt 
(refine0) s
gs 1297 238 800 633 rc
c8
365 0 1369 313 2 MP stroke
gr

c8
0 sg
1772  468 mt 
(refine1) s
gs 1297 238 800 633 rc
c9
365 0 1369 433 2 MP stroke
gr

c9
0 sg
1772  589 mt 
(refine2) s
gs 1297 238 800 633 rc
c10
365 0 1369 554 2 MP stroke
gr

c10
0 sg
1772  709 mt 
(refine3) s
gs 1297 238 800 633 rc
c11
365 0 1369 674 2 MP stroke
gr

c11
0 sg
1772  830 mt 
(refine4) s
gs 1297 238 800 633 rc
c12
365 0 1369 794 2 MP stroke
gr

c12

end %%Color Dict

eplot
%%EndObject

epage
end

showpage

%%Trailer
%%EOF
