%!PS-Adobe-2.0 EPSF-2.0
%%BoundingBox: 20 20 560 328
%%Title: Z:\home\svn\mueli-da\src_images\dickw_cyl_acad.eps 
%%Creator: AutoCAD PSOUT
%%For:  , 
%%Pages: 1
%%DocumentFonts: (atend)
%%DocumentNeededFonts: (atend)
%%CreationDate: 2007-02-28
%%EndComments
save
20 20 translate
0.24 dup scale
0 setlinewidth
/ACADLayer  { pop } def
/ACADColor { setrgbcolor pop } def
/ACADLtype { pop
userdict /Linedict known not { /Linedict 100 dict def } if
1 index cvn Linedict exch known not {
mark 1 index { dup 0 eq { pop 1 72.0 div } if abs } forall
counttomark 2 add -1 roll astore exch pop
1 index cvn exch Linedict begin def end }
{ pop } ifelse 
Linedict begin cvx exec 0 setdash end } bind def
/bd{bind def}bind def /m{moveto}bd /l{lineto}bd /s{stroke}bd
/a{arc}bd /an{arcn}bd /gs{gsave}bd /gr{grestore}bd
/cp{closepath}bd /tr{translate}bd /sc{scale}bd /co{concat}bd
/ff{findfont}bd /sf{setfont}bd /sh{show}bd /np{newpath}bd
/sw{setlinewidth}bd /sj{setlinejoin}bd /sm{setmiterlimit}bd
/cl{clip}bd /fi{fill}bd
%%EndProlog
%%Page: 1 1
gs np -20 -20 m -20 1299 l  2269 1299 l 2269 -20 l cp cl np 7 0 0 0 ACADColor
(0) ACADLayer (_CONTINUOUS) [  ] (A) ACADLtype 583 795 m 969 1181 l
s 562 675 m 1089 1202 l s 564 578 m 1187 1199 l s 580 494 m 1270 1184 l
s 606 420 m 1345 1158 l s 639 353 m 1411 1125 l s 679 294 m 988 603 l
s 1161 776 m 1470 1085 l s 726 241 m 1025 540 l s 1224 739 m 1523 1038 l
s 779 194 m 1088 503 l s 1261 676 m 1570 985 l s 838 154 m 1610 926 l
s 904 121 m 1643 859 l s 979 95 m 1669 785 l s 1062 80 m 1685 701 l
s 1160 77 m 1687 604 l s 1280 98 m 1666 484 l s (_CENTER) [  9.525  -1.905
 1.905  -1.905  ] (A) ACADLtype gs 23.4861 23.4743 sc -22.0993 -42.7362 tr
43 70 m 97 70 l s gr gs 23.4861 23.4743 sc -22.0993 -42.7362 tr
70 97 m 70 43 l s gr (_CONTINUOUS) [  ] (A) ACADLtype 525 248 m 957 530 l
s 1124 639 m 1006 563 l s np 952 539 m 963 522 l 1006 563 l 1006 563 l cp fi
1006 563 m 1006 563 l s 1124 639 m 1124 639 l s 624 94 m 704 181 l
s 1124 640 m 744 224 l s np 697 188 m 711 174 l 744 224 l 744 224 l cp fi
744 224 m 744 224 l s 1124 640 m 1124 640 l s (font_r) ACADLayer
561 311 m 561 405 l s 655 170 m 655 264 l s (0) ACADLayer gs 23.4861 23.4743 sc
-22.0993 -42.7362 tr [ 1 0 0 1 70 94 ] co 0.25 sw 0 sj 10 sm np 0 0 m np
0 -24 24 90 270 a 0 -24 24 270 90 a s gr gs 23.4861 23.4743 sc
-22.0993 -42.7362 tr [ 1 0 0 1 70 76 ] co 0.25 sw 0 sj 10 sm np 0 0 m np
0 -6 6 90 270 a 0 -6 6 270 90 a s gr
showpage
%%Trailer
restore
%%DocumentFonts:
%%DocumentNeededFonts:
