%!PS-Adobe-2.0 EPSF-2.0
%%BoundingBox: 20 20 560 328
%%Title: Z:\home\svn\mueli-da\src_images\model_dickw_cyl_acad.eps 
%%Creator: AutoCAD PSOUT
%%For:  , 
%%Pages: 1
%%DocumentFonts: (atend)
%%DocumentNeededFonts: (atend)
%%CreationDate: 2007-02-28
%%EndComments
save
20 20 translate
0.24 dup scale
0 setlinewidth
/ACADLayer  { pop } def
/ACADColor { setrgbcolor pop } def
/ACADLtype { pop
userdict /Linedict known not { /Linedict 100 dict def } if
1 index cvn Linedict exch known not {
mark 1 index { dup 0 eq { pop 1 72.0 div } if abs } forall
counttomark 2 add -1 roll astore exch pop
1 index cvn exch Linedict begin def end }
{ pop } ifelse 
Linedict begin cvx exec 0 setdash end } bind def
/bd{bind def}bind def /m{moveto}bd /l{lineto}bd /s{stroke}bd
/a{arc}bd /an{arcn}bd /gs{gsave}bd /gr{grestore}bd
/cp{closepath}bd /tr{translate}bd /sc{scale}bd /co{concat}bd
/ff{findfont}bd /sf{setfont}bd /sh{show}bd /np{newpath}bd
/sw{setlinewidth}bd /sj{setlinejoin}bd /sm{setmiterlimit}bd
/cl{clip}bd /fi{fill}bd
%%EndProlog
%%Page: 1 1
gs np -20 -20 m -20 1299 l  2268 1299 l 2268 -20 l cp cl np 7 0 0 0 ACADColor
(0) ACADLayer (_CENTER) [  9.525  -1.905  1.905  -1.905  ] (A) ACADLtype gs
9.9036 9.903 sc 0.1877 -38.1129 tr 60 70 m 150 70 l s gr gs 9.9036 9.903 sc
0.1877 -38.1129 tr 70 150 m 70 60 l s gr (_CONTINUOUS) [  ] (A) ACADLtype gs
9.9036 9.903 sc 0.1877 -38.1129 tr [ 1 0 0 1 70 70 ] co np 0 0 20 0 90 a s gr
gs 9.9036 9.903 sc 0.1877 -38.1129 tr [ 1 0 0 1 70 70 ] co np
0 0 80 0 90 a s gr 695 1108 m 695 513 l s 893 315 m 1487 315 l
s 695 1100 m 703 1107 l s 695 988 m 807 1100 l s 695 875 m 900 1081 l
s 695 763 m 984 1053 l s 695 651 m 1061 1018 l s 695 539 m 1131 976 l
s 767 500 m 1196 929 l s 835 455 m 1255 875 l s 879 388 m 1308 817 l
s 919 315 m 1356 752 l s 1031 315 m 1397 682 l s 1143 315 m 1432 605 l
s 1255 315 m 1460 520 l s 1367 315 m 1479 427 l s 1479 315 m 1487 323 l
s 627 542 m 633 536 l s 613 540 m 633 519 l s 613 523 m 633 502 l
s 613 506 m 633 485 l s 613 489 m 617 485 l s 645 485 m 645 542 l 695 513 l
s 645 485 m 695 513 l s 633 485 m 633 542 l s 921 254 m 864 254 l
s 864 266 m 893 315 l s 921 266 m 864 266 l s 864 248 m 870 254 l
s 866 233 m 887 254 l s 883 233 m 904 254 l s 900 233 m 921 254 l
s 917 233 m 921 238 l s 921 266 m 893 315 l s 1458 248 m 1464 254 l
s 1461 233 m 1481 254 l s 1477 233 m 1498 254 l s 1494 233 m 1515 254 l
s 1511 233 m 1515 238 l s 1515 266 m 1458 266 l 1487 315 l
s 1515 254 m 1458 254 l s 1515 266 m 1487 315 l s 1260 248 m 1266 254 l
s 1263 233 m 1283 254 l s 1279 233 m 1300 254 l s 1296 233 m 1317 254 l
s 1313 233 m 1317 238 l s 1317 266 m 1260 266 l 1289 315 l
s 1317 254 m 1260 254 l s 1317 266 m 1289 315 l s 1062 248 m 1068 254 l
s 1064 233 m 1085 254 l s 1081 233 m 1102 254 l s 1098 233 m 1119 254 l
s 1115 233 m 1119 238 l s 1119 266 m 1062 266 l 1091 315 l
s 1119 254 m 1062 254 l s 1119 266 m 1091 315 l s 633 683 m 633 740 l
s 645 683 m 645 740 l s 627 740 m 633 734 l s 613 738 m 633 717 l
s 613 721 m 633 700 l s 613 704 m 633 684 l s 613 687 m 617 683 l
s 645 683 m 695 711 l s 645 740 m 695 711 l s 645 938 m 695 909 l
s 627 938 m 633 932 l s 613 936 m 633 915 l s 613 919 m 633 898 l
s 613 902 m 633 882 l s 613 885 m 617 881 l s 645 881 m 645 938 l
s 633 881 m 633 938 l s 645 881 m 695 909 l s 645 1136 m 695 1108 l
s 627 1136 m 633 1130 l s 613 1134 m 633 1113 l s 613 1117 m 633 1096 l
s 613 1100 m 633 1080 l s 613 1083 m 617 1079 l s 645 1079 m 645 1136 l
s 633 1079 m 633 1136 l s 645 1079 m 695 1108 l s 695 513 m 695 414 l
s 893 315 m 794 315 l s gs 9.9036 9.903 sc 0.1877 -38.1129 tr
[ 1 0 0 1 70 70 ] co np 0 0 10 0 90 a s gr 893 315 m 794 315 l
s 695 309 m 695 105 l s 893 309 m 893 105 l s 719 117 m 868 117 l s
np 719 121 m 719 113 l 695 117 l 695 117 l cp fi np 868 121 m 868 113 l
893 117 l 893 117 l cp fi 695 315 m 695 315 l s 893 315 m 893 315 l
s 893 117 m 893 117 l s 695 309 m 695 6 l s 1487 309 m 1487 6 l
s 719 18 m 1462 18 l s np 719 22 m 719 14 l 695 18 l 695 18 l cp fi
np 1462 22 m 1462 14 l 1487 18 l 1487 18 l cp fi 695 315 m 695 315 l
s 1487 315 m 1487 315 l s 1487 18 m 1487 18 l s np 690 489 m 695 513 l
699 489 l cp fi 695 489 m 695 414 l s np 721 487 m 729 510 l 729 485 l cp fi
725 486 m 712 413 l s np 750 480 m 762 501 l 758 477 l cp fi
754 478 m 728 408 l s np 778 467 m 794 487 l 785 463 l cp fi
781 465 m 744 401 l s np 803 451 m 822 467 l 809 445 l cp fi
806 448 m 758 391 l s np 825 430 m 846 443 l 830 424 l cp fi
827 427 m 770 379 l s np 843 406 m 866 414 l 847 398 l cp fi
845 402 m 780 365 l s np 856 378 m 881 383 l 859 371 l cp fi
857 375 m 788 349 l s np 865 349 m 890 350 l 866 341 l cp fi
865 345 m 792 332 l s np 868 319 m 893 315 l 868 311 l cp fi
868 315 m 794 315 l s (font_c) ACADLayer 734 335 m 734 375 l
s 794 137 m 794 177 l s 1111 38 m 1111 78 l s (font_l) ACADLayer
1626 295 m 1626 335 l s (font_r) ACADLayer 675 1187 m 675 1226 l s
(0) ACADLayer np 690 1182 m 695 1207 l 699 1182 l cp fi 695 1182 m 695 1108 l s
np 1581 319 m 1606 315 l 1581 311 l cp fi 1581 315 m 1487 315 l s gs
9.9036 9.903 sc 0.1877 -38.1129 tr [ 1 0 0 1 70 150 ] co 0.25 sw 0 sj 10 sm np
0 0 m 0 -80 20 90 0 an 20 -80 l 0 -80 80 0 90 a s gr
showpage
%%Trailer
restore
%%DocumentFonts:
%%DocumentNeededFonts:
