%!PS-Adobe-2.0 EPSF-2.0
%%BoundingBox: 20 20 560 328
%%Title: Z:\home\svn\mueli-da\src_images\r2_img.eps 
%%Creator: AutoCAD PSOUT
%%For:  , 
%%Pages: 1
%%DocumentFonts: (atend)
%%DocumentNeededFonts: (atend)
%%CreationDate: 2007-03-06
%%EndComments
save
20 20 translate
0.24 dup scale
0 setlinewidth
/ACADLayer  { pop } def
/ACADColor { setrgbcolor pop } def
/ACADLtype { pop
userdict /Linedict known not { /Linedict 100 dict def } if
1 index cvn Linedict exch known not {
mark 1 index { dup 0 eq { pop 1 72.0 div } if abs } forall
counttomark 2 add -1 roll astore exch pop
1 index cvn exch Linedict begin def end }
{ pop } ifelse 
Linedict begin cvx exec 0 setdash end } bind def
/bd{bind def}bind def /m{moveto}bd /l{lineto}bd /s{stroke}bd
/a{arc}bd /an{arcn}bd /gs{gsave}bd /gr{grestore}bd
/cp{closepath}bd /tr{translate}bd /sc{scale}bd /co{concat}bd
/ff{findfont}bd /sf{setfont}bd /sh{show}bd /np{newpath}bd
/sw{setlinewidth}bd /sj{setlinejoin}bd /sm{setmiterlimit}bd
/cl{clip}bd /fi{fill}bd
%%EndProlog
%%Page: 1 1
gs np -20 -20 m -20 1299 l  2269 1299 l 2269 -20 l cp cl np 7 0 0 0 ACADColor
(0) ACADLayer (_CONTINUOUS) [  ] (A) ACADLtype 1293 432 m 1042 935 l 874 432 l
cp s 1 1 0 0 ACADColor 958 683 m 1083 432 l 1167 683 l cp s 7 0 0 0 ACADColor
874 432 m 622 935 l 1042 935 l 958 1270 l 622 935 l s 958 1270 m 1461 1102 l
1042 935 l s 1461 1102 m 1293 432 l 1629 348 l cp s 622 935 m 622 348 l
874 432 l 958 12 l 622 348 l s 958 12 m 1293 432 l 1377 96 l 1629 348 l
s 1377 96 m 958 12 l s 3 0 1 0 ACADColor (_STRICHLINIE2) [  1.905  -0.9525
 ] (A) ACADLtype gs 16.7777 16.7693 sc 32.1069 -14.2368 tr
25 15 m 32.5 40 l s gr gs 16.7777 16.7693 sc 32.1069 -14.2368 tr
55 80 m 37.5 55 l s gr gs 16.7777 16.7693 sc 32.1069 -14.2368 tr
5 70 m 25 55 l s gr 7 0 0 0 ACADColor (_CONTINUOUS) [  ] (A) ACADLtype gs
16.7777 16.7693 sc 32.1069 -14.2368 tr [ 1 0 0 1 25 90 ] co 0.25 sw
0 sj 10 sm np 0 0 m -20 -20 l 5 -20 l 0 0 l 30 -10 l 5 -20 l 20 -50 l 30 -10 l
40 -55 l 20 -50 l 25 -70 l 40 -55 l s gr gs 16.7777 16.7693 sc
32.1069 -14.2368 tr [ 1 0 0 1 50 20 ] co 0.25 sw 0 sj 10 sm np 0 0 m -25 -5 l
-5 20 l -30 20 l -25 -5 l -45 15 l -30 20 l -45 50 l -45 15 l s gr gs
16.7777 16.7693 sc 32.1069 -14.2368 tr [ 1 0 0 1 20 40 ] co 0.25 sw
0 sj 10 sm np 0 0 m 10 30 l s gr 1 1 0 0 ACADColor gs 16.7777 16.7693 sc
32.1069 -14.2368 tr [ 1 0 0 1 37.5 55 ] co 0.25 sw 0 sj 10 sm np 0 0 m
-12.5 0 l -5 -15 l 0 0 l s gr 3 0 1 0 ACADColor (_STRICHLINIE2) [  1.905
 -0.9525  ] (A) ACADLtype gs 16.7777 16.7693 sc 32.1069 -14.2368 tr
[ 1 0 0 1 5 70 ] co 0.25 sw 0 sj 10 sm np 0 0 m 20 -15 l s gr gs
16.7777 16.7693 sc 32.1069 -14.2368 tr [ 1 0 0 1 55 80 ] co 0.25 sw
0 sj 10 sm np 0 0 m -17.5 -25 l s gr gs 16.7777 16.7693 sc 32.1069 -14.2368 tr
[ 1 0 0 1 25 15 ] co 0.25 sw 0 sj 10 sm np 0 0 m 7.5 25 l s gr
showpage
%%Trailer
restore
%%DocumentFonts:
%%DocumentNeededFonts:
