%!PS-Adobe-2.0 EPSF-2.0
%%BoundingBox: 20 20 560 328
%%Title: Z:\home\svn\mueli-da\src_images\r1_img.eps 
%%Creator: AutoCAD PSOUT
%%For:  , 
%%Pages: 1
%%DocumentFonts: (atend)
%%DocumentNeededFonts: (atend)
%%CreationDate: 2007-03-06
%%EndComments
save
20 20 translate
0.24 dup scale
0 setlinewidth
/ACADLayer  { pop } def
/ACADColor { setrgbcolor pop } def
/ACADLtype { pop
userdict /Linedict known not { /Linedict 100 dict def } if
1 index cvn Linedict exch known not {
mark 1 index { dup 0 eq { pop 1 72.0 div } if abs } forall
counttomark 2 add -1 roll astore exch pop
1 index cvn exch Linedict begin def end }
{ pop } ifelse 
Linedict begin cvx exec 0 setdash end } bind def
/bd{bind def}bind def /m{moveto}bd /l{lineto}bd /s{stroke}bd
/a{arc}bd /an{arcn}bd /gs{gsave}bd /gr{grestore}bd
/cp{closepath}bd /tr{translate}bd /sc{scale}bd /co{concat}bd
/ff{findfont}bd /sf{setfont}bd /sh{show}bd /np{newpath}bd
/sw{setlinewidth}bd /sj{setlinejoin}bd /sm{setmiterlimit}bd
/cl{clip}bd /fi{fill}bd
%%EndProlog
%%Page: 1 1
gs np -20 -20 m -20 1299 l  2269 1299 l 2269 -20 l cp cl np 7 0 0 0 ACADColor
(0) ACADLayer (_CONTINUOUS) [  ] (A) ACADLtype 459 322 m 890 322 l 631 839 l
cp s 1493 322 m 1235 839 l 1062 322 l cp s 1 1 0 0 ACADColor
1148 581 m 1278 322 l 1364 581 l cp s 7 0 0 0 ACADColor np 1019 674 m
1062 667 l 1019 660 l cp fi 1019 667 m 890 667 l s gs 17.2347 17.2261 sc
21.6625 -26.2509 tr [ 1 0 0 1 15 75 ] co 0.25 sw 0 sj 10 sm np 0 0 m -10 -30 l
15 -30 l 0 0 l s gr gs 17.2347 17.2261 sc 21.6625 -26.2509 tr
[ 1 0 0 1 50 75 ] co 0.25 sw 0 sj 10 sm np 0 0 m -10 -30 l 15 -30 l 0 0 l s gr
1 1 0 0 ACADColor gs 17.2347 17.2261 sc 21.6625 -26.2509 tr
[ 1 0 0 1 57.5 60 ] co 0.25 sw 0 sj 10 sm np 0 0 m -12.5 0 l -5 -15 l 0 0 l
s gr
showpage
%%Trailer
restore
%%DocumentFonts:
%%DocumentNeededFonts:
