%!PS-Adobe-2.0 EPSF-2.0 
%%BoundingBox: 67 21 513 326
%%HiResBoundingBox: 67.751 21.440 512.016 325.520
%%Title: Z:\home\svn\mueli-da\src_images\neue_knoten_acad.eps 
%%Creator: AutoCAD PSOUT 
%%For: , 
%%Pages: 1 
%%DocumentFonts: (atend) 
%%DocumentNeededFonts: (atend) 
%%CreationDate: 2007-02-28 
%%EndComments 
save 
20 20 translate 
0.24 dup scale 
0 setlinewidth 
/ACADLayer { pop } def 
/ACADColor { setrgbcolor pop } def 
/ACADLtype { pop 
userdict /Linedict known not { /Linedict 100 dict def } if 
1 index cvn Linedict exch known not { 
mark 1 index { dup 0 eq { pop 1 72.0 div } if abs } forall 
counttomark 2 add -1 roll astore exch pop 
1 index cvn exch Linedict begin def end } 
{ pop } ifelse 
Linedict begin cvx exec 0 setdash end } bind def 
/bd{bind def}bind def /m{moveto}bd /l{lineto}bd /s{stroke}bd 
/a{arc}bd /an{arcn}bd /gs{gsave}bd /gr{grestore}bd 
/cp{closepath}bd /tr{translate}bd /sc{scale}bd /co{concat}bd 
/ff{findfont}bd /sf{setfont}bd /sh{show}bd /np{newpath}bd 
/sw{setlinewidth}bd /sj{setlinejoin}bd /sm{setmiterlimit}bd 
/cl{clip}bd /fi{fill}bd 
%%EndProlog 
%%Page: 1 1 
gs np -20 -20 m -20 1299 l 2269 1299 l 2269 -20 l cp cl np 7 0 0 0 ACADColor 
(0) ACADLayer (_CONTINUOUS) [ ] (A) ACADLtype 199 6 m 217 155 l 228 227 l 
241 297 l 258 363 l 278 424 l 303 480 l 317 506 l 333 529 l 351 552 l 370 572 l 
391 590 l 414 606 l 439 620 l 465 633 l 521 653 l 582 668 l 647 679 l 715 687 l 
784 695 l 923 711 l 991 723 l 1057 738 l 1119 760 l 1178 787 l 1232 819 l 
1283 857 l 1332 899 l 1377 945 l 1421 995 l 1462 1047 l 1502 1102 l 1541 1158 l 
1617 1273 l s gs 28.2964 28.2822 sc -24.2363 -26.7818 tr 
[ 1 0 0 1 32.12366802 36.3106364 ] co 0.9 sw 0 sj 10 sm np 0 0 m np 
0.45 0 0.45 180 0 a 0.45 0 0.45 0 180 a cp s gr gs 28.2964 28.2822 sc 
-24.2363 -26.7818 tr [ 1 0 0 1 45.89798926 50.67735326 ] co 0.9 sw 
0 sj 10 sm np 0 0 m np 0.45 0 0.45 180 0 a 0.45 0 0.45 0 180 a cp s gr gs 
28.2964 28.2822 sc -24.2363 -26.7818 tr [ 1 0 0 1 65.88925502 54.87341589 ] co 
0.9 sw 0 sj 10 sm np 0 0 m np 0.45 0 0.45 180 0 a 0.45 0 0.45 0 180 a cp s gr 
gs 28.2964 28.2822 sc -24.2363 -26.7818 tr 
[ 1 0 0 1 78.84417416 68.59311313 ] co 0.9 sw 0 sj 10 sm np 0 0 m np 
0.45 0 0.45 180 0 a 0.45 0 0.45 0 180 a cp s gr 235 269 m 625 675 l 1191 794 l 
1557 1182 l 1775 480 l 1191 794 l 1030 190 l 625 675 l s 235 269 m 1030 190 l 
1775 480 l s 212 120 m 296 83 l 338 67 l 380 53 l 422 42 l 465 36 l 508 33 l 
552 34 l 595 37 l 639 42 l 728 57 l 819 72 l 910 83 l 956 86 l 1002 86 l 
1095 79 l 1187 69 l 1232 66 l 1276 64 l 1319 65 l 1360 70 l 1400 80 l 1439 94 l 
1476 111 l 1514 132 l 1589 179 l 1669 230 l 1711 254 l 1755 277 l 1850 318 l 
1897 338 l 1940 357 l 1979 377 l 2011 399 l 2024 411 l 2034 424 l 2042 437 l 
2047 451 l 2050 466 l 2050 482 l 2049 498 l 2045 515 l 2031 550 l 2012 588 l 
1987 627 l 1957 668 l 1925 710 l 1890 753 l 1820 840 l 1786 883 l 1755 926 l 
1727 969 l 1703 1011 l 1682 1052 l 1663 1093 l 1631 1173 l 1604 1253 l 
s 235 269 m 459 36 l s 1030 190 m 999 86 l s 1030 190 m 1266 64 l 
s 1775 480 m 1768 283 l s 1775 480 m 2031 552 l s gs 28.2964 28.2822 sc 
-24.2363 -26.7818 tr [ 1 0 0 1 60.20148432 33.51242489 ] co 0.9 sw 
0 sj 10 sm np 0 0 m np 0.45 0 0.45 180 0 a 0.45 0 0.45 0 180 a cp s gr gs 
28.2964 28.2822 sc -24.2363 -26.7818 tr [ 1 0 0 1 86.5439465 43.76358953 ] co 
0.9 sw 0 sj 10 sm np 0 0 m np 0.45 0 0.45 180 0 a 0.45 0 0.45 0 180 a cp s gr 
3 0 1 0 ACADColor gs 28.2964 28.2822 sc -24.2363 -26.7818 tr 
[ 1 0 0 1 36.00352062 46.06188996 ] co 0.9 sw 0 sj 10 sm np 0 0 m np 
0.45 0 0.45 180 0 a 0.45 0 0.45 0 180 a cp s gr gs 28.2964 28.2822 sc 
-24.2363 -26.7818 tr [ 1 0 0 1 56.64879002 51.97406347 ] co 0.9 sw 
0 sj 10 sm np 0 0 m np 0.45 0 0.45 180 0 a 0.45 0 0.45 0 180 a cp s gr gs 
28.2964 28.2822 sc -24.2363 -26.7818 tr [ 1 0 0 1 72.93706607 60.73728961 ] co 
0.9 sw 0 sj 10 sm np 0 0 m np 0.45 0 0.45 180 0 a 0.45 0 0.45 0 180 a cp s gr 
gs 28.2964 28.2822 sc -24.2363 -26.7818 tr 
[ 1 0 0 1 46.16257617 34.91153065 ] co 0.9 sw 0 sj 10 sm np 0 0 m np 
0.45 0 0.45 180 0 a 0.45 0 0.45 0 180 a cp s gr gs 28.2964 28.2822 sc 
-24.2363 -26.7818 tr [ 1 0 0 1 53.04973679 42.09488908 ] co 0.9 sw 
0 sj 10 sm np 0 0 m np 0.45 0 0.45 180 0 a 0.45 0 0.45 0 180 a cp s gr gs 
28.2964 28.2822 sc -24.2363 -26.7818 tr [ 1 0 0 1 63.04536967 44.19292039 ] co 
0.9 sw 0 sj 10 sm np 0 0 m np 0.45 0 0.45 180 0 a 0.45 0 0.45 0 180 a cp s gr 
gs 28.2964 28.2822 sc -24.2363 -26.7818 tr 
[ 1 0 0 1 73.37271541 38.63800721 ] co 0.9 sw 0 sj 10 sm np 0 0 m np 
0.45 0 0.45 180 0 a 0.45 0 0.45 0 180 a cp s gr gs 28.2964 28.2822 sc 
-24.2363 -26.7818 tr [ 1 0 0 1 76.21660076 49.31850271 ] co 0.9 sw 
0 sj 10 sm np 0 0 m np 0.45 0 0.45 180 0 a 0.45 0 0.45 0 180 a cp s gr gs 
28.2964 28.2822 sc -24.2363 -26.7818 tr [ 1 0 0 1 82.69406033 56.17835133 ] co 
0.9 sw 0 sj 10 sm np 0 0 m np 0.45 0 0.45 180 0 a 0.45 0 0.45 0 180 a cp s gr 
345 545 m 633 229 l 828 433 l cp s 828 433 m 929 712 l 1110 492 l 
s 235 269 m 345 545 l 625 675 l 929 712 l 1191 794 l 1390 960 l 1557 1182 l 
s 828 433 m 1110 492 l 1403 335 l 1483 637 l 1110 492 l s 1483 637 m 1666 831 l 
1390 960 l cp s 633 229 m 575 35 l s 633 229 m 789 67 l s 1403 335 m 1394 78 l 
s 1403 335 m 1637 210 l s 7 0 0 0 ACADColor 1557 1182 m 1647 1132 l s 
3 0 1 0 ACADColor 1666 831 m 1798 868 l s 1666 831 m 1958 667 l s 
7 0 0 0 ACADColor 
showpage 
%%Trailer 
restore 
%%DocumentFonts: 
%%DocumentNeededFonts: 
