%!PS-Adobe-2.0 EPSF-2.0
%%BoundingBox: 20 20 560 328
%%Title: Z:\home\svn\mueli-da\src_images\r3a_img.eps 
%%Creator: AutoCAD PSOUT
%%For:  , 
%%Pages: 1
%%DocumentFonts: (atend)
%%DocumentNeededFonts: (atend)
%%CreationDate: 2007-03-06
%%EndComments
save
20 20 translate
0.24 dup scale
0 setlinewidth
/ACADLayer  { pop } def
/ACADColor { setrgbcolor pop } def
/ACADLtype { pop
userdict /Linedict known not { /Linedict 100 dict def } if
1 index cvn Linedict exch known not {
mark 1 index { dup 0 eq { pop 1 72.0 div } if abs } forall
counttomark 2 add -1 roll astore exch pop
1 index cvn exch Linedict begin def end }
{ pop } ifelse 
Linedict begin cvx exec 0 setdash end } bind def
/bd{bind def}bind def /m{moveto}bd /l{lineto}bd /s{stroke}bd
/a{arc}bd /an{arcn}bd /gs{gsave}bd /gr{grestore}bd
/cp{closepath}bd /tr{translate}bd /sc{scale}bd /co{concat}bd
/ff{findfont}bd /sf{setfont}bd /sh{show}bd /np{newpath}bd
/sw{setlinewidth}bd /sj{setlinejoin}bd /sm{setmiterlimit}bd
/cl{clip}bd /fi{fill}bd
%%EndProlog
%%Page: 1 1
gs np -20 -20 m -20 1299 l  2269 1299 l 2269 -20 l cp cl np 7 0 0 0 ACADColor
(0) ACADLayer (_CONTINUOUS) [  ] (A) ACADLtype 13 87 m 1124 87 l 2235 87 l
s 1124 87 m 569 1198 l 13 87 l s 569 1198 m 1679 1198 l 1124 87 l
s 1679 1198 m 2235 87 l s 1 1 0 0 ACADColor 291 642 m 569 87 l 846 642 l cp s
1402 642 m 1679 87 l 1957 642 l cp s (_STRICHLINIE2) [  1.905  -0.9525
 ] (A) ACADLtype gs 37.0248 37.0063 sc -4.6256 -32.6263 tr
27.5 50 m 35 65 l s gr gs 37.0248 37.0063 sc -4.6256 -32.6263 tr
35 65 m 42.5 50 l s gr gs 37.0248 37.0063 sc -4.6256 -32.6263 tr
42.5 50 m 27.5 50 l s gr 7 0 0 0 ACADColor (_CONTINUOUS) [  ] (A) ACADLtype gs
37.0248 37.0063 sc -4.6256 -32.6263 tr [ 1 0 0 1 20 65 ] co 0.25 sw
0 sj 10 sm np 0 0 m -15 -30 l 15 -30 l 0 0 l 30 0 l 15 -30 l 45 -30 l 30 0 l
s gr 1 1 0 0 ACADColor gs 37.0248 37.0063 sc -4.6256 -32.6263 tr
[ 1 0 0 1 27.5 50 ] co 0.25 sw 0 sj 10 sm np 0 0 m -15 0 l -7.5 -15 l 0 0 l
s gr gs 37.0248 37.0063 sc -4.6256 -32.6263 tr [ 1 0 0 1 42.5 50 ] co 0.25 sw
0 sj 10 sm np 0 0 m 7.5 -15 l 15 0 l 0 0 l s gr (_STRICHLINIE2) [  1.905
 -0.9525  ] (A) ACADLtype gs 37.0248 37.0063 sc -4.6256 -32.6263 tr
[ 1 0 0 1 35 65 ] co 0.25 sw 0 sj 10 sm np 0 0 m -7.5 -15 l 7.5 -15 l 0 0 l
s gr
showpage
%%Trailer
restore
%%DocumentFonts:
%%DocumentNeededFonts:
