1 1.89009e-05 -5.30456e-06 1.00629 -0.000401756 -0.00311208
2 1.96329e-05 -2.22588e-06 1.00055 0.0173322 -0.00978513
3 8.60305e-06 -5.94557e-06 0.997627 -0.000310232 0.00322826
4 1.41161e-05 -2.71992e-06 1.01143 -0.00131866 -0.0125698
5 9.59914e-06 -4.18052e-06 1.01343 -0.00627505 -0.000640669
6 1.5924e-05 -1.18631e-06 0.991785 0.0216551 -0.0183559
7 4.279e-06 -4.94922e-06 1.00547 0.00321288 0.00795879
8 7.97064e-06 -2.30279e-06 1.0354 -0.022482 -0.018798
9 4.20252e-06 -3.56286e-06 1.03975 -0.000623935 0.00997055
10 1.16649e-05 -9.58468e-07 0.98683 -0.00552558 -0.0350135
11 2.01461e-05 0 0.987906 0.0336695 -0.0163058
12 0 -6.32204e-06 0.99379 0.00703605 0.00989429
13 1.37697e-05 0 0.973785 0.017741 -0.0211312
14 0 -4.40547e-06 1.02087 0.0134722 0.0134136
15 7.55866e-06 -8.34195e-07 0.972906 -0.041096 -0.0686311
16 3.59872e-06 -2.08091e-06 1.09298 -0.0128101 -0.0122896
17 9.79068e-06 0 0.913915 0.00161099 -0.0472326
18 0 -3.22334e-06 1.06972 0.0334106 0.025252
19 4.99919e-06 -6.12719e-07 0.908357 -0.0994099 -0.128392
20 2.25938e-06 -1.70766e-06 1.33114 0.0607117 -0.0633175
21 7.04859e-06 0 0.772541 -0.0394694 -0.12068
22 0 -2.38647e-06 1.19739 0.107085 0.0347617
23 3.98261e-06 -1.03107e-06 1.19161 -0.0628711 -0.215988
24 5.81299e-06 0 0.562905 -0.170333 -0.192619
25 0 -1.8207e-06 1.64984 0.200029 -0.0634883