%!PS-Adobe-2.0 EPSF-2.0 
%%BoundingBox: 95 21 502 313
%%HiResBoundingBox: 95.424 21.440 501.918 312.612
%%Title: Z:\home\svn\mueli-da\src_images\dreieckselement_acad.eps 
%%Creator: AutoCAD PSOUT 
%%For: , 
%%Pages: 1 
%%DocumentFonts: (atend) 
%%DocumentNeededFonts: (atend) 
%%CreationDate: 2007-02-28 
%%EndComments 
save 
20 20 translate 
0.24 dup scale 
0 setlinewidth 
/ACADLayer { pop } def 
/ACADColor { setrgbcolor pop } def 
/ACADLtype { pop 
userdict /Linedict known not { /Linedict 100 dict def } if 
1 index cvn Linedict exch known not { 
mark 1 index { dup 0 eq { pop 1 72.0 div } if abs } forall 
counttomark 2 add -1 roll astore exch pop 
1 index cvn exch Linedict begin def end } 
{ pop } ifelse 
Linedict begin cvx exec 0 setdash end } bind def 
/bd{bind def}bind def /m{moveto}bd /l{lineto}bd /s{stroke}bd 
/a{arc}bd /an{arcn}bd /gs{gsave}bd /gr{grestore}bd 
/cp{closepath}bd /tr{translate}bd /sc{scale}bd /co{concat}bd 
/ff{findfont}bd /sf{setfont}bd /sh{show}bd /np{newpath}bd 
/sw{setlinewidth}bd /sj{setlinejoin}bd /sm{setmiterlimit}bd 
/cl{clip}bd /fi{fill}bd 
%%EndProlog 
%%Page: 1 1 
gs np -20 -20 m -20 1299 l 2269 1299 l 2269 -20 l cp cl np 7 0 0 0 ACADColor 
(0) ACADLayer (_CONTINUOUS) [ ] (A) ACADLtype gs 18.4304 18.4212 sc 
173.0414 -312.88 tr [ 1 0 0 1 -138.65133507 325.75984233 ] co 0.9 sw 
0 sj 10 sm np 0 0 m np 0.45 0 0.45 180 0 a 0.45 0 0.45 0 180 a cp s gr gs 
18.4304 18.4212 sc 173.0414 -312.88 tr 
[ 1 0 0 1 -114.69557549 374.04966108 ] co 0.9 sw 0 sj 10 sm np 0 0 m np 
0.45 0 0.45 180 0 a 0.45 0 0.45 0 180 a cp s gr gs 18.4304 18.4212 sc 
173.0414 -312.88 tr [ 1 0 0 1 -71.04285787 337.20040538 ] co 0.9 sw 
0 sj 10 sm np 0 0 m np 0.45 0 0.45 180 0 a 0.45 0 0.45 0 180 a cp s gr 
np 373 1036 m 381 1082 l 388 1036 l cp fi 381 1036 m 381 6 l s np 1398 50 m 
1444 43 l 1398 35 l cp fi 1398 43 m 344 43 l s 1083 1126 m 1001 1027 l 
922 927 l 884 875 l 849 823 l 815 770 l 785 716 l 757 661 l 733 603 l 712 545 l 
694 485 l 679 424 l 665 362 l 642 237 l 803 230 l 964 228 l 1044 229 l 
1123 233 l 1202 240 l 1281 251 l 1358 266 l 1435 285 l 1511 307 l 1587 332 l 
1738 387 l 1888 448 l 1771 514 l 1657 583 l 1546 656 l 1493 695 l 1441 736 l 
1392 779 l 1344 824 l 1298 872 l 1253 921 l 1167 1022 l cp s gs 
18.4304 18.4212 sc 173.0414 -312.88 tr 
[ 1 0 0 1 -110.08839216 368.33247229 ] co 0.9 sw 0 sj 10 sm np 0 0 m np 
0.45 0 0.45 180 0 a 0.45 0 0.45 0 180 a cp s gr gs 18.4304 18.4212 sc 
173.0414 -312.88 tr [ 1 0 0 1 -119.38210597 368.38075822 ] co 0.9 sw 
0 sj 10 sm np 0 0 m np 0.45 0 0.45 180 0 a 0.45 0 0.45 0 180 a cp s gr gs 
18.4304 18.4212 sc 173.0414 -312.88 tr 
[ 1 0 0 1 -123.93648845 362.54967409 ] co 0.9 sw 0 sj 10 sm np 0 0 m np 
0.45 0 0.45 180 0 a 0.45 0 0.45 0 180 a cp s gr gs 18.4304 18.4212 sc 
173.0414 -312.88 tr [ 1 0 0 1 -114.7444378 362.66179597 ] co 0.9 sw 
0 sj 10 sm np 0 0 m np 0.45 0 0.45 180 0 a 0.45 0 0.45 0 180 a cp s gr gs 
18.4304 18.4212 sc 173.0414 -312.88 tr 
[ 1 0 0 1 -105.35603073 362.7634595 ] co 0.9 sw 0 sj 10 sm np 0 0 m np 
0.45 0 0.45 180 0 a 0.45 0 0.45 0 180 a cp s gr gs 18.4304 18.4212 sc 
173.0414 -312.88 tr [ 1 0 0 1 -100.37478294 357.4915156 ] co 0.9 sw 
0 sj 10 sm np 0 0 m np 0.45 0 0.45 180 0 a 0.45 0 0.45 0 180 a cp s gr gs 
18.4304 18.4212 sc 173.0414 -312.88 tr 
[ 1 0 0 1 -109.95918701 357.11102882 ] co 0.9 sw 0 sj 10 sm np 0 0 m np 
0.45 0 0.45 180 0 a 0.45 0 0.45 0 180 a cp s gr gs 18.4304 18.4212 sc 
173.0414 -312.88 tr [ 1 0 0 1 -119.22565065 356.79512144 ] co 0.9 sw 
0 sj 10 sm np 0 0 m np 0.45 0 0.45 180 0 a 0.45 0 0.45 0 180 a cp s gr gs 
18.4304 18.4212 sc 173.0414 -312.88 tr 
[ 1 0 0 1 -128.20627203 356.37359165 ] co 0.9 sw 0 sj 10 sm np 0 0 m np 
0.45 0 0.45 180 0 a 0.45 0 0.45 0 180 a cp s gr gs 18.4304 18.4212 sc 
173.0414 -312.88 tr [ 1 0 0 1 -137.29079755 332.90549248 ] co 0.9 sw 
0 sj 10 sm np 0 0 m np 0.45 0 0.45 180 0 a 0.45 0 0.45 0 180 a cp s gr gs 
18.4304 18.4212 sc 173.0414 -312.88 tr 
[ 1 0 0 1 -131.38864185 325.45058464 ] co 0.9 sw 0 sj 10 sm np 0 0 m np 
0.45 0 0.45 180 0 a 0.45 0 0.45 0 180 a cp s gr gs 18.4304 18.4212 sc 
173.0414 -312.88 tr [ 1 0 0 1 -135.5847888 340.03613209 ] co 0.9 sw 
0 sj 10 sm np 0 0 m np 0.45 0 0.45 180 0 a 0.45 0 0.45 0 180 a cp s gr gs 
18.4304 18.4212 sc 173.0414 -312.88 tr 
[ 1 0 0 1 -129.99569981 332.60582584 ] co 0.9 sw 0 sj 10 sm np 0 0 m np 
0.45 0 0.45 180 0 a 0.45 0 0.45 0 180 a cp s gr gs 18.4304 18.4212 sc 
173.0414 -312.88 tr [ 1 0 0 1 -124.10178678 325.26742196 ] co 0.9 sw 
0 sj 10 sm np 0 0 m np 0.45 0 0.45 180 0 a 0.45 0 0.45 0 180 a cp s gr gs 
18.4304 18.4212 sc 173.0414 -312.88 tr 
[ 1 0 0 1 -133.12033871 347.13613648 ] co 0.9 sw 0 sj 10 sm np 0 0 m np 
0.45 0 0.45 180 0 a 0.45 0 0.45 0 180 a cp s gr gs 18.4304 18.4212 sc 
173.0414 -312.88 tr [ 1 0 0 1 -128.15997137 339.75173876 ] co 0.9 sw 
0 sj 10 sm np 0 0 m np 0.45 0 0.45 180 0 a 0.45 0 0.45 0 180 a cp s gr gs 
18.4304 18.4212 sc 173.0414 -312.88 tr 
[ 1 0 0 1 -122.65381231 332.45789289 ] co 0.9 sw 0 sj 10 sm np 0 0 m np 
0.45 0 0.45 180 0 a 0.45 0 0.45 0 180 a cp s gr gs 18.4304 18.4212 sc 
173.0414 -312.88 tr [ 1 0 0 1 -116.76343321 325.34484058 ] co 0.9 sw 
0 sj 10 sm np 0 0 m np 0.45 0 0.45 180 0 a 0.45 0 0.45 0 180 a cp s gr gs 
18.4304 18.4212 sc 173.0414 -312.88 tr 
[ 1 0 0 1 -97.56452323 327.85574233 ] co 0.9 sw 0 sj 10 sm np 0 0 m np 
0.45 0 0.45 180 0 a 0.45 0 0.45 0 180 a cp s gr gs 18.4304 18.4212 sc 
173.0414 -312.88 tr [ 1 0 0 1 -96.26679334 335.64204501 ] co 0.9 sw 
0 sj 10 sm np 0 0 m np 0.45 0 0.45 180 0 a 0.45 0 0.45 0 180 a cp s gr gs 
18.4304 18.4212 sc 173.0414 -312.88 tr 
[ 1 0 0 1 -94.98324325 343.54177713 ] co 0.9 sw 0 sj 10 sm np 0 0 m np 
0.45 0 0.45 180 0 a 0.45 0 0.45 0 180 a cp s gr gs 18.4304 18.4212 sc 
173.0414 -312.88 tr [ 1 0 0 1 -93.66969288 351.57246364 ] co 0.9 sw 
0 sj 10 sm np 0 0 m np 0.45 0 0.45 180 0 a 0.45 0 0.45 0 180 a cp s gr gs 
18.4304 18.4212 sc 173.0414 -312.88 tr 
[ 1 0 0 1 -86.60192592 346.49706882 ] co 0.9 sw 0 sj 10 sm np 0 0 m np 
0.45 0 0.45 180 0 a 0.45 0 0.45 0 180 a cp s gr gs 18.4304 18.4212 sc 
173.0414 -312.88 tr [ 1 0 0 1 -87.46853799 338.49429427 ] co 0.9 sw 
0 sj 10 sm np 0 0 m np 0.45 0 0.45 180 0 a 0.45 0 0.45 0 180 a cp s gr gs 
18.4304 18.4212 sc 173.0414 -312.88 tr 
[ 1 0 0 1 -88.32360621 330.56977294 ] co 0.9 sw 0 sj 10 sm np 0 0 m np 
0.45 0 0.45 180 0 a 0.45 0 0.45 0 180 a cp s gr gs 18.4304 18.4212 sc 
173.0414 -312.88 tr [ 1 0 0 1 -79.57051906 333.77542739 ] co 0.9 sw 
0 sj 10 sm np 0 0 m np 0.45 0 0.45 180 0 a 0.45 0 0.45 0 180 a cp s gr gs 
18.4304 18.4212 sc 173.0414 -312.88 tr [ 1 0 0 1 -78.9684618 341.75733128 ] co 
0.9 sw 0 sj 10 sm np 0 0 m np 0.45 0 0.45 180 0 a 0.45 0 0.45 0 180 a cp s gr 



(0) ACADLayer gs 18.4304 18.4212 sc 173.0414 -312.88 tr 
[ 1 0 0 1 -133.5951984 350.48403137 ] co 0.5 sw 0 sj 10 sm np 0 0 m np 
0.25 0 0.25 180 0 a 0.25 0 0.25 0 180 a cp s gr gs 18.4304 18.4212 sc 
173.0414 -312.88 tr [ 1 0 0 1 -130.60579047 355.97289466 ] co 0.5 sw 
0 sj 10 sm np 0 0 m np 0.25 0 0.25 180 0 a 0.25 0 0.25 0 180 a cp s gr gs 
18.4304 18.4212 sc 173.0414 -312.88 tr 
[ 1 0 0 1 -132.16596969 353.25940918 ] co 0.5 sw 0 sj 10 sm np 0 0 m np 
0.25 0 0.25 180 0 a 0.25 0 0.25 0 180 a cp s gr gs 18.4304 18.4212 sc 
173.0414 -312.88 tr [ 1 0 0 1 -111.78147049 323.5984468 ] co 0.5 sw 
0 sj 10 sm np 0 0 m np 0.25 0 0.25 180 0 a 0.25 0 0.25 0 180 a cp s gr gs 
18.4304 18.4212 sc 173.0414 -312.88 tr 
[ 1 0 0 1 -101.03513605 324.99977708 ] co 0.5 sw 0 sj 10 sm np 0 0 m np 
0.25 0 0.25 180 0 a 0.25 0 0.25 0 180 a cp s gr gs 18.4304 18.4212 sc 
173.0414 -312.88 tr [ 1 0 0 1 -108.35167895 323.90768174 ] co 0.5 sw 
0 sj 10 sm np 0 0 m np 0.25 0 0.25 180 0 a 0.25 0 0.25 0 180 a cp s gr gs 
18.4304 18.4212 sc 173.0414 -312.88 tr 
[ 1 0 0 1 -104.70677665 324.37171477 ] co 0.5 sw 0 sj 10 sm np 0 0 m np 
0.25 0 0.25 180 0 a 0.25 0 0.25 0 180 a cp s gr gs 18.4304 18.4212 sc 
173.0414 -312.88 tr [ 1 0 0 1 -97.28444765 357.48547678 ] co 0.5 sw 
0 sj 10 sm np 0 0 m np 0.25 0 0.25 180 0 a 0.25 0 0.25 0 180 a cp s gr gs 
18.4304 18.4212 sc 173.0414 -312.88 tr 
[ 1 0 0 1 -93.60430636 354.24878014 ] co 0.5 sw 0 sj 10 sm np 0 0 m np 
0.25 0 0.25 180 0 a 0.25 0 0.25 0 180 a cp s gr gs 18.4304 18.4212 sc 
173.0414 -312.88 tr [ 1 0 0 1 -95.37124215 355.74932666 ] co 0.5 sw 
0 sj 10 sm np 0 0 m np 0.25 0 0.25 180 0 a 0.25 0 0.25 0 180 a cp s gr 
(0) ACADLayer gs 18.4304 18.4212 sc 
173.0414 -312.88 tr [ 1 0 0 1 -114.24557549 374.04966108 ] co np 
0 0 1.4 0 360 a s gr gs 18.4304 18.4212 sc 173.0414 -312.88 tr 
[ 1 0 0 1 -138.20133507 325.75984233 ] co np 0 0 1.4 0 360 a s gr gs 
18.4304 18.4212 sc 173.0414 -312.88 tr 
[ 1 0 0 1 -70.59285787 337.20040538 ] co np 0 0 1.4 0 360 a s gr gs 
18.4304 18.4212 sc 173.0414 -312.88 tr 
[ 1 0 0 1 -127.70997137 339.75173876 ] co np 0 0 1.4 0 360 a s gr 
7 0 0 0 ACADColor /Times-Roman ff 30 scalefont sf 1530 20 m (text_0) sh
/Times-Roman ff 30 scalefont sf 314 1052 m (text_1) sh
/Times-Roman ff 30 scalefont sf 1088 1199 m (text_2) sh
/Times-Roman ff 30 scalefont sf 1935 425 m (text_3) sh
/Times-Roman ff 30 scalefont sf 682 131 m (text_4) sh
/Times-Roman ff 30 scalefont sf 866 462 m (text_5) sh

showpage 
%%Trailer 
restore 
%%DocumentFonts: 
%%DocumentNeededFonts: 
