<?xml version="1.0" encoding="UTF-8" standalone="no"?>
<!-- Created with Inkscape (http://www.inkscape.org/) -->

<svg
   xmlns:dc="http://purl.org/dc/elements/1.1/"
   xmlns:cc="http://creativecommons.org/ns#"
   xmlns:rdf="http://www.w3.org/1999/02/22-rdf-syntax-ns#"
   xmlns:svg="http://www.w3.org/2000/svg"
   xmlns="http://www.w3.org/2000/svg"
   xmlns:sodipodi="http://sodipodi.sourceforge.net/DTD/sodipodi-0.dtd"
   xmlns:inkscape="http://www.inkscape.org/namespaces/inkscape"
   width="1024"
   height="300"
   viewBox="0 0 270.93333 79.375002"
   version="1.1"
   id="svg8"
   inkscape:version="0.92.5 (2060ec1f9f, 2020-04-08)"
   sodipodi:docname="banner.svg"
   inkscape:export-filename="/home/michael/programming/heese-chat/assets/launcher/banner.png"
   inkscape:export-xdpi="96"
   inkscape:export-ydpi="96">
  <defs
     id="defs2">
    <mask
       maskUnits="userSpaceOnUse"
       id="mask866">
      <g
         inkscape:label="Layer 1"
         id="g870"
         transform="matrix(0.68108838,0,0,0.68108838,-186.33152,119.23945)"
         style="opacity:1;fill:#ffffff;fill-opacity:1;stroke:none;stroke-opacity:1">
        <path
           sodipodi:nodetypes="sccccccs"
           style="opacity:1;fill:#ffffff;fill-opacity:1;stroke:none;stroke-width:4.58392811;stroke-miterlimit:4;stroke-dasharray:none;stroke-opacity:1"
           d="m 142.273,67.095733 c -62.207002,1.2e-4 -112.635696,38.184497 -112.635814,85.287287 1.08e-4,47.1028 50.428806,85.28714 112.635814,85.28726 23.51595,-0.0382 46.42639,-5.64855 65.5185,-16.04431 l 34.03053,7.52624 -11.10194,-24.115 c 15.6251,-15.00412 24.14349,-33.54659 24.1893,-52.65419 C 254.90927,105.28006 204.48023,67.095615 142.273,67.095733 Z"
           id="path868"
           inkscape:connector-curvature="0" />
      </g>
    </mask>
    <filter
       inkscape:collect="always"
       style="color-interpolation-filters:sRGB"
       id="filter979"
       x="-0.03108"
       width="1.06216"
       y="-0.1332"
       height="1.2664">
      <feGaussianBlur
         inkscape:collect="always"
         stdDeviation="3.16105"
         id="feGaussianBlur981" />
    </filter>
  </defs>
  <sodipodi:namedview
     id="base"
     pagecolor="#ffffff"
     bordercolor="#666666"
     borderopacity="1.0"
     inkscape:pageopacity="0.0"
     inkscape:pageshadow="2"
     inkscape:zoom="0.73579546"
     inkscape:cx="329.33987"
     inkscape:cy="36.63871"
     inkscape:document-units="mm"
     inkscape:current-layer="layer3"
     showgrid="false"
     units="px"
     inkscape:window-width="1920"
     inkscape:window-height="1016"
     inkscape:window-x="0"
     inkscape:window-y="27"
     inkscape:window-maximized="1"
     fit-margin-top="10"
     fit-margin-left="10"
     fit-margin-right="10"
     fit-margin-bottom="10" />
  <metadata
     id="metadata5">
    <rdf:RDF>
      <cc:Work
         rdf:about="">
        <dc:format>image/svg+xml</dc:format>
        <dc:type
           rdf:resource="http://purl.org/dc/dcmitype/StillImage" />
        <dc:title></dc:title>
      </cc:Work>
    </rdf:RDF>
  </metadata>
  <g
     inkscape:groupmode="layer"
     id="layer2"
     inkscape:label="ref"
     sodipodi:insensitive="true"
     style="display:none"
     transform="translate(-11.338864,-96.090584)">
    <circle
       transform="translate(0,-26.06665)"
       style="opacity:1;fill:#b3cd49;fill-opacity:1;stroke:none;stroke-width:3.67882276;stroke-miterlimit:4;stroke-dasharray:none;stroke-opacity:1"
       id="path848"
       cx="135.46666"
       cy="161.53331"
       r="82.682289" />
  </g>
  <g
     inkscape:groupmode="layer"
     id="layer3"
     inkscape:label="Layer 2"
     style="display:inline"
     transform="translate(-11.338864,-96.090584)">
    <rect
       style="opacity:0.28300003;fill:#000000;fill-opacity:1;stroke:none;stroke-width:5;stroke-linecap:square;stroke-linejoin:miter;stroke-miterlimit:4;stroke-dasharray:none;stroke-opacity:1;filter:url(#filter979)"
       id="rect857"
       width="244.09653"
       height="56.955856"
       x="13.984697"
       y="107.94804"
       transform="matrix(0.92496245,0,0,1.0091316,20.980148,-1.8936668)" />
    <rect
       y="107.30016"
       x="24.757267"
       height="56.955856"
       width="244.09653"
       id="rect983"
       style="opacity:1;fill:#ffffff;fill-opacity:1;stroke:none;stroke-width:5;stroke-linecap:square;stroke-linejoin:miter;stroke-miterlimit:4;stroke-dasharray:none;stroke-opacity:1" />
    <text
       xml:space="preserve"
       style="font-style:normal;font-weight:normal;font-size:4.23333311px;line-height:1.25;font-family:sans-serif;letter-spacing:0px;word-spacing:0px;fill:#0061aa;fill-opacity:1;stroke:none;stroke-width:0.26458332"
       x="145.93736"
       y="154.82808"
       id="text831"><tspan
         sodipodi:role="line"
         id="tspan829"
         x="146.46652"
         y="154.82808"
         style="font-style:normal;font-variant:normal;font-weight:normal;font-stretch:normal;font-size:50.79999924px;font-family:'Open Sans Condensed';-inkscape-font-specification:'Open Sans Condensed, ';text-align:center;letter-spacing:1.05833328px;text-anchor:middle;fill:#0061aa;fill-opacity:1;stroke-width:0.26458332">heese<tspan
   style="fill:#808080;fill-opacity:1"
   id="tspan839">chat</tspan></tspan></text>
  </g>
</svg>
