<?xml version="1.0" encoding="UTF-8" standalone="no"?>
<!-- Created with Inkscape (http://www.inkscape.org/) -->

<svg
   xmlns:dc="http://purl.org/dc/elements/1.1/"
   xmlns:cc="http://creativecommons.org/ns#"
   xmlns:rdf="http://www.w3.org/1999/02/22-rdf-syntax-ns#"
   xmlns:svg="http://www.w3.org/2000/svg"
   xmlns="http://www.w3.org/2000/svg"
   xmlns:xlink="http://www.w3.org/1999/xlink"
   xmlns:sodipodi="http://sodipodi.sourceforge.net/DTD/sodipodi-0.dtd"
   xmlns:inkscape="http://www.inkscape.org/namespaces/inkscape"
   width="1024"
   height="1024"
   viewBox="0 0 270.93333 270.93334"
   version="1.1"
   id="svg8"
   inkscape:version="0.92.3 (2405546, 2018-03-11)"
   sodipodi:docname="icon-single.svg"
   inkscape:export-filename="/home/michael/programming/heese-chat/assets/launcher/icon.png"
   inkscape:export-xdpi="96"
   inkscape:export-ydpi="96">
  <defs
     id="defs2">
    <mask
       maskUnits="userSpaceOnUse"
       id="mask866">
      <g
         inkscape:label="Layer 1"
         id="g870"
         transform="matrix(0.68108838,0,0,0.68108838,-186.33152,119.23945)"
         style="opacity:1;fill:#ffffff;fill-opacity:1;stroke:none;stroke-opacity:1">
        <path
           sodipodi:nodetypes="sccccccs"
           style="opacity:1;fill:#ffffff;fill-opacity:1;stroke:none;stroke-width:4.58392811;stroke-miterlimit:4;stroke-dasharray:none;stroke-opacity:1"
           d="m 142.273,67.095733 c -62.207002,1.2e-4 -112.635696,38.184497 -112.635814,85.287287 1.08e-4,47.1028 50.428806,85.28714 112.635814,85.28726 23.51595,-0.0382 46.42639,-5.64855 65.5185,-16.04431 l 34.03053,7.52624 -11.10194,-24.115 c 15.6251,-15.00412 24.14349,-33.54659 24.1893,-52.65419 C 254.90927,105.28006 204.48023,67.095615 142.273,67.095733 Z"
           id="path868"
           inkscape:connector-curvature="0" />
      </g>
    </mask>
    <filter
       inkscape:collect="always"
       style="color-interpolation-filters:sRGB"
       id="filter2262"
       x="-0.084345266"
       width="1.1686905"
       y="-0.11139202"
       height="1.222784">
      <feGaussianBlur
         inkscape:collect="always"
         stdDeviation="7.916935"
         id="feGaussianBlur2264" />
    </filter>
  </defs>
  <sodipodi:namedview
     id="base"
     pagecolor="#ffffff"
     bordercolor="#666666"
     borderopacity="1.0"
     inkscape:pageopacity="0.0"
     inkscape:pageshadow="2"
     inkscape:zoom="0.18394887"
     inkscape:cx="-711.78821"
     inkscape:cy="471.63039"
     inkscape:document-units="mm"
     inkscape:current-layer="layer1"
     showgrid="false"
     units="px"
     inkscape:window-width="1853"
     inkscape:window-height="1027"
     inkscape:window-x="1987"
     inkscape:window-y="25"
     inkscape:window-maximized="1" />
  <metadata
     id="metadata5">
    <rdf:RDF>
      <cc:Work
         rdf:about="">
        <dc:format>image/svg+xml</dc:format>
        <dc:type
           rdf:resource="http://purl.org/dc/dcmitype/StillImage" />
        <dc:title></dc:title>
      </cc:Work>
    </rdf:RDF>
  </metadata>
  <g
     inkscape:groupmode="layer"
     id="layer2"
     inkscape:label="ref"
     sodipodi:insensitive="true"
     style="display:none">
    <circle
       transform="translate(0,-26.06665)"
       style="opacity:1;fill:#b3cd49;fill-opacity:1;stroke:none;stroke-width:3.67882276;stroke-miterlimit:4;stroke-dasharray:none;stroke-opacity:1"
       id="path848"
       cx="135.46666"
       cy="161.53331"
       r="82.682289" />
  </g>
  <g
     inkscape:label="Layer 1"
     inkscape:groupmode="layer"
     id="layer1"
     transform="translate(0,-26.06665)"
     style="opacity:1">
    <g
       inkscape:label="Layer 1"
       id="g878"
       transform="matrix(0.8934687,0,0,0.8934687,10.449681,25.340918)"
       style="opacity:0;fill:#000000;fill-opacity:1;stroke:#000000;stroke-width:16.78850082;stroke-linecap:square;stroke-miterlimit:4;stroke-dasharray:none;stroke-opacity:1;filter:url(#filter2262)">
      <path
         sodipodi:nodetypes="sccccccs"
         style="opacity:1;fill:#000000;fill-opacity:1;stroke:#000000;stroke-width:16.78850082;stroke-linecap:square;stroke-miterlimit:4;stroke-dasharray:none;stroke-opacity:1"
         d="m 142.273,67.095733 c -62.207002,1.2e-4 -112.635696,38.184497 -112.635814,85.287287 1.08e-4,47.1028 50.428806,85.28714 112.635814,85.28726 23.51595,-0.0382 46.42639,-5.64855 65.5185,-16.04431 l 34.03053,7.52624 -11.10194,-24.115 c 15.6251,-15.00412 24.14349,-33.54659 24.1893,-52.65419 C 254.90927,105.28006 204.48023,67.095615 142.273,67.095733 Z"
         id="path876"
         inkscape:connector-curvature="0" />
    </g>
    <g
       style="opacity:1;fill:none;fill-opacity:1;stroke:#00365f;stroke-width:16.78850082;stroke-linecap:square;stroke-miterlimit:4;stroke-dasharray:none;stroke-opacity:1"
       transform="matrix(0.8934687,0,0,0.8934687,9.1164483,24.028317)"
       id="g2270"
       inkscape:label="Layer 1">
      <path
         inkscape:connector-curvature="0"
         id="path2268"
         d="m 142.273,67.095733 c -62.207002,1.2e-4 -112.635696,38.184497 -112.635814,85.287287 1.08e-4,47.1028 50.428806,85.28714 112.635814,85.28726 23.51595,-0.0382 46.42639,-5.64855 65.5185,-16.04431 l 34.03053,7.52624 -11.10194,-24.115 c 15.6251,-15.00412 24.14349,-33.54659 24.1893,-52.65419 C 254.90927,105.28006 204.48023,67.095615 142.273,67.095733 Z"
         style="opacity:1;fill:none;fill-opacity:1;stroke:#00365f;stroke-width:16.78850082;stroke-linecap:square;stroke-miterlimit:4;stroke-dasharray:none;stroke-opacity:1"
         sodipodi:nodetypes="sccccccs" />
    </g>
    <image
       y="154.37485"
       x="-169.23027"
       id="image845"
       xlink:href="data:image/png;base64,iVBORw0KGgoAAAANSUhEUgAAAgAAAAIACAYAAAD0eNT6AAAgAElEQVR4XuxdA3QkzRb+sslusknW tm3btm3btm3btvnWtq1/bdv7zq3JJJPJJNM904Oevvecd97+meJX1V1f37pwQ6PV/8DCCDACjAAj wAgwAppCwI0JgKbWmyfLCDACjAAjwAgIBJgA8EZgBBgBRoARYAQ0iAATAA0uOk+ZEWAEGAFGgBFg AsB7gBFgBBgBRoAR0CACTAA0uOg8ZUaAEWAEGAFGgAkA7wFGgBFgBBgBRkCDCDAB0OCi85QZAUaA EWAEGAEmALwHGAFGgBFgBBgBDSLABECDi85TZgQYAUaAEWAEmADwHmAEGAFGgBFgBDSIABMADS46 T5kRYAQYAUaAEWACwHuAEWAEGAFGgBHQIAJMADS46DxlRoARYAQYAUaACQDvAUaAEWAEGAFGQIMI MAHQ4KLzlBkBRoARYAQYASYAvAcYAUaAEWAEGAENIsAEQIOLzlNmBBgBRoARYASYAPAeYAQYAUaA EWAENIgAEwANLjpPmRFgBBgBRoARYALAe4ARYAQYAUaAEdAgAkwANLjoPGVGgBFgBBgBRoAJAO8B RoARYAQYAUZAgwgwAdDgovOUGQFGgBFgBBgBJgC8BxgBRoARYAQYAQ0iwARAg4vOU2YEGAFGgBFg BJgA8B5gBBgBRoARYAQ0iAATAA0uOk+ZEWAEGAFGgBFgAsB7gBFgBBgBRoAR0CACTAA0uOg8ZUaA EWAEGAFGgAkA7wFGgBFgBBgBRkCDCDAB0OCi85QZAUaAEWAEGAEmALwHGAFGgBFgBBgBDSLABECD i85TZgQYAUaAEWAEmADwHmAEGAFGgBFgBDSIABMADS46T5kRYAQYAUaAEWACwHuAEWAEGAFGgBHQ IAJMADS46DxlRoARYAQYAUaACQDvAUaAEWAEGAFGQIMIMAHQ4KLzlBkBRoARYAQYASYAvAcYAUaA EWAEGAENIsAEQIOLzlNmBBgBRoARYASYAPAeYAQYAUaAEWAENIgAEwANLjpPmRFgBBgBRoARYALA e4ARYAQYAUaAEdAgAkwANLjoPGVGgBFgBBgBRoAJAO8BRoARYAQYAUZAgwgwAdDgovOUGQFGgBFg BBgBJgC8BxgBRoARYAQYAQ0iwARAg4vOU2YEGAFGgBFgBJgA8B5gBBgBRoARYAQ0iAATAA0uOk+Z EWAEGAFGgBFgAsB7gBFgBBgBRoAR0CACTAA0uOg8ZUaAEWAEGAFGgAkA7wFGgBFgBBgBRkCDCDAB 0OCi85Q1gMC/f4CbmwYmylNkBBgBSxFgAmApclyPEXBmBHYMAr6+A2KnA3I1kT/S00uAB6eBMD5w LzcUf9zc5bfBNRgBRsCpEWAC4NTLw4NjBCxEYMdA4MNTwCMMUHWq/EZ2Dwfe3hf1wtaahp//PPAH rFGQDyTXYAScFwEmAM67NjwyRsByBPQEgFoo0A6ImVbelcCmbsC3DzoCUHMq4O6Bn3/cmARYviJc kxFwOgSYADjdkvCAGAEFEDAkANQcaQI8vACEktb4dzr8/4my3jWnAO6hxX8xCZAGH5diBNSAABMA NawSj5ERkIuAMQGQW9+gvE/NyfjnHhqAG5MAK3DkqoyAsyHABMDZVoTHwwgogYCCBMC35iT8c/fE P3H8MwlQYnm4DUbAGRBgAuAMq8BjYASURkBRAjAR8PDEv390+DMJUHqpuD1GwFEIMAFwFPLcLyNg SwQUJADhakwAQocVhz+TAFsuGrfNCNgXASYA9sWbe2ME7IOAggQgfI3xQBhvUGwhJgH2WT7uhRGw BwJMAOyBMvfBCNgbAQUJQIQa40RAIFL+Mwmw90Jyf4yA7RBgAmA7bLllRsBxCChIACLWGAt4+vod /kwCHLeo3DMjoCwCTACUxZNbYwScAwEFCUAkPQHw1wAwCXCOReZRMALWIcAEwDr8uDYj4JwIKEoA RsPNKwL+/dP5AOiuAZgEOOfC86gYAekIMAGQjhWXZATUg4CCBCBKjdGAV3j8oxgATALUswd4pIyA GQSYAPAWYQRcEQFFCcAohPKOhL9//zIJcMW9wnPSLAJMADS79Dxxl0ZAQQIQtcZIhPKOLNT+TAJc etfw5DSGABMAjS04T1cjCChIAKJVH4lQvpH97/6ZBGhkD/E0XR4BJgAuv8Q8QU0ioCABiF59BEL5 RglkAMgkQJO7iiftYggwAXCxBeXpMAICAQUJQIwawxHKN6qR9T9fB/BOYwTUjgATALWvII+fETCF gIIEIGaNYXAPFx1/yQMgkAsgkwDefIyAmhFgAqDm1eOxMwLBIaAgAYhFBCB8DOECyCSAtxwj4DoI MAFwnbXkmTACAQgoSABi1xgK9/Ax/WwAmATwNmMEXAUBJgCuspI8D0bAEAEFCUCcGkPgETE2/v7V RwJkEsCbjRFwBQSYALjCKvIcGAFDBL69B7YPAH59UwQXIgChI8UW9/9MAhSBlBthBJwCASYATrEM PAhGQCEE6JQ+NBl4dlWhBoGIGUsiUs5q/m6ATAIUg5YbYgQcigATAIfCz50zAgojcPsAcHa5so26 uSF2he7wjJmcSYCyyHJrjIBDEWAC4FD4uXNGQEEEPr0Adg0Ffv9QsFFdU6HDR0Xc6oMADy8mAYqj yw0yAo5BgAmAY3DnXhkBZRH49xfYMxp4c0/Zdg1aC5ciD6IXaWJgB8A2ATYDmxtmBOyAABMAO4DM XTACNkfg6jbg8iabdxOzeCv4JM3GJMDmSHMHjIDtEWACYHuMuQdGwLYIvHsA/G8k8PePbfsBEMrT B/FrDoG7T0QmATZHmztgBGyLABMA2+LLrTMCtkXgzy/dvf/HZ7btx6D1sHFSIk757vjnZngFYIPr gL9u+EOdsDACjIBNEGACYBNYuVFGwE4InF8N3Nxjp84Cuomau4ZwD6TQQAFugUwC7L4Q3CEjYAUC TACsAI+rMgIOReDFDWD/BEDY5dtX3Nw9EK9qX4SJkoBJgH2h594YAcUQYAKgGJTcECNgRwQoyt+O QcDXt3bsNHBXYSLGRPzqAwEPTyYBDlsF7pgRsBwBJgCWY8c1GQHHIXBiAXD/uOP69+s5fIrciFm0 Gf6KNMF8HeDwBeEBMAIyEGACIAMsLsoIOAUCj84CR2c5xVBoEDGLNEX4lHmYBDjNivBAGAFpCDAB kIYTl2IEnAMBSvSzcxDw44tzjIdcAz08kaDGQISOGJNJgNOsCg+EETCPABMA8xhxCUbAORCgRD8H JwHPrznHeAxG4Rk1PhJU60dsgEmA060OD4gRMI0AEwDeGYyAWhC4tRc4t8ppRxspQzFEz1cH//79 YxLgtKvEA2MEAhBgAsC7gRFQAwIfngK7hwN/fjr1aOOW7QifhBmZBDj1KvHgGAEdAkwAeCcwAs6O wN/fulC/7x46+0jhHjYcEtceilBhIzAJcPrV4gFqHQEmAFrfATx/50fg4jrg+i7nH6ffCH3ipka8 it3wD25MAlSzajxQLSLABECLq85zVg8CL28D+8cCZACoIomeuzqiZCmDv//+MQlQ0brxULWFABMA ba03z1ZNCPz8pnP5c2C0P0vhcgvljoTV+8MrWkImAZaCyPUYARsjwATAxgBz84yAxQgcnws8OGVx dUdX9IwcG4lqDoKbexgmAY5eDO6fETCBABMA3haMgDMicP8EcGK+M45M1pgipS2ICCnziHRF//5S sGC6zdD9v+56QNec/t/+v4vQwro8R4Z1qLzu79SGmwg/rPs9oCz9/OtfKOGKKFnCeAMRYksuzgUZ AVdAgAmAK6wizyF4BOhkeHIBuLYd+PpBPUj9/AyQ9T+L/RCIkQpIXQqIkdJ+fXJPjIADEWAC4EDw uWsbIkAH/+NzuoP/3SMbdsRNuxwC0ZIBacsxEXC5heUJGSPABID3hGshoD/4r24F3j9xrbnxbOyL ABGBNGWBmKns2y/3xgjYCQEmAHYCmruxMQJ88NsYYA03HzWpTiPAREDDm8A1p84EwDXXVTuz0h/8 V7YCH/iLXzsL74CZCiJAGoHUDuicu2QElEeACYDymHKL9kCAD357oMx9mEIgahI/jQATAd4g6kaA CYC61097o+eDX3tr7qwzjpJQRwRipXPWEfK4GIEQEWACwBtEHQj8+ws8PANc3QZ8fCZ7zGlTp0LP rh2RIH58/P79W/wvOPnx8yf+/v1r+ud/wPcf34Ot++fPH/z89SvY33/9/AUqo5etO3Zhy/adsuej 9gpRIkdGrpzZTE7Dzc0NXp5ewU7Rw8MdHh4ewf7u6emJUG6hTLcdyg2eYcKY/O3lq9dYt3EzfoWw fiYrkkaAjAVjpVH7svD4NYYAEwCNLbjqpksH/6OzwNXtFt3xp0mdEv17dUfVShUQKpTpQ8FRmNx/ 8BCZcubH+w8qik+gEFge7u7Yv2sr8ubOqVCLyjTz4OEjjJkwGXMXLsGPHz/kNRo5oY4IxEkvrx6X ZgQchAATAAcBz92aQcD/4CfjPvlf/GlSp0L/Xt2c8uCnmZMWoHCp8jh05Jhmt0LCBPFx/vghRIwY wekwePb8OUaPn4zZ8xbi67dv8sYXKYHOWFAQATd5dbk0I2BHBJgA2BFs7koCAnTwPzgDXNsKfHwu oULgIhnTp0O/Xt1QsVwZp/viNxzp0FFj0W/QMNnzc7UKNapWxsrF85x2Ws9fvMS4SVMxY858fPny Rd44SSNARCA2awTkAcel7YUAEwB7Ic39hIyAuOM/C1zZAnySf/BnSJcWg/r2QvmypUB3yM4sp8+e R55CxfErBDsEZx6/0mNbMGsaGtarrXSzirb36vUbTJw6A1NmzManT5/ktU1EgEIMx8kIOPnelDcx Lq12BJgAqH0F1T5+/cFPkfssMO7Lkikj+vfujnKlSzr9wU9L9eXrV3Hvf/vOXbWvnGLj9/HxFlcB yZImUaxNWzX07t17TJw2A5Onz8L79zJtNyLG1dkIxM3ERMBWC8TtykKACYAsuLiwYghYefBnz5oZ fXt2Q9lSJVRx8Otxa962I+bMX6QYjK7SEBG5Y/t3IUwwFvrONs8PHz5i0vSZmDxtFt68fStveJR1 kIhAvCxMBOQhx6UVRoAJgMKAcnNmELDSnS971iwY0KcHSpcopjqoN2/bgQrVnFvV7UhQu3dqj1HD BjlyCLL7/vDxI6bOmIMJU6YzEZCNHldwNAJMABy9Alrp38qDP0+uHOLgL1a4kCoRe/b8BTLkyItX r16rcvz2GDS5ae7ash5FCxWwR3eK9vH58xdMnz0PYydNkb/G4WPqNALxs7FGQNFV4cbMIcAEwBxC /Lt1CAir/lPAtR0W3fHnz5NbWPUXLVzQunE4sPa/f/9QpnJ17Ni1x4GjUEfXsWPFxMVTRxA1ShR1 DNholJ+/fMGM2fMwfvI0kAeBLAlHRKA0kCA7EEwgI1ntcWFGwAwCTAB4i9gGAf3BT0l6Pst8EQIo UrCA+OLPlyeXbcZnx1anzZyDtp2727FHdXdVrkwpbFq9TFW2HcaIf/nyFTPmzMO4SUQEXshbECYC 8vDi0hYjwATAYui4okkE9Ac/hez9JPPFB6BYkUIigE/e3Oo/+Amfa9dvImveQvgmN5iMxrfX1Alj 0KZFU9Wj8O37d8ydvxgjx03E02cyA1r5RgdSlwQS5QLc3FWPBU/A+RBgAuB8a6LOEf37A9wnVf92 iw7+MqWKo3e3LsidM7s6529i1JRTIFeBYjh/8ZLLzMleEwnr5YVTR/aBcji4gnz//gPzFy3B8DHj 8eSpTCLgE1UXUChhDiYCrrAZnGgOTACcaDFUORQrv/jJja9/7x7IliWTKqcf0qB79B0gwsmyWIYA hXM+dWgvvL3DWtaAE9ai/AILlizHqHETQbkgZIlPZCB1aSBRbiBU8MmQZLXJhTWNABMATS+/FZO3 4uCnSH3ly5QSAXwyZ8xgxSCct+qBQ0dQpHSF4LMKOu/QnWpkLZo2wszJ451qTEoMhjJGLlq6QhCB u/f+k9ekNxGBUkDiPEwE5CHHpY0QYALAW0IeAlYe/FUqlkfvbp2RKaPrxken7H7ps+XBo8dP5GHL pU0isGbZQpHUyRWFUg8vXbkaw0eNwx1LiECqkkCSvEwEXHFz2GFOTADsALJLdCHu+E8CZNz3+ZWs Kbm7h0LVShVFWt7UqVLIqqvGwrUaNMHKNevVOHSnHHOkiBFx/sQhJIgfzynHp8SgKC/EshWrMWLs BNy6fUdek96RACICifMB7nw1IA88bZdmAqDt9Tc/e/+Df7tsdz53d3dUq1xBhOxNkyql+b5coMTS FatQr0lLF5iJc00hV47sOPi/bQjt4doHHKWJXr1uI4aOHINrN27KWwSvCECqEkDS/IB7GHl1ubQm EWACoMlllzBpq7743VGrelX07dkVKZIlldCZaxQhoy5K9ENXACzKI9CnRxcMHdBX+YadsEUiAms3 bMKwUeNw+eo1eSNkIiAPLw2XZgKg4cU3OXX/g58C+MgLWxs6dGjUqVkN/Xp2Q+JECTWFLL2wC5Us j8NHj2lq3vacLIUK/t/WDShcML89u3VoX3///sWa9ZswbPRYXL4ikwiEjQCkKA4kLQB4sEbAoQvp pJ0zAXDShbH7sP7+AR5YdsdPB3+DurXQo0tHJE2cyO5Dd4YOh48ejz4DhzjDUFx6DBQqmOwBokeL 5tLzNJ4cEQFKJjV4xGicvyAzroSnL5CyGJCsEODhpSnceLIhI8AEQOs75O9v4L/jwPWdso37PD09 0bh+XXTv3B4JE8TXLJJnz11A7kLFQa5dLLZHoHTJ4ti6bqWqQwVbihLllRBEYPhonLtwUV4zRARS FAOSMxGQB5zrlmYC4LprG/LMrDj4KUpb00b10bVjO8SPF1erCIp5f/n6FVlyF8DNWzIttx2IGqnS kyROhDixYyGcry8oSt2FS5fw6vUbB45KXtcTRg9Hx7at5FVyodJEBLbv3I2Bw0bhzLnz8mYWxlt3 NUBEILTrBFmSBwKXJgSYAGhtH4iD/5guO98XeS98isjWokkjdOvUHrFixtAacibn26p9Z8ycu0AV WGTOlAEd27QSB//N27fx+vVbobWIET2aCMj07Plz9B88XL71uQNm7+kZBsf273bZQFJSISUisGP3 HgwZMRonTp2RWk1XLowPkKIIkLwIEwF5yLlMaSYALrOUZiZixcHv4+ONVs2aiC9+OizkyrXrN8RB kzF9OrlVnbr81u07Ua5qLaceIw2ObDTGDB+MdGlSY8DQkUiTOqWIxJgpfTp4enni4qUr2LB5K44e P4ne3bvg/MWLIJsGOlycWZInTYKzxw7A19fXmYdpt7Ht3rNP2AjQOsqS0KQRKAwkLwqQdoBFMwgw AXD1paaD/94x4Pp24MtbWbMl9XDrFk3RpUMbRIsaVVZdfeEzZ8+jZMWqwD/gf9s2IFMG14gA+OLl KxHt7+UreUGRLALRikqk7l+9dIFwJTt3/iJmTpkAMqQj+fjxk1Af663qX71+jXadeyBhgnhIlCAB WrbvbEXP9qlav05NLJozwz6d2aGXkWMn4NPnLxg20HJ3x737DwoicOiITI8Uug6gawGyEyDtAIvL I8AEwFWXWH/wU3a+r/IO/vDhw6Fdy+bo1K41okSJbDFCBw8fRfmqtfDx0yfRRuTIkbBn6wZkUnn8 f/oyLlelJrbt3G0xNvaq2Kd7F4TxDIM7d+9h4ezpIEKgF4pbQIcEHaJ6obl179MfEcJHEORmyozZ 9hqqxf0smTcTdWvVsLi+s1Skw79X/8FiOKSJsYYEUBuUj4KIwP6Dh+VNkTwF9ESADAdZXBYBJgCu trTi4D+qu+OXefBHjBAB7Vu3EMZVkSJFtAqZrTt2oXqdhqB86IYSOVIk4ctN99Fqlemz56FNx65O P/x4ceNgxSLdWE8d3oswYQL7gt+4eQsHDh9Fy6aNAs2FSEDpitXEPmjcsp38PPZ2RoY0VWePH0Sy JInt3LNy3Rke/vpWlSAB1Nbho8cFEdiz74C8AXt4AkkLAimLA17h5NXl0qpAgAmAKpZJwiCtOPjp sKeXPR3+RAKslRWr16JBs9agRCemhPrbvWUDsmbOaG1Xdq9Ph2aWPAXx9es3u/ctt8Phg/rh/MXL aFi3Fsh1zlguXLosvg5J02MsV6/fQOsOXVC8aGH0HThUbtd2L58lU0Yc278rCMmx+0As6NDU4a80 CaD2jp04JYwFd/5vr7xRUhChJAWAVEQErH8/yOucS9sSASYAtkTXHm1bcfBHiRwZndq3Fup+Uvsr IWQRT1+cFLgkJCGisWvLOmTPmkWJbu3SBhky5i5YHGfPX7BLf9Z2cu3cCZStUhO3L58NpPrXt3vq zDkcOXYcndu3MdlVvqKl0aFNC1Sr09DaodilPhGZ8aOG2aUvpToJ6fC3BQmgNk+dOSviCMi+wqL8 Akny6fINhLVOQ6gUftyOdQgwAbAOP8fV9j/46Y7/naxxkEEfGfaRgR+pT5USym3es98gyc1FCB8e OzevRc7s2STXcWRBup+lF7YahOwt9u/cIl70a5cvMjnkI8dOiMMgOALQd9BQxI0TR2gCnN0jgCbo 5uaGLetWoowJbYczrpmUw99WJIDaJQNQ2h90XSdrfd1DA4nz6jIQUiZCFtUiwARAbUunP/gpcp9M P35y4evUjg7+Jooe/PTyIP/xoaPGykaTCMiOTWuRJ1cO2XXtWYHuUQuVLAeK+a8GSZE8GaZPGosN m7dhyrhRJoe8aet23L33X7AEYMbsefjw8SOGjByjiisPmmS0qFFw4eQRf08HZ10rOYe/fg69unUG XesoLRcvX8HAoSOwaesOeUQglDuQKDeQpgzgbbmxsNLz4fakI8AEQDpWji0pDv4jfsZ98r74KWgP Be+hID4UzEdJIVU/qfytCYZDJGD7xjXImzunkkNTrK0PHz4iQ468ePDwkWJt2rqhRAkTYPnCOZi/ aClmT5tksrspM2ZhwJCR8PXxQYQI4UFGg8mTJUXFcmVQMH9ejJkwGWHDhkXnHn2Cteew9Twsab9w gXzYvXUj3N0DPB4sacdWdUaMnYDeftb+cvtQyjDQVL9kEzJkxBgRE0KWRkAQgTw6jYCvZe7CcnHg 8sogwARAGRxt14oVBz9FfOveuQOaNW4ACt+rtPz6/RsNm7XG8lVrrG6aDqGtG1ahQN48VreldAN1 GzfHspXWz1HpcYXUHgX/OXfsALr3GSDIlSVSu1EzVChTCjXrN7GkukPrDBnQB317OJ+nxogxE9B7 gM7Vz1KxJQmgMV26clUQgfWbtpi15Qk0ByICCXMCqUsDvvIDhlmKB9ezHAEmAJZjZ9uaf/y++K+T O5+8L376kuvZpSMaN6wHL09Pm4zz+/fvqF6vMbZs26FY+z7e3ti6fiUK5s+nWJvWNrRi9TrUbtjU 2mYcUn/r+lVo0bYTbl46DcJWjlCOg3RZc2PU0IGoXjewm6CcdhxV1sPDAwd2bUGeXM6jVVLi8Nfj aWsSQP1cuXYdQ0eOEemIzRn1Blpnt1A6IpCGiEB0R20B7lcCAkwAJIBk1yJWHPwJ48dDz26d0LBe HXga+XwrOYdPnz+jYrU62HfwkJLNirboimLz2pUo4gQ53x8+eixU/+/ff1B8nvZosHKFciLpT9Qo kYUmSI7QYfX161fcufcfVq5ZJ6eq05SlRFUXThy2OqaFEhNS8vC3Jwmgvq5dv4mho8Zg9boN+PMn ZO+eIEQgQXadjUA4zh2ixD5Sug0mAEojaml7Vhz8iRMlRK9unVC/Ti2ECR3a0hFIqvf23TsRJObk 6bOSyltSiO6dN61ZjmKFC1pSXZE69MVTpHQFEU1NrUJR/3ZtXifi/48bOUSytwWpgMn1b/rEsShR vrK8l76TgVW5QlmsW7HEoaOyxeFvbxJA/VEMDDL0XblmvTxjWNIIxM+m0wiEj+XQteDOAyPABMDR O8KKgz9pksTo3b2zCIMa2sPD5jN5/vwFiperLOLKSxEyJuveuT1SpUyBFy9eYt7CJRg/Zbqkl4eX lxc2rlqKEsWKSOlK8TKjx09Cj74DFW/X3g3SHlm3YjFate8ifORzZAs57gIlbqpYoy7GjhiCHn0H 4MbN2/YesuL9EZFp1dwxdgxyDn+6tiDNV4wY0XH85GncvnNXEhb2uA4wHMitO3cwbNQ4LF+1Fr9/ /5Y0RlHIzQ2Il1WnEYgQW3o9LmkzBJgA2AxaMw3/+eVn1b8T+Cbvjp8stcnAqVb1qvDwcLfLDChu fLGylURMeSnSoG4tLJg1TfhmG8r8xUvRpGU7KU0I+4X1K5egVIliksorVej8xUvIWaAYfv78qVST Dm0nW5ZMWDR3Jjp37420aVKjXevmiB83bqAxff7yBXPmLwZFcRzQp4cwAjt5WmZ6WYfOMvjOiUye PLQH6dOmsesI5cTFIKK2afUypE6VUoyRNFDjJk0VRpxSxN4kgMZE10PDR4/D0uWrQAbBkkUQgSxA 6jJAxDiSq3FB5RFgAqA8piG36H/w7wC+vZfVe6qUydG3RzfUqFoJ7u72OfhpgKT6o8P/8ZOnksZL qufHd66B3A9NSY78RUUAGilCed/XLl+MsqVKSCludZlv374ha55CuHbjptVtOVMDFNBnxuRx+PLl CxYuXY5Pnz6L9aH8ABTbILRHaJQpVVz8d4euPSWvtTPNMaSxpE6ZAqeP7IO3TGNIS+c3esJk9JB4 eNOX/6VTR4SmzFhatO2I2fNNB3IyLusIEkBj+O/+A4wYMx4Ll66Q6S5KRCATkLosECkwIbUUd64n DwEmAPLwsry0FQd/2tSp0LdnV1SrXNFkSFfLB2W+5vkLl1CiQhW8evXafGG/EmR89eDm5WDL05dN 117SA5rQobRm6UKUL1tK8hgsLdiuc3dMnTnH0upOX4+uAOjKiGIuhA8XDnT4UBpgigpIro6nz55z +jlYOsCmDethzvTJllaXXG/sxCno1ru/5AgThiIAACAASURBVPIlihbGzs2mDS2vXruOtFlzS27L USSABkhxMijGwYLFy2Rqz9yAuBl1VwOR4kueKxe0HgEmANZjGHILdPDfPQJQ5D6Zqv4M6dKKg5+s uQ3TuNp6yPr2jx4/gbKVa+D9h4+yuowZIzqe/Rf8F/SgYaMwcNhIWW2ScePqpQtRoVxpWfXkFN6x ew/KVKouLwiKnA64rMMRWLl4HmpUrWyzcYyfPA1devaV1X7zxg0xa6rpENOfP39BuOjyvo4dSQJo 4qQppCBScxYsBmnUpIsbECc9kJY0AgmkV+OSFiPABMBi6MxU9D/45av6M2VMj349u4mIbMZ36LYa rnG7u/fsQ6Wa9YQrmCVy8+JpEVXOWChDYPL0WUE2BXKFgtusXrpA4KK00Fdw+mx58fzFC6Wb5vac CAHKP3HuxEEkTphQ8VFNmDJdRE2UKwXy5cGBXVtNViNjwNyFgmZyNNeHo0kAjY8Mf8dNnooZc+aD iIwsie1HBCIrv06yxuHihZkAKL3AFLmPvviv0cEvz7gva+ZM6N+7u7jvdtTBT3Cs37gFtRo2lanG Cwxkvjy5RGIWeuEayoAhI0RuckuFSMCqJfNRqXxZS5swWa9i9Tqg2Pgsro8AXYMc3rMDtJeUkknT ZqJjt14WNUfavX07NoOIgKGQhT3Z3ljqiuoMJIDm8+bNW0ycNgNTZ8zB+w8yY2rESqvTCERJbBG2 XClkBJgAKLVDrMjOlyNbVnHwlype1KEHP0GxaOkKNGnVTpKrnjnoEsSPh3atmoMMsB4+foLVazco EjyIXtykyqWrESVkzoJFaN6moxJNcRsqQYDcU0cNlZ65MqRpTZkxWxhOyoqfb9Qg5cMYN2ooqlep BB9vH5w+exa9Bwyx+PDXN+8sJIDGQzk1ps6cjYlTZ+D1m7fydkrMNDoiEDWJvHpcOkQEmABYu0Ho 4P/vGHCV0vLK29S5c+YQBz8ZATmDTJk+Cx269bLqRWaveVDcgxWL56FKxfJWdUm+1plyFRDW8Sza QYC+undsXIPiVj57ZDDavksPRZ8Z0v5ZQyaMV9GZSACNjVxOZ86ZL9wcn794KW/TxUilIwLRksmr x6VNIsAEwNKN8fcPcP+4TtX/+ZWsVkjV16dHV4dGujMesByfZVmTtWFhsmCnjHfkHWGJkO9y3sIl cOqM61q+W4KLVupEjxYVF08dBRmtWiIz5sxDm47dFD2sLRmHlDq2SiUspe/gylA+kfmLl4FSIz96 /EReU0QA0lUAoieXV49LB0KACYDcDfGPDv6TwNWtwGfprnHUTf68uTGkfx/x/84kA4aOwODhlt/L O3Iu1pCA/oOHi1z3LNpFoGjhgiJcslwvGwpo1bRVe1Uc/vrVdUYSQGOjgFt09UjRNym4kCwhAkAB hWKmklWNC+sQYAIgdSfoD3764v8kz1K8ZLEi6N2jC/LlziW1N7uUIzUjRRojv2U1C9kErF+xGGVL l5Q8jWMnTiJ/sTKK2DpI7pQLOiUClPFQTrIkioVPKaIpgJLaxFlJAOFIeFIkSgozfOOWzBDUZBuQ tjwTAZkbkgmAOcD+/QUenAKu0Be/vPuqMiVLYECf7siWJbO5Xhzye8++AzFq/CSH9K10p15entiy diXoi86cUDbDjNnz4d79++aK8u8aQIAI5KH/bUfO7FnNzpY8RarWbiAvBr7ZVu1bwJlJgI4I/MW6 jZswctxEUCAyWUJEIHVpIHY6WdW0WpgJQHArrz/4r26T9cVPBjzkp96vVzdkypDeaffVy5evMHfR Enz98hW///zGj+8/8PffPxHT+89v3ZcNqeb+kK1DMEI+/SGlB6XfqW29eLh7mHW9Ivwo/G9wQqpa zzCe4ufQoT1ESGSqQxkEo0WNgvatW5rNj9CoeRsRDpeFEdAjQHEBKD6AsduqIUKknq7TsBnevX8v vlbF/v79B//+/cWPH0HzRuienxDS5/77h+8/fjhkEZzNMNAUCKSh3LxtB4aOHIsz587Lw4ncBslY kNwIWYJFgAmAMTR08D88q7vj//hM8tahQ4gs0nt36wwK5MPinAis3bBJpLplYQSMEaAcGysXz2dg nBCB3Xv3C2PB/QcPyxsdRRQkIhAng7x6GinNBEC/0P/+AY/PAZc3yzr46Qu0WuUK6N+ru8lkHhrZ R6qYJlkaZ8iRF+/eyUvCpIrJ8SAVQWDujMlo0qCeIm1xI8ojQEGRho0ehz37DshrPEoi3dUAE4FA uDEBIDieXgKubAHePpC8qejgr1W9Cnp17eSfwlNyZS5odwQovWrxspWw98Ahu/fNHaoHAR9vb5w5 uh8pU7B7mTOvGmUTJQ+ebTt2y/PEYI0AEwB/BJ5fBS5vAd5Iy3FP9chgqEGdWujRpQMohzeLOhCQ k55VHTPiUdoKgfRp0+Dk4b3w8tTZmrA4LwIXL18BJRfbuGWbfCKQviIQK43zTs4OI9OmBuDtfeDC OuCl9JzvlI2uYb3aIOMZCnHLoh4EyJI4Z8FiVuU2UM9seaRKIEAhrCePG6VEU9yGHRC4fPWaiCOw YvU6ee6ZFEeAiEDUoInL7DBsh3ehLQLw6SVwaQPwiCK//ZMEPn3xN2vcAD06dwDluWdRFwJfv35D 1jwFcf3mLXUNnEfrcAQ2rVmO8mVKOXwcPADpCFBob7IRWLZyjTxXTco+mL4SEDGO9M5coKQ2CAAF 8bmyDbi+E6DY/RKF4oRPnzgWSRInkliDizkbAq07dBHpSFkYAbkIRIkSGRdOHEbcOLHlVuXyDkbg 3n/3MXTUWCxZvko6EXBzAxLlATJUAjzDOXgG9uleGwSA0vLuHAL8+CwZVXLr+/D8IcKF85Vchws6 FwJbtu9E+aq1nGtQPBpVIVAwf17s2bZRxJtgUR8CZCNQtnINPH7yVPrgfaMjVMm++OvhJb2OSktq gwDQ4hyfq4voJ0PGjxqG3DmzI3y4cPD29hYGgBR8hgLahAkTGqFCeCmQARGRCBbHIPD02XPh8vf6 9RvHDIB7dRkEBvfvjX49u7nMfLQ2EUr1TSm/pYpbguzwKdgS3379wZ+/0q6KpbbtbOW0QwDOrwZu 7nEa/IlM8FeF7ZZDH6nNdj1wy1pBwMPdHRXKlZGdMEgr+Dj7PM+dv4C7/0kP+x06RSF45aoHCg3j 6iRAOwSA/PzpfyyMACPACDACjEAwCIRJUwJe2WsKt0JXJwHaIQDXdwEX1/GmZwQYAUaAEWAEgkVA TwCogKuTAO0QAKJyZAT4/T3w+Lwuux8LI8AIMAKMACMQIY4IExzayxthoieGR6xU/o7irkwCtEMA DLc4xQE4OpM3PSPACDACjAAjAGSpBSQrhPBhQyOUG33560DRmwC6KglgAsCbnxFgBBgBRkDbCORo hNBJc8PXK7R/SGEtkAAmANre9jx7RoARYAQYgdzN4ZMsJ8J4hNJ9+fud/q5OApgA8NZnBBgBRoAR 0DQCbnlbIWLyHKDQLYZqfx0ZcN3rACYAmt72PHlGgBFgBBgBz0Lt4Jski8nD3pVJABMA3vuMACPA CDACmkbAp2gHeCXM5Kf+D/rF76okgAmAprc9T54RYAQYAUYgfInOCB0vvT8QptT+rkgCmADw3mcE GAFGgBHQNALhS3ZFmLjp8M8gTbwWSAATAE1ve548I8AIMAKMQMTS3eERO43uCkBDJIAJAO99RoAR YAQYAU0jELFMD4SOndrACDAgC6ArawKYAGh62/PkGQFGgBFgBCKW64XQMVPqNAD+bn+uTwKYAPDe ZwQYAUaAEdA0ApHK9UHoWMkDDn+NkAAmAJre9jx5RoARYAQYgcgV+sEjRtLAGgANkAAmALz3GQFG gBFgBDSNQOQK/RE6RlJ/A0D/awAXJwFMADS97XnyjAAjwAgwApEr9kfo6H4aAD8vAC2QACYAKtn7 82dORc3qVVQyWucd5sOHj5AyY3a7DjBunNgYP2qYXftUc2f3HzxC9z797TqFFMmSYsiAPnbt01U7 27PvIGbPX6iq6REBCEMaAKMvflcnAUwAVLJNl8ybhbq1qqtktM47zPsPHiJRqgx2HWCqlClw7dwJ u/ap5s4uXLqMTDnz23UKuXNmx9F9u+zap6t2Nnv+IrRo21FV04tCGgBjGwANaAKYAKhkmzIBUGah mAAog6MtW2ECYEt0bd+2WgmA0AD4waMVTQATANs/D4r0wARAERjhEAKQIjmunT+pzAQ00AoTAHUv shoJQNRKAxA6ehIBvJZIABMAlTxrTACUWShHEICUKZLjOhMAyQvIBEAyVE5ZUK0EQGcDoDv+tUIC mAA45SMUdFDORAB+/f6NFy9e4v2HD/j06RO+fPkKt1Ch4BkmDDw9wyBC+PCIFCkiokSOjFChQjkV wg4hAMmT4fqFUw7H4c3bt3jy9BnevHmL9x8+4ufPH/j9+49YM19fX0SNEhlRokRGjGjR4e0d1mHj ZQKgg/7nz594++49Pnz4gG/fv+PPnz9wgxu8vDwRLlw4RI4UET4+Pg5bp+A6VjMBEIe/hkgAEwCn e3xMD8gRBODt23c4deYsLl6+ius3b+Lmrdt4+Ogxnr94ib9//5pFLkyY0IgdKxYSxI+HFMmTIXXK FEibJjWyZs4oSIIjxBEEgOZ+w44E4Pfv3zh/8RJOnDqNs+cv4uq1G7h5+zY+ffosCXI3NzfEihlD rFmh/HlRolgRZMmUCe7u9iFzWiMAb9+9w+kz53DuwiVcu3EDt27fxYNHj/Dq1Wuzz1mYMGEQJ3Ys JIgXDwkSxANpm9KlTiWeM3ruHCFqJADRKtMVgM4NUEskgAmAI54QC/q0BwH49u079h04iJ3/24v/ 7d2PW3fu+rNhC4YcbBXSCqRKkRx5cudEscKFUKRQfkSKGFHJLoJtyyEEIFlS3Lh42qbz+/jxEzZv 2471m7di3/5D+PDxo6L9RY0SBZUrlEP1KhVRMH9euLu7K9q+YWOuTgDoy37/oSPYuet/2HPgoCBo +q9OJUGNFTMm8uTKgXx5cqFksSJInizggFOyH+O21EoADN0AtUICmADY8klQsG1bEQB68ew7cAiL l6/Cxs1b8fHTJwVHLa0pOkzy582N6lUqoUrFcogWNaq0ihaUcgQBoBfvTRsRgEuXr2DqzLlYtmo1 vn79ZgEi8quQdqBJg3po2ri++PJUWlyRAJDGbP/Bw1i8fCU2b90hrs/sLUkSJ0LFcmVQu0ZVZM5o O1dYNRKA6KQBMHID1AIJYAJg76fQwv6UJgB0p7hg8TJMnTEb12/esnBUylcLHTo0ypYqgSYN66Jk sWKKq50dQgCSJsHNS2cUBWv33v0YPnocDh4+qmi7chqjK4EKZcugV7dOyJo5k5yqIZZ1JQJA6v15 C5dgxuz5+O/BA8UwsrYhik3RsmkjNKxbG+HDh7O2uUD11UoATLkBujoJYAKg6Na3XWNKEYDvP35g 1twFGDV+Ep49e27RgL28vBAjejREjRoFEcNHQNiwXqC/kZHSr9+/QFcJpIL+8OEjXr58ZbE6mr5Y OrVrjaYN68HT09OisRpXcgQBSJY0CW4pQABIW7Nt524MHTkGJ0+flY0HXb1EihgBkSNHRpjQoYWl 848fP/Dp82e8fv3G7H1zSB2WKFoYwwf3V+TL0hUIwMtXrzB24lTMnDNf4OusEs7XF80aN0D3zh3E M62EqJIAVBmIMMG4AboyCWACoMSOt0Mbi+fNRL1aNSzuiQ6PdRs2o3vfAfjvvrQvETrU6csuc8b0 SJc2tTDiS5QwIWLGiA4yFJMqX758weMnT4VNARkSXrp8VRgXSrUxIGOmoQP6oE7N6rL6NTU+hxCA JIlx67L8A9tw/MdOnEL33v1x9IS0eAJ02GdMnw5FCxcU98C0fqSuD84rgwwHX756LfbG1es3cPXa dWFISOv048dPSUtNbdevXRPDBvVD7FgxJdUxVUjNBIA8YsZMmIzxk6fJOvjJEyNl8uQgskhGfeSN 4ePtDV8fH/j6+oA0YyS/fv3C7z9/8PfPX0Gs371/Lzw7Hjx8JNbsqYWknvrq0KYl+vToarUHiFoJ gGcIboCuSgKYAFj8mrJvRWsIwJ2799CiXSdx1x+S0KGeLUtmlCxeBPRFR4c/WRmbEiIUdECQCppe 2C9evsLXr1+FdX+cOLGRLUsmFC1UMERLZHJL27v/EHbv3Yct23aCvppCkry5c2HaxDFInzaNxeA7 ggAkTZIYty0kAI8eP0HnHn2wdsMms3OmA7hwwfyoVqkCypctLYiaKaGvfTrknz57JtzLwoYNi7ix YyNNqpSIHDlSoCqkzTl5+gz+t2+/IJA3b98xO46IESJg7MghaFy/rkWETa0EYM36jejcoy8eP3li FqNkSRMjd84cyJ41C7JnzSz2dHDPGjVGJPrDx08g3h0lShShwTEldOVw5dp1XLh4GUeOncCRY8fx 7PkLs+PRF0iUMAGmTRyLUsWLSq5jXFCNBCBGVdIA6NMBm44F4IokgAmAxdvcvhUtJQAz5y5Al559 QjQQoy/7RvXroHrVSogfN26IE3v//gOmzZqDuQuW4P7Dh2YJBX19du3YDuXLlArxMCB/9AOHDmPp itVYvX6DuEYwJR4eHujasS0G9O4hrh3kikMIQOJEuH3lnNyhCnV/nYbNzF6hxI8XFy2aNEKDurXE 16MpIffNeYuWYO2Gzbh+46ZJq3MigHQQVatcAY0b1BOugMZy+eo1LFm+Stxr02ETkpDlOe1buUad aiMAz54/R8t2nbF5244Q8ciSKaPI50HeFLRmIQk9ZytWr8WuPftw/OQpoZ3Ri4e7OxImTCCs+8le plzpkv4aAlNt3r57D9t37saGzVsFIfjzx7wLb7NG9TFxzEiLtAFqJQA6DYAOweBiAbgaCWACIPu1 7JgKcgnAl69f0bhFW6xetyHYAZcuUQydO7RF4QL5zH6p0QNBB0i3Xv1EEBm5QslWFsyaJskViQ6W hUuWY8KU6eLqwJSQZf38mVOQJ1dOWUNRCwEg4ta2UzdhVxGckIame+f24kAJzi3v1evX6DNgKBYu WQYK4CRVyOaiVbPGGNinJyJECBqzgTwOlq1cjRFjJ4R4pUSZEFctWQBaf6miJgKweet2NGnVHq/f vDE5PVLdk2dL+9YtkStHNrMQkEp/4LCRgmDRdYIUoeuWzu3boF2r5iFqEagt0rKRpoIIPOEckqRO lQIrF89HujSppQzDv4waCUBM0gAYJwMKJiCQK5EAJgCytrbjCsshAHTIVapRBxcuXTE54AL58mD4 oH5CBSlFvn//jrpNWggVsKHQFyPdLWfLnBnx4sURP1GUuUtXroogNMZ3x95hw2LB7GnC3U+KkL/0 0pWrMWTEGBHD31jo0Ovfqzv69Ogi2S/dEQSAjBnvSNQAENHqM3AoRowZHyxEdLc/ZEBvlC1VMkQY d+z+Hxo0bQ0iAZZKvLhxsHzhXOTNbZpo/fj5E+MnTcWQkWPx7ZtpN0QiE4vnzhQxBKQIqa8z5XLu bIC0ToOHj8ag4aNMalPoWqV18ybo1K4V4sSOLWXaWLdxM1p36BLoa19SRb9CKZMnw9IFs0GaBily 6MgxjB4/SWiaghOax7wZU1BLRipytRIAoQHwA0IrmgAmAFKeFCcoI5UA0ENdpVZ9k18k9KUwduRQ 1Kxa2ewXv37KpEkoVaEqDh897o9CWC8vtGreBG1aNEXiRAlNokN+zqQqHjl2orhr1gvdU08ZPwqt mzeVjCpZqk+dOUe8bE1Fs6N77zXLFiJypMD316Y6cGYCQIZ4Ldp2wvzFS01iQ1baZGDXqF4dsyGW dRqEroHUvYR9scIFUal8WWTLmlmo5oncEUGgYDTHT53G9l3/E2GeDYXuppfOn4VqlYM/wMk2oF7j Fjh91vRVB/U9edwosWfMybkLF5Eld0FzxRT9XU46YCKmDZq1xso160yOgYxWN69ZgfTppNuqDBg6 QhAKQyHtQZFCBVAgb24kTZJEhGymE+r5ixcgjLZs3ykMAA2FrsXmzZiM2jWqScbn1Jlz6Na7H+jd YUqI6JOr55D+fczuO6pPe69V+86S+3eGgrGqDkKYGMEkA3JhTQATAGfYfRLGIIUA0Auhet1G4qVu LHTHP3H0CFk+v3QvX7lmXfGi0QtpDWgsSYI5+I37JVVxz34DxQGuv1ejw2D10gWoUrG8hJkHFCGD uDadugqDQWOhK4Gt61chWZLEIbbpCAJAJOnu1fMhjouM8WrUa4wtwdwjk0HdmBGDJZEcCjbTsFnr QF+mFL2PDmBz6lwiIXRtRFoIQ60L2V5sXbdShAUOTuiKYeiIMSI+AVmqGwsdJLOnTRJunSHJmXPn kS1vYVl7w9rCUgkAEeIqNeuJu3lTQnf8U8aPBhlCSpVe/QcJoqwXOvhJnd+tU/tgDTmpLK3VqrUb 0KPvQDx5GnBVRs/X4rkzhNeMHFm2cg06dO0JMs41JXSVsWzhXJHzIySZMXseWnfsKqdrh5eNVW0Q QvICcFWbACYADt960gZgjgCQ8VyjFm3ES8FQKMHLnOmTRQQwudJ7wGCMGDPBv1qNqpXF4R+cBXJI 7S9atgJNW7bzPxjIW+DiqSMWxSufv2gpOnTric+fvwTqkozW9u/cImLYByfk5pY4tTQVqVy8gitP ltX3rl0ItjnScFSsURc7d+8JUoYSKpGtA1n1SxH6mstbpKRwF9MLuXYN7tdL0tebvs7nz5/RvE1H rDD4yg0fLhzOHjsA8moISUhbRESUvlSNhYIHLVswB7SXghOaQ478wRMNKTjILSOFAJBWq2zlGjh6 PKgrJmEzZ/okyddb+vHNmDNfqP31QtiuXDxPshqf6pE7IBmLGqryiUQc3rMdObJllQXFi5cv0bpD V6zftMVkPSKA61csCdE4kIyE23bqLqtfRxfWEwAaR7DJgFxQE8AEwNE7T2L/IREAunMjlZtxgh5K urN2+WKLDlm6x8+cq4C/EVqxIoWwfcNq0JegpWKsGiRSsmGVaXW3uT5u37krrjrIKt1Q6JrjyN6d oEPXlNz77z6SpFEuap25cdLvIREAWrPq9RoFsa+gepTQZdPqZcFesxj3TUQiY878uGEQ2XFg357C Y8ISoRdhm45dQYeUXihkM5Esc1keyR+9Wp0GoPgFxkJXCnu2bRRW7KbkxKkzyFWwmCVDtriOOQJA h2yJcpVNBmAi90nax+TDL0cuX7mKrHkL4edPHVmju/vdW9dL0vIY90PGokS6DA/uhAni48qZYxZl DCSNHbmfGhJJfZ+FCuTDjo1rdVcSJmTKjNlo38WyPScHPyXLxq5GVwASkgG5GAlgAqDkLrJhW8ER APryb9CsVZDDnwKyzJo6UaQOtUQq16wn3IZIKBHMtXMnEC2a9TH66SVFVsh6OXV4r4g9YImQOrZp q/ZB7mLJMPHYvt0igIqx3L33H5Kmtaw/S8ZIdehF/N/1iyard+reGxOnzgjyW6H8+bBx9TJZVzbG L15yvaQ25ARtMnWwlCxfFXv2H/D/iewtqlaqYBYOuitv27k75sxfFKQsRZE8eXCPSXJDbm+5C5Uw 276SBUIiAJQfo2T5Kjh+MmhCJ3LDW7ZwDkgDIFfyFC7hT5BIe3Xx5BGrnjG6+suer0ggUkxeHAP6 WHYY6zQ5DUX2T2Oh64Ul82aa3FuTps1Ex2695MLh0PJEAAyNAGkwWtAEMAFw6LaT3rkpAkCBfUpW qBqEpZPKd0j/3ha/+MmwKEGKdP5f/1MnjJFkvCVlNuSPnixdFpHrnKRhvdrCPdBSoYd0wJARGDJy TKAmyNNg1ZKAL1f9jxQUifq3p5BR2P0bl4J0ScZ+TVq2C/J3OrjJRkJO+GP6AkyYMr2/26S3d1gR fliqBXpIeNCapcqU3T+WRKYM6XHu+EHJEA4fMx59BgwJUp7iT5w4uAfhwvkG+u3o8RPIW6SU5PaV KBgcAaAvYHrGTAXRat6kIaZPHCvZA8VwnLv37EOJ8lX8/7Rh5VJULC//ms547hScK2ueQv4fBESC n9y5LotIGrZJdiDFylYCPTfGQtdK/XoFVfUToSViqybREwBx8BsM3NVJABMAlexScqOqVzsgFDCp sslQyjAYC33pTSFL65bNrJrVnAWL0bxNB9EGRYZ7cvc6vBSKxU9tkrU4ufeRRIwQHq8e3bXqaoHa mTVvobhLNbwGWb5wDmpVrxoICwo/nCK9vHtRq8AExBWMMQEgH+xcBYsHMdisUJYO/4Vm/bmNx0TJ gUhFrRcK6zpxzAhrh+5fv0vPviK8rV4unT5q1qDQsPPgvgrJFoDuvA2FvjzzF5Nm86DUBIMjAMYG evr+enXtJHIfWCpVazcQbn8kdE9//MBuiwm78RjqNWkhAmrpZeaUCWjRpKGlQxUaANKAXLwc2K2Y roHoyqJIwQKB2qZ9QvtFTRKnut4IUDdqrZAAJgAq2aWGBIBC7pKK1PCBpMOfQnhS8BZrxVBN36xR A8yeFmChbG3bVH/rjl0oV6Wmf1P0FZgjm/Vf5WT93qh5G38SQG6B1y+cRPRoAUlOyF0tZQbzAVmU mKe+DYr69uBmQNCV799/CD93w7t6Kkuhk7euXynry1/fh/FVAhlYWhMy2Xj+xsRpyIA+6NtDnqV3 cIcpfUWTW6leKLx0wRJllVwCs22ZIgAUNY/GYRw5r3/v7hjU13IVN2kVIsVOJML7khABCsko0uzg jQqcv3AJmXMHHMp0Z79vR+AYHnLbpMiExctVwumzgb1ZKNz0+ROHA3krUBIkcitUk8SpMRie+mRA +miABhNwVU0AEwCV7FJDAmDM8GkK9LVHX31KCN2R0105CVlsU/5wJYWyBEaOk8j/oJ5DrmGN6ivS hbELUvPGDTFraoAnw41bt5Eqo/SodEoMioLpPLwV8PXUq/9gjBwbMCbqI1PG9Di0e7tJuwUpY8iR v6hI3EMSO1YsPLkb2DhSShvmyiRPadlVGQAAIABJREFUnxVkfElC4Wc3r11hrkqg3+klWrdxCyxf tSbQ3+mqg64U6EqAZP+hwyhcUp6LqKyBmChsTADIwyR99rz47/79QKW7dGiLsSOCXmfI6f/s+QtC TU9CxP3ds/sih4aSEidJav/4GxTM5/2z+7K1Ssbjefv2HQqWLAcyXjQUsoPYsm6l/58oGVL3PgOU nI7N2yIC4GWYDEgjJIAJgM23ljId6AnAuo1bULV24MOSwoCOGzlUkY7oJR0mQjRQDACS8ycOiaxy Skv85GlBfv0k/Xp1w+B+yt0Zdu3VD+MmTRVtk9vZ2WMHkSFdWvHf12/eQupM0iIgKjVnuod/fEf3 0qQALnRYG7prUvz+k4f2BhvHX8o4osZN4u+/XapEMeGxobTUqt8EK9euF82mSJ4UNy4ENYoz1yfl eMhZoKiIFmkouXJkx5G9O4R3wd79B1G0jLSogeb6k/q7MQEgK3YyqjSUOjWqYcn8WVar6letXY+a 9XUaDwrG9PLhbanDlFyOrlAMg3eR+2bmjBkk1w+uINkHkYeG/tnVlzNMVz5q3ET07DfI6r7s2UBc 0gD4hwL2SwakARLABMCeu8yKvogAUDjOVJlyBDLIKVWiKLauW2XWLUtq11+/fYNPlIDQpXR3TXfY SkumnPn9Y5F3bNsKE0YPV6wLOlwLFC+LY36pcw2/UK7duIk0meXlD7B2YDFiRMfz/3QJeOjwIz93 vZBL3MHd25Azu+V2CWT34O4bxb9NCvo0f6aOACkphnYAdL3y5klQwzAp/VFKaPoC/uynAtfXmT5p nLjC2rF7D0pXlB7JTkqf5soYEgByQyQLfUN7Evp9384tZoPgmOuHfjf0/U8YPx7+M2EgKqWdkMoQ foSjXjatWS4ScikhRN7yFCoRaP0oXsX18yeFF8Ow0ePQd6AyHyRKjFdKG0QAhAbAr7C/yt/FSQAT ACm7wwnKEAH4+euncHvTC0Ubu3L2uFVfjsZTo8MzdHiDO/OLpyUl8JELUbqsuUXaUpIenTtg5NCB cpsIsTxlvCOfeL23gd7dkNLgps1i2v9c0QEYNEYvx9eP7wqjLzL+MpRJY0eifesWVnVNHgAe4QJc NBs3qCvityst3Xr3x9iJunbJOPTNY8sIANVfvGyFCKdrKOQaeOfyORw4dAQVa9RRevghtqcnAPTi z1O4pMjApxeyITl/4qC4WlFCJk+fJSLukZgLEmVpf2RjQ7Y2elmxaB5qVgs++JLcfiirJMV5MBQK 80weQ6bCGstt397l4xlqAPw61wIJYAJg751mYX9kyTt05JhA2fFGDxskwoUqLTESJPNPSLJryzoU L6J8WNYocRL7ezDQnSrdrSotFIJ41LhJotkypUqIULaXr1xD+ux5lO4qxPbofpfuedNly4OrfqSH KhQvWhg7N621WqVMbUWIGR8fP34S4zC+k1VqshRvYvEy3V1vSLENpPZXulJ17Nj1v0DFu3VshyyZ M6FmfeuNWaWOg8rpCcDaDZtQrU5gi/n1K5eI/AlKydyFi9Gstc7Lhq5/Ht9R3l6D8nfs/N9e/yEr PQdq2PiaJLSHh/ggWbBkeRAbF6Wws1U7RAC8YhqkA9YICWACYKsdpXC7ZCBF6mu90Ivj9uWzIAMf paVI6Qr+fs/WRJILblzG8fjpYKYDWmmh0K1J02QWd+NkbEWBVkiLojfAUrq/4NqjLIiUp6BwqQDD Nh9vb/GypINUCcmQIy8uXdbdqxt7HSjRPrWRMUc+f88T8lj437bgU01L6fPBw0dCG2N4FUDR5Sjv gWH0QSltWVuGCABdxdD1EHk86KVyhbJYt2KJtc0Hqr9t5y6UrazzgqEroG9vnyl2hafvKFeh4jhh ELjo9JH9oMigSgpFnqSkTaRV0wsljKJ3k6ngVkr2rXRb8WsOgac+GZCR2t+VNQFMAJTeSXZqjxK7 UMIQWwil3+0/RHcnT8ljyOdbSZk2c46IEEdCRl+vHt2xKPyplDGRtT1Z3ZNQHIVWzZogd6HiUqoq WoYIzjYDlezIIQPQo0tHxfpo1ro95i4MOKgunzmGtKlTKdY+GX1RcCj9y7Bbp3YYPUyHqzVCxppk tOloIQJAHiMNmwdcS5B3AkXADC7jpaVjvn33HpIbBKNSyg1WPx6yXYgWLwnevnsv/kThu989/Q++ voEDLlk6fsN6lP2RjAL1rpJEtClR2B0/LyIl+rBHG0QAdBoA0waArkoCmADYY3cp3AfdKT+4dRn0 FWkLIVc5spTXb3qK205pSZUQapO+JPVW4JRn/vCeHUo0bbINiuGeMEV6kDaAEqQsmjMDtRuaT0lr swH5BQYiC3pLwzSbGhtl8KNsgnpROhBQv0HDMHTUWP/29+7YjMIF8lkN048fP5EyY7ZAmQetbtSC Bigc9dt3b3H3XoDbH9lmkI2G0kLPQKxEKUGJd0govfP8WcoZbe7asxcUvlkvuXJkw7H9u5Wehn97 FIDL3hobpSejJwDUrpZIABMApXeSHdqjUL9DB/SxaU8UppTClZJkzJAOpw7vA93xWSvLV61FnUYB kQrnzZwiVL62FEPjNQqKsv/gYVt2Z7Zt46iOZitIKEBpl2MlSgGKW08SLlw43LhwCpQcyVqhgypZ uqz45Nc2XTHcvXoBHh7u1jYt6i9Zvgr1myoTw8LSAZEmytDqn65tKIVzzJgxLG0yxHqGhyZ9oV84 eRiUVMhaoTmQ+v/UaV1MCJLxo4ahU7vABpfW9mNY/9Wr10icJmOQ7JxK9mHrtgwJAPWlFRLABMDW O0vh9ulFRS8mpe6Ogxse5WQnf3X9S5GMDcno0Bp5/OQpMufKj1ev34hm6CAhOwa6B7WlUNhkiv9v nC3Rln0G13bypElx7fwJi+LHmxsv+V6TD7ZeyHBt3YrFVhkZ0ouQjOL0YWup7VFDB6F7Z+WMT2ld KOiOoYGkubna+ne9Rbut+qEslhmy5/U/aEgDcWTfTotSbRuO0Tjvgre3Nx7cvCQSetlSKPAPBQBS qyTQXwEYTEALJIAJgMp2bLHCBbF7q3XGV1Kn3Kl7L0ycOtO/+MTRI9ChrWVfaq/fvEWRUuUDBYCR mlVO6nhDKkcJTfbsC8hop0SblrSxcPZ0NKhby5KqZuu8fvNGRDkkrPXSs2snjLAiZv3w0ePRZ2BA 5LuE8ePj2vmTCBvWy+x45BRYuWYdajVw7NWMfrzu7u4ikZLSd//GeBjmxKDfyEaF9oe5VMvB4Uok jcJ4GxJda9df6hqSYW/i1Bn9CY3Ues5SLmEtMgLUpQM2mQfARQ0DmQA4yw6UOA4K8EKBXuwhZOVL luuGOd0paM+ooQNlfbXTfT99Rd66fcd/2PVq18TiuUHT4NpqXouWrghk4GWrfkJqN1bMmLh/46Is 7OSOk8Ls1mkU2DiUwixPmzBGVr9k1DVg6HAMGzXOfwh0MO3YtBbFi+jC2CopFMsgTeZcuHlb+ah4 csdJmhNym7O1vHz1Chmy58PzFy/8u6I0u/NmTJadD4KSazVu0TZQZlCKMUCeL8bZFm01LzKuNZUy 2Vb9KdluwlpD4RUzCfxsADVDApgAKLmLbNwWvYCf/XcjUHIbG3eJN2/fibCsFy4GpLMll0SyYi9b umSI6uVnz56LkLxTZs7Gz5+//IeaP28e7Nq8TlEjOHM4fPz4EdHiJw00DnN1lP6dUjT37dlN6WaD tEdBZijYjKGkS5sGk8eORMH8ec32T+l4u/Tsh5OnzwQqSwlwKBGOrYRiDFCsAUfL7i3rUcwGJMfU vA4dOSbS7eoDVlGZLJkyYsHsaZKyLX758hWUZMk4bDF5MFACIPJusJcYetzYq0+l+tETAGpPSySA CYBSO8gO7WTLkkkY49lbyJK+doNm2L4rsCVxksSJULVSeeTJlROU8Ia+4p49fwG639y3/xAOHD4S KOY9jZtIw6rF80H56u0tjrwGIEMvygiohFGeOdxoHVq07Yh5i5YGKUqHS7UqFZE3V06h4qavQzpE KPnTkWMnsHbDxiAZ36iRLu3bYKxC+SaCGz9FoaREVBQfwFGSKGFC3L16ziq7Cbljp+BDlGfh9x9d /g0SMrhtULe2uHIzduek9aWYIJu2bMf02XPFM2codIVBSbxqVK0kdyhWlac8FxQXQI1CBCAsuQH6 fftrhQQwAVDRbu3asS3GDLcuE5ml0yWDGPrKIHcwvaW5nLZ8fXwwsG8vdG7f2q4vV8MxjpkwBd37 WJ7DXc58jctakj3Pmv5ovUaMnYABQ0YEIWFy2iXXScrTQEZx9hBH55Lv17MbBvdXLjGVVMwobC+5 cVKqb2NJmiQx4seNg1+//+DDhw8iUNH3799NNk1Gf5RemPabvYVsD6LETQxKHaw2SVR7qMgFQKIl EsAEQEU7dfOaFShXxv4PtiFE5BJGB+mcBYv8Q8+GBKGPjw8a1q2Fvj27ImYM27hUSV1CsmWgJC+O kKXzZ6NOTfsmuKF5UqCWTt174+jxk7KnnTd3LkyfNFaSKlp248FUIAPGuElTgeIDOEIo8E8qv7TE 9u6fPG8oS6A+Fbfc/rNmzoTF82YiVYrkcqsqVr5UxWrYaZCESLGGbdxQotrDEDaQDYCEjIAuYBjI BMDGG0vJ5p/eu4FYNvJLljtO8junrxZ6adEL6/379/jy9asITRwxYgQkTZwYFICE4t3T178zCKm6 w0WPa3dLZVL/UzIgpXO+S8WUtAF79h/AjNnzsWX7zhA1AmG9vMT9NwXBKVwwv0O0NVXrNMC6DZul Tk+xcsmSJhHW/44Ueq5GT5gkQul++PBR0lDoKq5Pjy6oX7umTdxLJQ3Cr9CQkWPQf7BymT3l9G1N 2cR1hsErSChg1ycBTACs2TV2rEsHPxEAFusQiJs0DZ48fWpdIzJr58iWFScOBk56I7MJxYq/e/8e /9u7X9whv3r9Gh7uHvD19UGC+PGRInlSZM+aBUQCHClr1m8U7mz2FgqtTSG2nUE+f/6CDZu3iIQ+ lOPh3v0H4nqAQu1GjRIZdOjnyZVD2NQUyJvHIUTNFE57DxxE0dIVnQFCWWMgAhBIA+D/de/aJIAJ gKxt4rjCtg6Z67iZ2bdnCm506kxAlDR79N6sUX3MnqbLSshiHoFPnz8jcqyEgYzizNeyvsSKRXNR s1oV6xuyYQu/fv1G6NDWR+S01RBp7SLFSigMgtUkSUgDEDOJGLK/AaAGSAATAJXsUgoTSi5YlAeA LLfpy83Ty1PEt/dwDxqSVRdn3i3I7CjbWii3UCqZtfLDrNWwKXYZpElVvoegLVIYVjIuY5GOAGU3 pARE9hQKnZwieTJ7dumSfWXMmQ8XL11R1dyIAJj0AnBxEsAEQFXblAfLCDACtkIgZ45scA+lTH4D W41RDe3euHlTxA9RkySpM1xcAQgNgLEroAuTACYAatqlPFZGgBFgBBgBxRFIUnc4wvoZAWqJBDAB UHwrcYOMACPACDACakIgKREAAzdArZAAJgAq2aWUA6BMqeIiyEbLdp2x/5AupS1FB1wyb5ZwvaNI blVrN1DJjJQfJt3fpk+bRjT88NHjQKFsK5QtLWLhk6vi9p22y41ualaxY8XCiCG6AETHjp/CrHkL /IvNmDzePypi34FD7X7vrfwqhNxiujSpkdLPT/3uvXs4dyEgxHTVShWENfv7Dx+Ep4I9JUWypOjV rbPom8JeL1y6wr97iuFAbq4vX7/G4OGj7Tksp+qL3FkpTwIJpQCmSJ96SZQgARLEjyfeQ2Rk+/TZ c6cau7nBJK0XoAHQGwFqgQQwATC3M5zkdzrk69aqLkZTuWY9bNi8Vfy7SMEC2LN9o/j31u27UK5q TScZsf2H0b1zB5GoiGT5qrWo06iZ/yBeP7qLKFEig7KWJUqVwa6Do9wJV8+dEH0uWbEK9ZsEZFR8 9/S+eGmSpM+WR4RRdmUZPrg/enXtJKY4ffY8tOnY1X+6vz+9Fn7sFy5dRqac+e0KA8XMP7pvl+iT skZS2Gi9/Puqu88mNzyfqHHsOi5n6iycry8+vtSFaT5w6AgKlSznPzzDzJ6lK1XHjl3O4fYqFT8i AN6GgYAMUgK6sk0AEwCpO8TB5QwJQJVa9bF+0xYxoiKFCmDPNiYAhIUhAVi2cg3qNg7IiqcGApAu W25cuXrdwTvNtt2rggDsP4BiZUwQgG/f4BMltm0BcuLWXZkAJKs3AmFjJhboG7sBir+5qGEgEwAn fuAMhxYcAShaqCD+t22DKMoagAANwLKVq1G3cQt/CFVBALLmxpVrTAAcrQHYu/+gyIBprAH49v07 vCPHUskbQ/lhhkQA1i5fhCoVy4tO1agBIAIgNADBHPSuSgKYACj/nNikRUMCQPf86zbqQqUWLVwQ /9vKBMBYA7B0xWrUa6IuApA2a25cZQLg8CsA42h2+isASsATlgmAeO8YXwGsW7EYlSvorgTUSACS Cw1AyG6ArkgCmADY5LhWvtHgCECxwgWxmwmAANzwCkCNBCBNlly4dt21wz2r4Qpg34FDKFK6QhAN wPcfPxA2UkzlH26VtBiSBsAVCIB3rCQB6n+NaAKYAKjk4TMkANXqNATlECehxC27t6znKwAjAmBs bKeGK4A0mXOKGP3GEiFCeHiH9Za8UykM68tXr/zLR44UCZ6eFBlSujx/8cI/aRJFnvT18ZVc+d+/ v3j+4qXJ8mogAPsPHkbhUjp1tvjq8zMC/PHjB7yYAJjUAKxfucTfQ0CdGoDh8I7llw44uMA/LmgY yARA8mvNsQUNCUD1ug2xZr2OAFC2vV2b1zEBMCYAy1ehftMAa3s1EIDUmXPiugkCMHPyeLRoKj05 zp2795AsXRb/Dbt94xqUKl5U1gYOHyMePn36LOoMG9QPvbt1llz/3bv3iBwnkXoJwKHDKFzSFAH4 Ca9Ijk1pLXkRbFAwJA2AKxAAn1hJ/b77DQwBXVwTwATABg+KLZoMTAAagTKmkZQoWhg7mQAILAyv ABYvW4kGzVr5L4UqCECmHLh+81aQ7eMIAkBpkykjnSUE4O27d4gSR2dRbSxq0AAY32/rNQA/f/6E Z0QmALSmxhhtWLUUFcuVEcutRg1Aivo6I0AS/Ye+vzeAC5MAJgC2OK1t0KYhAahRrxFWr/MjAMWK YOemtbI0AJkypkec2PKsmffuP4Rv374hVKhQKF2ymKwZvnjxEqfPnvevQ54LXmGlq6Tv338oyTre kAAsWrYCDZu1VhUBSJUpB244CwGIFhefv1hGAN68fYuocXUvU1ciAL9+/UKYCNFl7X1XKhySBsAV CIDQAPid+lohAUwAVPKEBiYAjbF6nc7yv2SxItghkwAsWzAbtWtUkzXzhCnT48HDR/Dy8sK3t89k 1d20dTsqVq/jX+fBzcuIHy+u5DYmT5+FDl17mi2vegKQMTtu3LodZJ6O0AD4Ro0joiaSyL0CePPm LaLGUy8BOHj4KAqW0EW8E1+EfjYAlIo3TIRoZvchucMN6tfLbDnDAhQFcuOWbeJPtWpUxfIFc0Bu hyS/fv4S6XX//v2LHz9/ir+RPQIdVvT3d+/fg9Jc66Vn144YMXiArP7LVq6BbWYiZIZEADauXgaK tkmiRg1AyvpkA6DLBKklEsAEQNZj4rjChgSgZv3GWLXWjwAUL4odG9eIgUmNA2ANAQjr5YWvKiAA C5cuR6PmbfwXTA1XACkzZMPN23ecggBQxDuKfGcJAXj9+g2ixdcZVBmLGq4AgiMAv3//Rujw5glA s0b1MXvaJFkvi0Yt2mDhkuWBCIDUBj5++oQIMeI7lABsWrMc5cuUUjUB8ImdzCAIkE4H4OqaACYA Up8yB5czJAC1GjTByjU6y/9SJYph+4bVTACMbADoZUovVb2ogQCkyJANt5yEAHhHiS2ufCwhAK9e v0F0FROAQ0eOoUBx3X22OAT8NACSCUDjBpg9daKsNwYTAFlwKV6YNABEAMR6670ANHAdwARA8a1k mwYDE4CmWLlGZ/lfukQxbLMnAQgbFl/fPJU1SUdcASxYsgyNW7RVFwFInxW37twNgq0jrgAo4p1e BS33CuDlq9eIkUD3MjUWNWgADh89jvzFdOpsQwJA6naPcFHN7v3mTRpi1pQJZssZFlA7Adi8dgXK lS6peyepMBeAIQHQEglgAiDrMXVcYUMCULthU6xY7UcAShbHtvWrxMDscQXgHTYsvqiAAMxfvBRN WrZTFQFInj4rbjsJAaCANxT4hkQ+AXiFGAmSa5YAkMsmkTY5onYCsGXtSpQtXUK1BCCVnwbAwNVf E5oAJgBynlIHlg1EABo1w4pVOsv/MiWLYysTAIGFoRHg/EVL0aSVyghAuiy4ffdekF3mCA0ABbwh QzNLCMCLly8RM2EK1RIASqudr6juPlt8DfpdAZARnrtvFLNvgZZNG4HSPMsR1ROAdStRtpT6CYBY b4OFc/XrACYAcp5SB5Y1JACU5pbS3QoCUKoEtq5bKf5tFw2Atze+vH4iCwlHXAHMW7QETVu19x+n GmwAkqXNjDv3/nMKAkD+7uT3bgkBoCiAsRK5HgEg6/BQPpHN7v1WzRpj+qRxZssZFlA7AaB3EL2L SNR4BUAaAN84yYN4AAhC4MI2AUwAZD2mjitsSAAozS2luyUhtRup3+xFAHy8vfFZDQRg4RI0ba0u ApA0bWbcdRoCEB0/f/6yiAA8e/4CsROnNPmwqMEG4OjxE8hbJKgGQDIBaN4E0yeOlfWyUD0BWL9K aCPVSgBS0xVAHN21lbEboCuTACYAsh5TxxUOTABagNLdkpDhDRngMAEIfAUwd+FiNGvdQVUaAGci AOTvTn7vlmgAnj1/jtiJU6mYAJxE3iI6gzbx8ve7AqB/u3lHMvsSaN2iKaZNGGO2nGEBtRMAMkQm g2T1EoBh8I2TwsDtL7AboKuSACYAsh5TxxU2JACU5pay3QkCUKYkNq+xIwHw8cHnV49lAeGIK4C5 CxajWRt1EYAkaTLh3n/3g2DrCBsA8ncntzdLCMDTZ88QJ0lq1RKAYydOIU9hnTrbEgLQpkUzTJ0w WtYzonYCQK7I5JKsdgIg1lu/7kZugK5IApgAyHpMHVc4OAJAwTcoCAeJPWwAfH188EkFBGDO/EVo 3raj/4KpwQbAmQgAubuR25slBODJ02eIm1S9BOD4yVPIXcg0ASAbAL2KOLi3QduWzTBlvMYIgEHC KTXaAKSuPwzh4qYwSAfsR/5cnAQwAXDcmS6rZ0MCUL9JS1C6WxImAAEwGnoBzJ6/CC1URgASp86I /+4/cAoNgDUE4PGTp4iXLI1qNQDHT55G7kK6+2xjDYAUAtCuVXNMHjdK1vOtdg0ARSMt6ZdxUo0E IE0D3RVAoK98DWgCmADIekwdVzgQAWjaEkuW6wgAxd+mONx20wD4+uDTS+e/Apg9byFatOukKg1A olQZcP/BQ6cgAOTuRm5vlmgA1E4ATpw6jVwFTRMAQ1yCexu0b90Ck8aOlPWyUD0B2LRW5CUhUSsB CBc3ZYABoN7y38VJABMAWY+p4wobEgBKc0vpbkkoBSdl4rIXATBMCCIVDUfYAMyatxAtmQCIJdpu oJ6VumaGX7pyAwE9evwE8ZOnNdmVGrwATpw6g1wFAzJeGhoBMgF4JNbVOB0wZSQtoWICkLb+MPjG 03mu+HsBaIAEMAGQ+kZ0cDlDAkBpbindLROAwItieAUwa+4CtGzfWVUaAH3GReOt5ggjQENrd7kE 4OGjx0iQIp1qCcDJ02eRs0BAdj1DAmB4NRLcK6FDm5aYOGaErDeG2jUAuzavQ/GihVWrASACEC5e yqAGgC5OApgAyHpMHVc4EAFo3hqLluoIQKXyZbF+5RL7aQDC+eLjC91XgFRxhAZg5twFaMUEwGIN gDUEgNJGE5kxJWrQAJw6czZQel25BKBj21aYMHq41MdDlFM9AdiyHsWLFFI9ARAaAL+V04ImgAmA rMfUcYUNCQCluaV0t44gAOHDhcOHF0HvqUNCxiEEYM58tOrQRVUaAPpqpq9nR2sAjAPeyNUAqJ8A nEOO/Lr7bHEgGMQBMHSPDG7Pd2rXGuNHDZP1slA7Adi9ZT2KqZkANBiKcHEDYldohQQwAZD1mDqu cCACYJA7vHKFcli3YrEYmD3cANVCAGbMnofWHbuqigDQvTndnzuaABjHvJdLAMiQkQwa1aoBOH32 HLLnM00ADAMkBfc26Ny+DcaNHCrrZaF6ArB1A4oVLqheDUCDYQhPVwAGiQC0QAKYAMh6TB1X2JAA NG7ZFgsW6yz/q1Qsj7XLF9mPAIQPhw/PnV8DMH32PLRhAiD2hVwjQGsJALkykkujegnAeWTPp7vP NtYAhIkQHb9+6UIkByddOrTF2BFDZL0s1E4A/rd1A4qqmACka6CzARDrrSESwARA1mPquMKGBIDS 3FK6W0cQgAjhw+P986C+6iEh44grgOmz5qJNp27+w1JDICDynScXOmOxtxGgcd57uRoAimZIQY3U SgDOnDuPbHlNEwDPiAE5EpgAlPOHYM+2jShSqID4bzW6ARIBCB8/VRAPAEEI9ERQHxTIhQwDmQA4 7kyX1XMgAtCqHSjdLUnVSuWxZpn9NAARIoTH+2fOTwCmzZqLtkwAxB6RqwGgEMB0160XrRGAs+cv IGsenUGbOAAMbAA8I8XAzx+6LInBSdeO7TBm+GBZz7faNQB7tm9EkYLqJQDpSQMQX2cDYGz858ok gAmArMfUcYUNCQCluaV0tzoCUAFrli0U/7aHDUDECOHxThUEYA7aduruv2Bq0ADETZoGT546XgNA SYDorttSAkAZDSmxkSlRgxdASATAK1IM/DBDALp1ao/RwwbJelmonQDs3b4JhQvmF3NWpwZgKCLE Tx3s176rkgAmALIeU8cVDkQAWrfHvIU6AlCtckWsXrrAjgQgAt49C5qwJiRkHHEFMHXmHLTrrC4C QAl0KJGOsdj7CoDuuOmu21KYFqMSAAAgAElEQVQCcOfePSRLm0W1BODchYvIkltn0CZe/AYagLCR YuL7jx8hvgi6d26PUUM1RgB2bELhAuolAOkbDEX4+Lr8FcGp/F2RBDABcNyZLqtnQwJAWe4o2x0T gMAQGgYCYgIQcADLvQL4+fMX6K7bYgJw9x6SpVMvATh/4RIy59aps40JgHfkWPj2/bsZAtABo4YO lPV8q10DsG/HZhQqkE/MWY0aACIAERKkDj4ZkIsaBjIBkPWYOq6wIQFo3qYD5vgRgOpVKmLVEjtq ACJGxLun/8kCwhEagCkzZqN9lx7+41TDFUDsxKnw7PnzINharQEwSNUqZeFIxU2qbksJwO07d5E8 fVaTXanhCuD8xUvInMtyAtCjS0eMHDJACtT+ZVRPAHZuRqH86iUAGUgDkMBPAxCckZ8LkgAmALIe U8cVDkQA2nYEpbslqVG1ElYuni/+bQ8bgEgRI+KtCgjA5Omz0KFrT5URgJR49vyF4gRg2/pVKF0y ILmNuV3848cPeEWKaTEBuHXnLlKomABcuHgZmXLp1NlBNABRYuPbt28hQtiza0eMGKwtArB/5xYU zJ9XtRoAIgAREqTBP78LAL0roKtfBzABMPc2dJLfDQkApbmldLc6AlAZKxfPsx8BiBQRb584vwZA jQQgVqKUeP5CeQKwdf0qlJFBAL5//46wkWNZTABu3r6DlBmyqVYDcOHSZWTKaZoA+ESJja9MAIIk A3IVAiAIn4ZIABMAJzngzQ0jEAFo1wmU7pakZrXKWLGICQBhYWgDMGnaTHTs1ktVGoBYiVLg+YuX imsAtqxbibKlSpjbYv6/0xeud5TYFhOAG7duI1XG7KolABcvXUHGnDp1trEGwCdqHHz9+tWMBqAT RgzuLxlvKqj2K4ADu7aiQL48qtUAZCQNQMI0BjYAum9/V9cEMAGQ9Zg6rrAhAaA0t5TuVkcAqmDF orl20wBEjhQJb57ckwWEI2wA1EgAYiZMjhcvXylOADavXYFypUtKXjP6wqUvXb3IjQNw4+YtpMqU Q70E4PIVZMxhmgD4RouLL/9v7zzApCjSPv6uwC6b2Jwzy7KEJWf09Ax3pyIGFBQUJZjw884ASs4Y QBCMmDHnnBAVCRIkqwQlC5LjsoRlCcv3VPeE7tmZ6e6d3unqmn/dc4/AVFdVv/1W16//b4XjxwEA 8xfQxZe7NwKa9/03dOEFnW0PAOpBX3wIAADofi1am1EFAP97kNhxtyz17HE9vft6EAEgMYEO7uAf AKY9O50eeHiY66HZYRJgWl5D2re/BgDgo/eoaxf9AHD8xAmKSc6qNgD88ed6atK6o20B4PfVa6lF BzmeLQ0IimWAsSnZdEwDAIYOeoDYZEcjye4KgO0BoM94issrcT9z10RAsSEAAGCkl1qYVwkA7JS7 F16WJ/71uvEGemfGy8FTAGwCAFOfeZ4eHDzcZgBQRPv2HzBdAfjio3fp6i5X6PZe9oXLvnSrqwCs +3M9NbUzAKxZSy3a+wCA1Gw6dsy/AhCKADD/h2/pH+d3sq8C0Gc8xeeXqM8BCAEIAADofi1am1EJ APfcN5CmuwCgO70z46WgAUBSYiId2LHZkDGsCAHYEQBSc4to/wHzAeDzD9+ha666UvczYwNcbGr1 AWDtH39SSRt5MPBMdlgGuHrtOmreTo5neyoA9VJz6OixY35tOfShB+nRsSN125tltLsCYH8AmEDx +U3l561c7ic4BAAADHVT6zKrAOD+QcSOu2Xp5pu609uvBREAkhKJyelGkhUA8OTTz9HAISNczbRD CCA1twHtP3CwimkD3Qfgsw/epmu7dtH9yNgAxwY6ZzI6B2Dtuj+opK0cD7YjAKxZ+wc1a+duvzIE UC8th44eBQDM9ZgD8POPM+mCznLYx44bAbXqwwCgpMoKACUQiLg6AACg+7VobUYlALBjbtlxtzIA 9KC3X3tR+nMw9gFIAgAYdoQmjYpp7cpfpOveeu8DurX/3a4yDu/6i+Lj46S/p+Q2oAM1AACfvv8W XXf1VbrbXXb0KMWl5VYbADwHUGXFdlAA1qz7g5opAEYJAHHpuVRWdtSvLYc99CAxaDKS7K4ALJg9 k87vZGMA6DuB4h1zADwHepEhAABgpJdamFcFAA88ROy4W5Zu6dmD2G/BAoDkpETabwMFYMpTz9Kg oe6XsB0UgJScQjpw8FAVLwtUAfjkvTep2zXuGdtabswGODbQOZNRBcBTQrcbAHgqGEoAiE/PoyNl ZQAADwVgwezv6PxO8soPeyoA4ymhoJnPZYCiQgAAQOttyMnvSgBgx9yy424tAYDkJNq/fZMhq1gR Apg87Rl6aJh7JrYdACA5u5AOHrIeAI4cKaP4jLxqA8DvHpPobAcAHnMYVACQkUfMPv7SsIcH0iNj 3OEnPZ3F7grAwp++o84d7QsArfuySYDNpEflXvuvXgEgIgQAAPT0Tg7yKAGAnXLHDrthqXevG+nN V14IngIAADDsDXpDAEnZ9enQocOmKwAfv/sGXX/t1brbXVp6hBIy86sNAL95rKO3GwCs++NPaqqY xKgEgISMfCo9cgQA4KEALPxpFnXuKG/+ZEcFgAGASgHwMflPNAgAAOh+LVqb0RcA3NrrJnrjlelB A4CU5CTaZwMF4Impz9DDw+2lACRl1adDh80HgI/eeZ1uuO4a3Q58uLSUEjMLqg8AHjvp2Q0APPcx UAFAZgGVlpYCADwAYNGcWdSpg/0BQDXAhwAEAAB0vxatzagEAHbKHTvtjqVbb76J3ng5mACQTPu2 bzRkDCtCAE9MfZoeHu4+kMUOIYDErAI6fLjq4BLoHIAP336dunfTDwAMQhiMOJPROQCeh+nYDgDW b6Amip0MlQDg6xkp73H4wwNpQoiFABbN+Z46dZDPf7CrApBY0LzqOQCCQwAAwNBQZl1mXwBw2809 6fWXnw+iAmAPAJj05FM0eIT7THZbAEBmAbGvb88UKACw46LZsdF6EwtDsHBEdQHA8zhduwGA51bG SgDwpdKEOgAsnvsDdWwvHwFtRwBoI4UAmkvtr7LcT2AIAADofStanE8JAOyYW3baHUt9bulJM14K HgCkpiTT3m38KwATpzxFQ0baCwBY3J3F380GAHZcNDs2Wm86ePAQJecUVhsAVv76G7Xp/E+v1dlh GaDnYUYqAPAxT0MFAIMH0oTRoTUJ8Jd5P1CHdnYGgHGUWL+F78OABIUAAIDet6LF+XwDQC+a8dJz QVMAUlNSaO+2DYasYUUIYOKUaTRk5FhXO+2gACRk5FGplxnmgSoA7Lhodmy03nTg4EFKyWkQsgCw fsNGaqQ4zVAJAL5WagAAfqQO7drYWAGQAUBSAHzt/icgBAAA9L4VLc6nBAB2zC077U5SAHr3ohkv AgCYLZTHAdsRANjSO29LzAIFgHdff5l69rhBtwez3QjZroTOZHQOwIpVv1Lb8y+2rQKwYeMmKm4h x7OlAUFxGJCvvRoAADYHgD7jKKmwBTl3AQ4VCAAA6H4tWptRCQDslDt22h1LfW+9mV574dmgKQBp qSm05y/+FYDHJ0+loaPG2UoB8LXLXKAAoPQdPV68f/8BSs0rqjYALF+5itpdcIl9AWDTZipuLsvZ 1QGAUDwLYMn82dS+bWvJXracA+AAAOl5O597CCgBAAA9b0QO8vgCgH633kKvvvBMEAEglfb8td6Q RawIATw2eSoNsxsApOUS24bXMwUKAGySKJssqjexI4nZ0cTOZFQBWLZiFbX/h30BYOOmzdTQBwD4 Oq9BaVulEqXX5nbfCGjpz7OpXRv7AkDbvu4QQChBAABAbw+1OJ8SANgxt+y0O5b63XYLvTo9iACQ lkp7tvIPAI8+8SQNHz3eVgqAr4NmAgUABogMFPWmvfv2U3p+IACwktr/41LbKgAbN2+hhs3keLan AuDrxEblzQ68716a/Jjb9/TY3f4A8BO1a9NKulU7KgBt+46XQwCKowBDQQkAAOjpnRzk8QUA/W/r Ta9MfzpoCkB6WirttgMATJpCw8dMsBcA+DhqNlAAeOm5p+iOvrfq9uI9e/dRRkFxtRWApctXUIcL L7MtAGzavIWKfABAWl4R7dtf9chm5c3ef+8AmjrpUd32ZhntDgDLFvxEbVvbFwDa9R1PiYXOSYDu 84BFhwAAgKFual1mJQCwY27Zcbcs9e/Tm155PpgAkEa7t/5pyBBWhAAemTSFRtgMAGJTs+nYseNV bBsoAEx/+km6+/a+up/Znr17KaOgUbUBYMmyFdTxIhsDwJYtVFTiXQFgoREWIvGX/jvgTnp6ykTd 9hYBAJYvnENtWrW0rQLQru84SmrQ0r0CIESUAACAoW5qXWZfAHB7n970MgBAejDK2OsjEyfTiLGP 2EoBiE3JpmPHzQeApyY/Tv+75y7dzrt7zx7KrN+42gDwy9Ll1Omf/7KtArB5y1ZqUCLHs1lSrgJI zy+mvfv2+bXlPXfdTs9NfUK3vQEAhkxVI5mdACA9b+fkvxCAAABAjbiT+YUqAYAdc8uOu2WJSbtM 4mXp629nUdcbbtKs/J0ZL1GvG7tr5lNmyG/UnLZt/5sy0tNo1xb+FYAJEyfTSJsBQExyFh0/caLK cwlUAXhs/GgaMvB+3c971+7dlFXYpNoAsHjJMup88b+FBAAWGmEhEn+JqS1MdTGS7B4CWLFoLrVu KUvodpwDwAAgmSkATugLEQgAABjppRbmVQLAQ8NG0uRp1QcAtplPTEy0obvZ/vcOOnPmDNWqVYvy cnMMXcsGtb2Kl2ZuTjbVrl1bdxns/HW2O51WUioAEx6fTCPH2UsBiE7OohNeAOA/l11CLVvIR5Xq SYdLj9BLr77uylrUoFCSZ+vUcds8IiKCwsLC6OTJk1K+06dP09mzlVRZeZaOlB2lH3+a67r+wgs6 S/u8l5dXzVtx6pSUr6LilDSB6uzZM7R33wFauPgX2wLAlq1/UWFTOZ7NklIBYKERFiLxl5KTkuiC zh0pNjZGlY31nXOV56jyXCVVnq2kU6dPO2xXQWz75L937JT+zk6P7Nrlcqo4WUGV587RmbNn6Mzp s9IWtVWfV6UEjd99/6OrLrYl70X/OF+Pq7jyfPzZl8SUD38pNiaGyvb9LWWZ63EYkN0BoL0jBCA9 b+dzDwEIAAAY6ibWZVYDwChi592zdGe/2+jFZ6dJf9arAFh3FzVbsxIAxj/2BI0a756IZYedAKOT MulEeXnNGsni0u2wFfDWv7ZR/SZyPNsTADLrN6Lde/wDgMUmrrHq/QHAykXzqFVLeS99OyoADACS i1q5VgGECgQAAGqsu5hbsBIA2DG37LhbCQD696EXn5kKAPCYAzDusUk0evxjrodgBwCISsqkcgAA /fr7amrV8UJzO5BGaewse3amPUv+AaAxsTkSoZj8AcCqxfNdKpWdAUACPkfsPxQgAABgk56sBoDR xI67Zemu/n3oBQCAZAulAjDu0Uk0eoLNACAxg8odkrxN3NJwM+2gAPy1bTsVNJbj2Z4KQFZhY9q1 GwDgGQJY9ct8atlcDlPZFQBSmALgfOYhAgEAAMOvMGsuUALA4BGjadKTDgC4vS+xSWIsIQRwH02c IJ8AOPbRiTRmwuO2UgAiE9LpZEWFNQ4WpFrtDgDZDZrQzl27g2QtvqrxpwD8+svP1KJ5iW0BoEPf sZRcJK/8CCUIAADw1cd8tkYNAGOInXfPknLGMQDADQBjHnmcxj7iXotthxBA3YR0qgAAWB4CYKtd 2KoXbwpAdoOmtHPXLpu8Ncxtpl8AWPIztWhmbwBIadhacRKgQ/0RXAkAAJjbR2qsNCUAsGNu2Wl3 LA24ox89/9QUKAAeIQB7AkCaNJte5GQHBYCteMkrdq+6UK4CyClqSjt2AgA8QwC/LVlAzZs1tbUC wABAUgBchwCJDwEAAJu8bZUAMHTUWHp8sgMA7uxPz0+bDADwBIAJj0thAGeygwIQEZ9GpxzL6mzi loabCQAwbDJuLvCnAPy2dAE1L7ExAPQbSymOEEAoQQAAgJvu5b8hagAYR+y4W5buubM/PQcAkGyh nATIVgCwlQD2AoBUOnVKXhsuarIDALD1+LkNZTlbGgxOHHb9mf27c72+qM/I1335A4Dfly2kZk3l zaPsOAmwQ7+xlNqwjfowoBBQAkIHAM6cJDqyi+hUOdGedUTrf7BV/+12zVXUzEHYs+fMpwWLFkvt Z0dwXnm5vO3qho2b6b0PP7bVfZnZ2L69b5bORig9coRmvPk2ffL5V67iZ3/7BcXF1aPdu/dQ1xv0 H41rRvtSkpPpnrv6S0X9vnotffbl165i5876ms6ePUts854be/eV/ixy+r+7byf2nFj66NMvXKEs 9vdRQx+msPPCpE2jXnhlRlDNkJOdJZ2syVJZ2VHXaZvs76OHD3a1Zdoz04ltTBWKKTw8nIY+9IB0 69u2bafX337PZYb333yNGhQWSH+/b9AQWrh4ia1MxCYBphbL5z+oTgQUHAJCBwB2ryGaJ8+cR4IF YAFYABaABZwWiM8uoqikDKpTN5oyOlxNyRnZLuOIPCcAAIA+AAvAArAALAALOCwQfcVgat66HSXF RAgPAQAAuD0sAAvAArAALOCwQOTlgykis5gaZ9QTHgIAAB5u/9PML107WqFHBNcCFacqqLLSuQ1H cOsWoTa2gqCyslKEWwnaPbB4r+ibL8kHPYk7t4T5vJ7lswcPHaJre8jzT/ylqMsHU52MYgoLI+Eh AADg4Qmrly+ikibus9C1nAW/wwKwACwAC/BvAXaGQ2Z97Xd79BVDJABgcCg6BAAAPPx24+oV1KCw Pv/ejBbCArAALAAL6LaAfgAYTOEZjaQtgUWHAACAh/ts37CG2JIgJFgAFoAFYAFxLGAUANidiw4B AAAP/963fSOxddtIsAAsAAvAAuJYwAgARGQ2Um0JLKoSAADw8O8je7dTvdhYcbwedwILwAKwACxA egEg5oohFJ5ZLFlMuQeAiBAAAPDoGAX5eRTGZn4gwQKwACwACwhjAbYSgp30qJUYAEgKgONgYJEh AACg5Q34HRaABWABWCBkLBBz5RCKyGAKQJjwEAAACBm3xo3CArAALAALaFkglgGANAeATQEUGwIA AFregN9hAVgAFoAFQsYCDADqZsmTAEWHAABAyLg1bhQWgAVgAVhAywL1mAKQ1UjKJjoEAAC0vAG/ wwKwACwAC4SMBRgA1M1qrIr/i6oEAABCxq1xo7AALAALwAJaFqjXZSjVlZYBquP/IkIAAEDLG/A7 LAALwAKwQMhYIK6LQwHwMglQNAgAAISMW+NGYQFYABaABbQswAAgUgoBeJ8EKBIEAAC0vAG/wwKw ACwAC4SMBeKvYiEAxyRAwSEAABAybo0bhQVgAVgAFtCyAAOASMcyQJZXZCUAAKDlDfgdFoAFYAFY IGQs4AQAafBno7/AEAAACBm3xo3CArAALAALaFmAAUAUUwAcGUWGAACAljfgd1gAFoAFYIGQsUCC IwTg/PIXWQkAAISMW+NGQ94CkfFEUYlEETFEdSKJ2KmXZ08RnS4nOlFKdPyg/HckWCCELZDQdZis ADg+/UVWAgAAIezouHWBLRAWRnXTG1BUXguKyGhIESn5FBYeLd3wmcpzdFb6f6Xjv+fo7Dkidlzq 2bL9VHlgC53Z/SdV7lpNVF4qsJFwa7BAVQskdB1K0dmNFdsAyxMBRVQCAAA27AG9bryBru3axZSW v/P+R/TF19/6LSsnO4umPD7BlPpYIffcN4gOHDzot7xGxUU0buQwU+r8c/1GGjX+UVPK4r2QOnGp FNfsUoppeAHVjklQvLjkV5gynin/3fnv5yRFwLnGmf1WWVlJFbvX0/G1s6l8yzKiyrO8374p7WvU sIjatW1tSlnM95atWKlZ1hX/voySk5M08+nJMHPWj5r9KyYmmq67+io9xenK89W3s6i0VAxYTOw6 lKKyG7v6i8hKAABAl3vzlenRcaNo6KAHTGnUkJFjaOKUp/yWVdK0Ma1etsiU+lghuQ1L6O8dO/2W d36njrRg9kxT6vx54WK68F9XmlIWr4XUiU+npA7dKLa4M1HYeRqDvXwX7q8a3xDgfPmdLttHZYvf o/Ity3k1gWntuvfuO+iZJyeZUt7Tz79I9w0aolnWojmzqFOH9pr59GToeNG/aMky/8+pID+ftqxb pac4XXmatzufVq9dpysv75kYAEgKgKOh7gOBxFMCAAC8e6OX9tkdAHKKmtKOnbuCBgDzFyyii/5t jmLCm7uE1apDyR2vp4Q2XYjCaim+4h2DvGIZkzTou774jUMAK+rktlVUOm8GnT1+mDdTmNYeAIBx U4oEAElsDkC2eyMgud8o+o4CDJwg7W13QDvsGAgAMO7rll9hdwDIbtCUdu4KHgDM+3kh/fM/5smd ljuAowF16qVQVtcHqW5qvvvccvamckn5NQMBlSeP0aHZL1DF9t94MYWp7QAAGDenaAAQncPmADiU MYGVAACAcV+3/IpgA0Czpk3o92ULTbvvrMImtGv37qApAHPnL6CLL+9qWvt5KCgiOZdyuw2l2tEs zq+Q8NkJZkGAgHPnKunoss/o6IrPeTCHqW0AABg3p1AAcPUwis5qpAJpUcMBAADjvm75FXYHgMz6 jWn3nj1BA4A583+mSy6/2vLnZlYDojKLKefah6hW3RjFpL7gQwC7n+Pr5lDp/Bnu2YVm3aSF5QAA jBtfLAAYSjHZTaqAtIgQAAAw7uuWX2F3AMgoaER79u4NGgD8NG8+XXrFNZY/NzMaEJleSPndR9B5 4ZHuwd8V57cQAubNUEwrNONOrSsDAGDc9iIBQDJTAKQ5AFXVNNEgAABg3Nctv8L+AFBMe/buCx4A zJ1Pl15pfwBgMf/Cmx+h2lFxCtlfNqN7eZ81EFC29FM6uuIzy/uGGQ0AABi3okgAkHINAwDnHACx IQAAYNzXLb8i6ABQ0oR+X2reHIC0vIa0b//+oAHA7Dnz6LIu11r+3AJpQFit2lTYazzVTS2Qvkyk Qd8V+7ceAticgINfPUEVO9cEcptcXAsAMP4YhAKAq4dRDJsEqDwK2GNejShKAADAuK9bfoXdASA1 t4j2HzgQNAD48ae59K+rrrP8uQXSgLQLelBqx25uWZJDCDhTuof2fjCUqPJMILdq+bUAAOOPQCgA uGYYxTg3AhIcAgAAxn3d8iuCDQDNS5rSb0sXmHbfKbkN6MAB/zsBmrkR0A+z59C/u7LB054pPC6F ivtNpbDaddTL/TiEgMNzX6UTf8y1p6EdrQYAGH98ogFArLQM0KGsCQwBAADjvm75FbYHgJxCOnDw UNAUgO9nz6H/2BgAci4fQInNLnbMSnZuSKLetpeXcMCJrcvp0Hf+d5a0vANpNAAAYPwJiQQAqUwB yHFvBSyH2zz6nWKvDTuHAwAAxn3d8ivsDgDJ2YV08FDwAGDWD7Pp8mtusPy5VbcBDXqOkSYluWcl 8wsB5VtX0MHvplX3Vrm4DgBg/DGIBgCxuY5lgB7nZ7h29xNkTgAAwLivW35F0AGgWVP6bYl5IYCk rPp06LD/rWTNDAF89/2PdMW13S1/btVtAAOAmBznC8k5K5lPCDixZTkAQPGgcRZAdb3euuuYAsAA QPry97J1tkgQAACwzs+qXbPdASAxs4AOa5wcZiYAzPz+R7rSxgBQ1HOsvC5ZcVqfvNsffxDAFIAD M6dW27d5uBAKgPGnIJICkOYAgKqHZYk3JwAAYNzXLb/C7gCQkJFPpUeOBG0OwLezfqAu1/Ww/LlV twFFvcZRTHYjj53J+FQCyreuBABAAaiuq3NxXdq1wyk2x7ERkKNFoioBAAAuXM5YI4INAC2aldCv S3421kg/uePT8+hIWVnQAOCb776nq7rdaFr7g11Qw5vHU3RWsVuS5FgJYCGAAzMxB8DpIwgBBLu3 BF5fOgOAXMVGQAJDAAAgcH8Jegl2B4C4tFwqO3o0aADw9cxZ1PX6m4L+nMyqkAGASwFwxiU5hYAT f62kA98iBAAAMMv7g18OA4B6bBIg+580ByDMseWWeHMCAADB96+Aa7Q7ANRLzaGjx44FDQC++vY7 uvqGngHb3aoCim9hCoDjfHLXpCTlsb/8hAOYArAfCoDLVaAAWNVrql9v+nXDqZ60DJAN/GJDAACg +n5i2ZXBBoCWzUto1S/mhQBiU7Pp2LHjQQOAL7+ZSdd072XZ8wq04uJbJlBMdrHi8B/Ffv+cKQEn tq6g/VAAAACBOr2F1zMAiHMtAxQbAgAAFjpadau2OwDEpGTT8eMAAL3Pv1HvCYo5APJV7klJfCkB TAHYBwAAAOh1bg7zZTAFIFex74bASgAAgEMH1GqS3QEgOjmLTpw4ETQF4Iuvv6Vre9ysZVZuf2/U +xGKziySlgHKgz+/EAAAULsRQgDcdiufDWMAICkAUuTfveOmiOEAAID9/JOCDQBmrwKITsqkE+Xl GgDQgRbM/s6Up/P5V9/QdTfeYkpZVhTS+NZHJQCQ1/7zDQHHoQCoXAQAYEWPCazOzOtGOBQA54mb 4kIAACAwX7Hk6kfGjqRhDz1oSt1DRo6hiVP8793e3OSdACMTM+jkyZN+29+5Ywda+JM5APDZl19T t5t6m2IvKwppfNtjFJ3RwC39cwwBAAAoAFb0ETPrzGQKQB7bedOhtAmsBAAAzPScIJU1YcwIGv7w QFNq0wMAzUqa0O9LF5pSHyukbkI6VVRU+C2vU4f2tGjOLFPq/PSLr+j6nreaUpYVhTRhAOBUABTL AFlbeAsHHNuMOQBKH4ECYEWPCazOzG5yCEDVvwSFAABAYL5iydXjRw+nEYMHmVK3HgAoadqYVi9b ZEp9rJCI+DQ6deqU3/I6tm9Hi+d+b0qdn3z+Jd3Q6zZTyrKikKZ9Hqeo9ELFVsCOSYAcKgFMAdj7 DfYBcPoJAMCKHhNYnTEE27EAABleSURBVAwA4pUKgMBKAAAgMF+x5Opxo4bRyCEPmVK3HgBo2qQx rVluHgCEx6XS6dOn/ba/Q7u29Mu8H0y5x48/+4K639zHlLKsKIQBAAsBOOcAeK4A4EkJOLZ5GQBA 4SQAACt6TGB1ZnUbQXFsFYB01oZclqjhAABAYL5iydVjRw6lUUMfNqVuXQDQuBGtWbHYlPpYIeFx KXT69Bm/5bVv24aWzP/RlDo/+vQL6nGLfQGgpO9EikqvrzgO2DkpiT8lgCkAe75+0pTnZlUhOAzI uOVFOgwoS1IAmjqAW2wIAAAY93XLrxgzYgiNHjbYlHboAYAmjYpp7cpfTKmPFVKnXjKdOXPWb3nt 2rSmpT/PNqXODz/5nG7s3deUsqwopKTfRIpOL3RvS+p5FjlHqwOOAQBULgIFwIoeE1idMgCwOQDK HTbFVAIAAIH5iiVXjx4+mMYMH2JK3XoAoHFxQ1q3aokp9bFCascm09mz/gGgbetWtGzBT6bU+cHH n9FNt/YzpSwrCmnWfxJFpTEFwOP4X9cugPwoAUwB2A0FwOUmAAArekxgdWZ3G0HxeY0d+/+LDQEA gMB8xZKr2dc/UwHMSHoAoFHDIvrj16VmVCeVUSsmiSorK/2W16ZVS1q+cI4pdb7/0afU87b+ppRl RSHN+k2i6AynAsA3BLBVAAAAt5cAAKzoMYHVyQAgIZ8tA5S3AhJZCQAABOYrllzN4v9sHoAZSQ8A FBc1oD9/W2ZGdVIZ50Unuray9VVo65YtaMWiuabU+d6Hn1CvPrebUpYVhTTv/wRFpRVUXQXgkij5 mRMAAFB7CADAih4TWJ051zMFwLkMUGwIAAAE5iuWXM1WALCVAGYkPQDQsKgBrTcRAMKiEjSb3qpl c1q5aJ5mPj0Z3v3gY7q57x16snKZhwFAdHp976sAOIMAAAAAgMtOZKBRDABkBUC+SGQlAABgwDF4 ycr2AGB7AZiR9ABAUYNC2vD7cjOqkzoTUwC0UssWzWjV4vla2XT9/s77H9Et/e7UlZfHTC1un0xR afm+VwFwBAEMAHZ9NYVHM+puE1YB6DaVK6NIqwCcACAP/mJDAADAuK9bfgXbBZDtBmhG0gMADQrr 08bVK8yoTor9szkAWqlF8xL61aQjiN9+70Pq3f8urSq5/b3lHVMkAJDX/zsnJXnI/pxAwLEtKwAA Ck9CCIDbbuWzYQwAEpkC4MghMgQAAOznn9I5AOw8ADOSHgAorF9Am9asNKM63QBg5vkD9geAJykq LU+yP+8QcBQKgKqfAABMeW0EtZDcG0ZQgnMOgOgQQH0/dIJOUI0c9Mp2ryGa93TQq62JCocMeoAe GzfKlKL1AED9gnzavHaVKfWx5X9sGaBWMvP8gbfe/YBuvf1urSq5/b3lXVMpKiXX1T6eIeDY5hW0 EyEA17MCAHDbrXw2LJcpAAWOjYAYdAsMAVAA7OefNHjgffT4+DGmtFwPABTk59GWdb+aUt+ZM2eo Tr0UzbLM3H74zXfep9vuGKBZJ68ZWt05VVIAnFsA86wEMAVg55eYA+D0JQAAr73Kd7vynAqAcp8N QSEAAGA//6RB999LTzw63pSW6wGA3Jxs2rZ+tSn1sTMA2FkAWqlRcUP6w6TNh954+z3qc+c9WlVy +3uru6ZRVEqOahkgrxAAAFC7EQCA227ls2EMAKQ5ANKUG8VcGwEhAABgP/+k++8dQFMnPWpKy/UA QFZmBu3YtM6U+tgpgOw0QK1UVFifNpg08fD1t96lvnf9n1aV3P7e+m4WAnAoAIoXEo8QcHTzMtoB BcDlSwAAbruVz4blMwUgX3EcsMAQAACwn3/SfwfcSU9PmWhKy/UAQFpqKu35a70p9VVUVFDdhHTN sswMO8x48x3qd/e9mnXymqHN3U9RZEq21xUAvEEAAAAKAK/9SG+7GACo5gAIrAQAAPR6BUf5BtzZ n56fNtmUFukBgOSkRNr/92ZT6jt58iRFJmZolpWTnUXbN6zRzKcnw2tvvE39B/xXT1Yu8zAAiErN 8bkCgCcIKNsEBUDpRFAAuOxSfhuV332kFAJw9yvHfgACKgEAAPv5J/Xv05teed6cFQ16AKBebCwd 2bvdFEuVl5dTVFKmZllpaam0Z6s5qsOrb7xFtw/4n2advGZoO+BpikzOdpxP7n0vAF4g4OimZfQ3 QgAuVwIA8NqrfLcrv/sISspvqpj9L68DEHFOAADAfv5JN3XvRu+98aopLdcDALVqnUenyw5QWFhY wHWeKC+naB0AEB0dTcf27wi4PlbAK6+/SXfcc58pZVlRSNt7nqao5GzHC8j3XgA8QEDZRgAAFAAr eol5dRZ0Z5MAm8qDvqNY5woc0SAAAGCe3wStpFq1alFqSgpFR0dReHg4hdepQ+zfWGKDdEREhO62 bNu+nXbs3KWZPzExgZgSUKdOHen//tKpigqqdG6fRUTl5Sdd2SvPVdLevfs062MZWOgh1lFn7dq1 /V7DQgvOVHn2LFWcOu36+/ETx6ms7KiuOnnM1O7/nqHIpCz5hSQLANyGA1gI4O8v7L0MsHPH9nR1 lytMcYWFvyylr76ZqVkWC+vl5bB5HoGn5158lf7e4R+eExMS6OEHzVPFpj07nfbo7NeB32HNlsAA IEnaB0CuR2QIAADUrC+hdFggYAswAJAVAKUUyScEHNm01PYAEPADQwG2tkBBj5GUpFwFIDAEAABs 7apofChYoP1/n6XIRDZvQrn/P59KAFMAtn9hzgTVUHi2uEf+LMAUgOT6JWrgFhQCAAD8+R9aBAuo LND+3ucoKjlTLftzGg4o27QcAAD/tbUF6jsVAOWsf0HDAQAAW7sqGh8KFujw3+flpZOesX8OIYAp ANs+hwIQCn4p6j3W7zGCkp1zAASHAACAqF6M+xLGAh3/xwDAoQBwDgFMAQAACON6IXkjTAFILvCx E6BgSgAAICRdHDdtJwt0/N90ikxkuyc65gBwDAFHNkIBsJNvoa1VLVAoAQDbB8DH+n+BIAAAgB4A C3BugU73TVdsn8w3BLAQwF8IAXDuUWiePwsU3jiSkl37AIgNAQAA9AVYgHMLdLp/OkUmpLvWJfOs BDAF4K/Pn+DcomgeLODbAgwAUlT7AIgLAQAA9ARYgHMLdL7/RaqbIB+h7N5fiU8l4MjG5QAAzv0J zfNvgQZMAZDmALA+JucVNRwAAEBvgAU4t8D5EgCkqV9CUpv5gwCmAGz9DAoA5y6F5vmxAAOAlPps J0DnuRviQgAAAF0BFuDcAuc/8BLVjXcoAMqJSRxCwJFNywEAnPsTmqetALAQgHrZrZgQAABAb4AF OLfA+Q++RJHxae6dyTiGgNKNS2nrZ9gHgHOXQvM0FIBUSQHw3G1TPAgAAKArwAKcW+CCgS9T3bgU 9VbAnEJAKUIAnHsTmqdlgSJHCECK/QsOAQAALW/A77CAxRb4x8BXqG5csmPIV5wHwCEEHN7AFADM AbDYZVB9ABZgAJBaqDgNUGAIAAAE4Ci4FBYIhgUuHPQKRdRLlqqSJyXzCwEsBLDlUwBAMPwCddSM BRreNIpS2CoAacMth+wvKAQAAGrGh1AqLGCaBS4c9KqsADiPA+YYApgCAAAw7dGjIAsswABAngNw TngIAABY4GCoEhYwYoGLHnqNIuolyQoA5xDAFIDNn0ABMPJ8kZcvC8gA4NwHQGwIAADw5XtoDSxQ xQL/fFgGALcc6diZjEMloHTTMgAAfNjWFmh400hKKyxRH78taDgAAGBrV0XjQ8EC/xw8gyJiEx0K gDMmyScEsBDAZswBCAW3FPYei50KgOsoYOWGW2LNCQAACOvGuDFRLHDx4BkU7gAAOQzALwSwEMAm hABEcb2QvA8GAGnSKgAm/zsn3IoJAQCAkHRx3LSdLHDx4NcpIjbBsQJA8QXC4ZwApgBs+mSSncyL tsICKgsU9xxJafVLHIqb2BAAAIDzwwKcW+CSIW9QeEy8/EJStJVHJeDwxmUAAM79Cc3zb4FGDACk OQAKpU1QJQAAgN4AC3BugUuGvkkRMfEeKwD4VAKYArARCgDnHoXm+bNAo56jKI2tApAGfbEhAACA vgALcG6BS4e+6VYAVMsA+YOAwxuWAQA49yc0T0sBGEXpqjkA4kIAAAC9ARbg3AKXDn2LImLiXPK/ ei8AviDgEFMAPsYcAM5dCs3zY4HGTAEobCqH3FwTAcWEAAAAugIswLkFLhv2FoVHx8kvJEdbeYUA FgLYAADg3KPQPH8WYAAgKQDKviZoOAAAgL4AC3BugX8Nf5vCo+u545EcQ8Ch9UsAAJz7E5rn3wJO AKgC3AJCQMgAQNi+9USLX4Xv28gCyhnvNmq2qU0NI6LLBj5P4VExDknSIUVyCgEH1mMZoKkOgMKC bgEGABkNFKcBCqwEhA4AEFHLvHjKio90fUkpCc8V73E+bNdDd/ufU3atep0iT5UjWt0bt8jXuYc1 1UlTrnqr/u6rnc7r/d6HYhT1lI/93oefyWa+7kO2oXOA8nEfqvY4drPz0sYqz0PrPvSUUY1nauSZ q+7fy30qf6/ydeGtbY5/S4oJp8YZsexwMu4h4Nj+v6li81LpEBVlR/MFc0ofdvYiVV5FBm9lqPOq 4ajK31y+qeyvivHFhw85Ay/e2urZh5zdW91WRV9QVOc9r/J9U9Ui3u63Shu8+JJyAalXO/p4QN5a 7tUOvvqf6n4d/V35b0rze2mDTztq5fX5LNV9SN0U+e1c2PYSyshI993XBFICQgYA2NNk7yRAgLMD eH8pqaACEOB4CeiwVYBgpwINLy8vO0FA7VphFBcZzlZRuZYuquFQOcj5t60RAFP7rnKQ9wKaGoCm HF+0no3W7/K9Vx38Au1r6g8AhR2V9+aCHh+/qwZgL3by8ruRZ+ntHj2BxXM/C1+/y/9u/rP0fNbM b4uSIymu7nnCQ0BIAQAgQP1NpOvlqvXi8jLwqV8Q/l9MPju1xotH+ZIw8gJWX1czA5Hq/jUGGiP3 AQjwvhGSkYFBCxJ0DW5eAM2ID6oHnKo+6PP36kImIMBjA62q76RQhYCQAwBAACAAECD3AvdXqedX lXLfc/abIq/8V4+T0ty/u792wwhKgLqvQQlw2MNHWAdKAOtbHn3N28ofqQ8q+6/Trm77yj3ax/kF LiUljEISAAABgABAACDA+e2tJaUjHOAbZHQpJg5DIxzgmBajAminbRUQHkQICFkAAAQAAgABgABA gOckZS8hCR8T6ryFPXzCEiBAsa2wp4pmHQSENAAAAgABgABAACAAEODpA6EyJyDkAQAQAAgABAAC AAGAgFCEAACA46ljiWDVbWaVA6My1if/WWNZE1YHuLTUQPd+0JphjtUBWB1QZfDSs/oEqwNCfnUA AMAd8sI+AV5mnAICPNayK/ylOrOWVZOm9LykXbFT/+u4AQGAAEAA9gkwujoAAKB4oSMcgHAAwgEI ByAcgHBAqIQDAAAeAAAIAAQAAgABgABAQChAAADACwAAAgABgABAACAAECA6BAAAfAAAIAAQAAgA BAACAAEiQwAAwA8AAAIAAYAAQAAgABAgKgQAADQAABAACAAEAAIAAYAAESEAAKADAAABgABAACAA EAAIEA0CAAA6AQAQAAgABAACAAGAAJEgAABgAAAAAYAAQAAgABAACBAFAgAABgEAEAAIAAQAAgAB gAARIAAAUA0AAAQAAgABgABAACDA7hAAAKgmAAACAAGAAEAAIAAQYGcIAAAEAACAAEAAIAAQAAgA BNgVAgAAAQIAIAAQAAgABAACAAF2hAAAgAkAAAgABAACAAGAAECA3SAAAGASAAACAAGAAEAAIAAQ YCcIAACYCACAAEAAIAAQAAgABNgFAgAAJgMAIAAQAAgABAACAAF2gAAAQA0AACAAEAAIAAQAAgAB vEMAAKCGAAAQAAgABAACAAGAAJ4hAABQgwAACAAEAAIAAYAAQACvEAAAqGEAAAQAAgABgABAACCA RwgAAAQBAAABgABAACAAEAAI4A0CAABBAgBAACAAEAAIAAQAAniCAABAEAEAEAAIAAQAAgABgABe IAAAEGQAAAQAAgABgABAACCABwgAAFgAAIAAQAAgABAACAAEWA0BAACLAAAQAAgABAACAAGAACsh AABgIQAAAgABgABAACAAEGAVBAAALAYAQAAgABAACAAEAAKsgAAAAAcAAAgABAACAAGAAEBAsCEA AMAJAAACAAGAAEAAIAAQEEwIAABwBACAAEAAIAAQAAgABAQLAgAAnAEAIAAQAAgABAACAAHBgAAA AIcAAAgABAACAAGAAEBATUMAAIBTAAAEAAIAAYAAQAAgoCYhAADAMQAAAgABgABAACAAEFBTEAAA 4BwAAAGAAEAAIAAQAAioCQgAANgAAAABgABAACAAEAAIMBsCAAA2AQBAACAAEAAIAAQAAsyEAACA jQAAEAAIAAQAAgABgACzIAAAYDMAAAQAAgABgABAACDADAgAANgQAAABgABAACAAEAAICBQCAAA2 BQBAACAAEAAIAAQAAgKBAACAjQEAEAAIAAQAAgABgIDqQgAAwOYAAAgABAACAAGAAEBAdSAAACAA AAACAAGAAEAAIAAQYBQCAACCAAAgABAACAAEAAIAAUYgAAAgEAAAAgABgABAACAAEKAXAgAAggEA IAAQAAgABAACAAFaEHBeGBEAQEAAAAQAAgABgABAACBACwIAAIICACAAEAAIAAQAAgAB/iAAACAw AAACAAGAAEAAIAAQ4AsCAACCAwAgABAACAAEAAIAAd4gAAAQAgAACAAEAAIAAYAAQICnDwAAQgQA AAGAAEAAIAAQAAhQ+gAAIIQAABAACAAEAAIAAYAApw8AAEIMAAABgABAACAAEAAIkHtB3w/PheAY GPK3HEZELfPiKSs+ks4pPEDpDOcUPzj/XZXXy+/S4KIqT/6L+jq3+c+RO7Mzj7frq5arKMNxga77 8HKv3u6zapsd96HwHF3tdNTn7T512UpVX1VbqQdz/7/L9SnyOMo28kx12SrAZ6qqw8vzSooJp8YZ scR8WGlDt4/6flbOsuUcYS57OJ+P2xaO38KcNlPkZRd7/nuY+3e3ncOodq0wiosMpzBXfu9t9vVs VPdnYn8z1B9ryAfV7xov/dlAXzOlL3q5TyPvFDPfnUb6WSDPEgAQwigACCDXUKWrwzlBw8CLST1A +RigtYCphl7Aanio+gJW/l7dgUh9naIOL5BgBGYAAW7f1QWSWj7m5XdvcFUFVLSAWuPjAhDgAEIv 7xRd7yRHP6ouBAAAQhgA5G8gKAGeX46+Bj7ly8/ni8vXwAYlQPW1Lts4MEUDEAAIcL6+DamHWn0x hJQAAECIAwAgQE3guqgbSoBjMK8aTvD1NQolAOEA12DtbYD1papVo68hHOB4p+lQdQAAAADJAlAC EA6ozjwPXcCEOQGOuQaAAECA8j2jCIlpzO8w0s+MhAMAAAAAlwUAAYAAQAAmBupScbx8xVe9zvkl qn9yKuYEBHdOAAAAAKCyACAAEAAIAAQAAhRf5wLPCQAAAACqWAAQAAgABAACAAHiQwAAAADg1QKA AEAAIAAQAAgQGwIAAAAAnxYABAACAAGAAECAuBAAAAAA+LUAIAAQAAgABAACxIQAAAAAQNMCgABA ACAAEAAIEA8CAACawx8yMAsAAgABgABAACBALAgAAGB8120BQAAgABAACAAEiAMBAADdwx8yQgmQ fQBnBzjsoNxq1MSdzJQDjK5tXR1dE6cIej8bwMxd5IzsMufzdDwcICS/R1xnEiiAIoindbKqAAAY 1w1bAEoAIABKAJQAKAH2VwIAAIaHP1wAJQBKgFoJ8f8Fo/6ixwFC0kdeGPsClP8g/TfMDRSyveTf atcKo7jIcPaz49/U6ovPr2zFa8p9Up5+22t96Wv9rusLF0qA5UoAAADjebUtACUASgCUACgBUALs qwQAAKo9/OFCKAFQAqAEyL3AGWc/55gh4v5Cdn7he3zxO2PAUAJcsXC1L+EAIbcS5PmeMU9xAwBg HA/YAlACoARACQAEQAmwnxIAAAh4+EMBUAKgBEAJgBLgfBNqrdzA6gD1+6LKl34QVwcAADB+m2YB KAFQAqAEQAmAEmAfJQAAYNrwh4KgBEAJgBIAJQBKgHuNv7I/KL/01SqJj5h+EJQAAADGbdMtACUA SgCUACgBUAL4VwIAAKYPfygQSgCUACgBUAKgBPCvBAAAMF7XmAWgBEAJgBIAJQBKAL9KAACgxoY/ FAwlAEoAlAAoAVAC+FUCAAAYp2vcAlACoARACYASACWAPyUAAFDjwx8qgBIAJQBKAJQAKAH8KQEA AIzPQbMAlAAoAVACoARACeBHCQAABG34Q0VQAqAEQAmAEgAlgB8lAACAcTnoFoASACUASgCUACgB 1isBAICgD3+oEEoAlAAoAVACoARYrwQAADAeW2YBKAFQAqAEQAmAEmCdEgAAsGz4Q8VQAqAEQAmA EgAlwDolAACAcdhyC0AJgBIAJQBKAJSA4CsBAADLhz80AEoAlAAoAVACoAQEXwkAAGD85cYCUAKg BEAJgBIAJSB4SgAAgJvhDw2BEgAlAEoAlAAoAcFTAgAAGHe5swCUACgBUAKgBEAJqHklAADA3fCH BkEJgBIAJQBKAJSAmlcC/h+Gzp+xCoK7iAAAAABJRU5ErkJggg== "
       style="image-rendering:optimizeQuality"
       preserveAspectRatio="none"
       height="157.16893"
       width="157.16893"
       mask="url(#mask866)"
       transform="matrix(1.3118249,0,0,1.3118249,253.49567,-132.46869)" />
    <g
       style="opacity:1;fill:none;fill-opacity:1;stroke:none;stroke-opacity:1;stroke-width:6.82732367;stroke-miterlimit:4;stroke-dasharray:none;stroke-linejoin:miter"
       transform="matrix(0.8934687,0,0,0.8934687,9.0613324,23.95257)"
       id="layer1-3"
       inkscape:label="Layer 1">
      <path
         inkscape:connector-curvature="0"
         id="path817"
         d="m 142.273,67.095733 c -62.207002,1.2e-4 -112.635696,38.184497 -112.635814,85.287287 1.08e-4,47.1028 50.428806,85.28714 112.635814,85.28726 23.51595,-0.0382 46.42639,-5.64855 65.5185,-16.04431 l 34.03053,7.52624 -11.10194,-24.115 c 15.6251,-15.00412 24.14349,-33.54659 24.1893,-52.65419 C 254.90927,105.28006 204.48023,67.095615 142.273,67.095733 Z"
         style="opacity:1;fill:none;fill-opacity:1;stroke:none;stroke-width:6.82732367;stroke-miterlimit:4;stroke-dasharray:none;stroke-opacity:1;stroke-linejoin:miter"
         sodipodi:nodetypes="sccccccs" />
    </g>
    <g
       inkscape:label="Layer 1"
       id="g2342"
       transform="matrix(0.8934687,0,0,0.8934687,9.1164483,24.028317)"
       style="opacity:1;fill:none;fill-opacity:1;stroke:#ffffff;stroke-width:5.59616694;stroke-linecap:square;stroke-miterlimit:4;stroke-dasharray:none;stroke-opacity:1">
      <path
         sodipodi:nodetypes="sccccccs"
         style="opacity:1;fill:none;fill-opacity:1;stroke:#ffffff;stroke-width:5.59616694;stroke-linecap:square;stroke-miterlimit:4;stroke-dasharray:none;stroke-opacity:1"
         d="m 142.273,67.095733 c -62.207002,1.2e-4 -112.635696,38.184497 -112.635814,85.287287 1.08e-4,47.1028 50.428806,85.28714 112.635814,85.28726 23.51595,-0.0382 46.42639,-5.64855 65.5185,-16.04431 l 34.03053,7.52624 -11.10194,-24.115 c 15.6251,-15.00412 24.14349,-33.54659 24.1893,-52.65419 C 254.90927,105.28006 204.48023,67.095615 142.273,67.095733 Z"
         id="path2340"
         inkscape:connector-curvature="0" />
    </g>
  </g>
  <g
     inkscape:groupmode="layer"
     id="layer3"
     inkscape:label="Layer 2"
     style="display:inline" />
</svg>
