[{
  "_id": {
    "$oid": "66718079bca77eb29be381fb"
  },
  "simulation_id": "97e4fa3e-a106-40fc-9d11-4d01e61e5d16",
  "simulation_name": "Costicartilaginous",
  "start_date": {
    "$date": "2021-12-31T09:00:00.000Z"
  },
  "end_date": {
    "$date": "2024-01-02T09:00:00.000Z"
  },
  "current_date": {
    "$date": "2024-01-02T09:00:00.000Z"
  },
  "tickers_list": [
    "AAPL",
    "BA",
    "WMT",
    "NKE",
    "JPM"
  ],
  "timestamp": {
    "$date": "2024-06-18T12:41:29.676Z"
  },
  "is_running": true,
  "trader_list": [
    "Trader1",
    "Trader2",
    "Trader3"
  ],
  "cost_percentage": 0.001,
  "initial_cash_amount": 100000,
  "current_component_agent": "Trader3",
  "current_component_name": "Insert Trader Recommendation",
  "current_component_ticker": "JPM"
}]