%YAML 1.1
%TAG !u! tag:unity3d.com,2011:
--- !u!78 &1
TagManager:
  serializedVersion: 2
  tags:
  - Bomb
  - Cube
  - DCube
  - RedEnemy
  - VioletEnemy
  - YellowEnemy
  - Floor
  - Door
  - LivePowerup
  - BombPowerup
  - ExplosionPowerup
  layers:
  - Default
  - TransparentFX
  - Ignore Raycast
  - 
  - Water
  - UI
  - 
  - 
  - RedEnemy
  - VioletEnemy
  - YellowEnemy
  - Cube
  - DCube
  - Bomb
  - Player
  - Door
  - LivePowerup
  - BombPowerup
  - ExplosionPowerup
  - 
  - 
  - 
  - 
  - 
  - 
  - 
  - 
  - 
  - 
  - 
  - 
  - 
  m_SortingLayers:
  - name: Default
    uniqueID: 0
    locked: 0
