%YAML 1.1
%TAG !u! tag:unity3d.com,2011:
--- !u!114 &11400000
MonoBehaviour:
  m_ObjectHideFlags: 0
  m_CorrespondingSourceObject: {fileID: 0}
  m_PrefabInstance: {fileID: 0}
  m_PrefabAsset: {fileID: 0}
  m_GameObject: {fileID: 0}
  m_Enabled: 1
  m_EditorHideFlags: 0
  m_Script: {fileID: 11500000, guid: d4baea48034e6e74ba2940e260bc319c, type: 3}
  m_Name: Armor Helmet_02
  m_EditorClassIdentifier: 
  icon: {fileID: 21300000, guid: 69a1b97f613da45499bbfc832350f7b1, type: 3}
  model: {fileID: 919132149155446097, guid: d70424565b22c7440a4be02c478c649e, type: 3}
  itemName: Epic Helmet 2
  weight: 5
  durability: 100
  level: 60
  typeItem: 1
  defenseValue: 120
  subTypeItem: 0
