%YAML 1.1
%TAG !u! tag:unity3d.com,2011:
--- !u!114 &11400000
MonoBehaviour:
  m_ObjectHideFlags: 0
  m_CorrespondingSourceObject: {fileID: 0}
  m_PrefabInstance: {fileID: 0}
  m_PrefabAsset: {fileID: 0}
  m_GameObject: {fileID: 0}
  m_Enabled: 1
  m_EditorHideFlags: 0
  m_Script: {fileID: 11500000, guid: 52132f4158d8dc4448a6f5c8b4ce0d09, type: 3}
  m_Name: Waepon Sword_02
  m_EditorClassIdentifier: 
  icon: {fileID: 21300000, guid: 1f7509e5f790ff446a4afef3cf40e11b, type: 3}
  model: {fileID: 919132149155446097, guid: 87eac92aba5311a42a0bc7dcf050f57f, type: 3}
  itemName: Sword 2
  weight: 20
  durability: 100
  level: 70
  typeItem: 0
  damage: 100
  subTypeItem: 2
