%YAML 1.1
%TAG !u! tag:unity3d.com,2011:
--- !u!114 &11400000
MonoBehaviour:
  m_ObjectHideFlags: 0
  m_CorrespondingSourceObject: {fileID: 0}
  m_PrefabInstance: {fileID: 0}
  m_PrefabAsset: {fileID: 0}
  m_GameObject: {fileID: 0}
  m_Enabled: 1
  m_EditorHideFlags: 0
  m_Script: {fileID: 11500000, guid: d4baea48034e6e74ba2940e260bc319c, type: 3}
  m_Name: Armor Chest_01
  m_EditorClassIdentifier: 
  icon: {fileID: 21300000, guid: 8555877c31c8b18498d92c95045879f4, type: 3}
  model: {fileID: 919132149155446097, guid: 1f0855ac7e4088d47834bc31d7b074f1, type: 3}
  itemName: Epic Chest
  weight: 10
  durability: 100
  level: 55
  typeItem: 1
  defenseValue: 80
  subTypeItem: 1
