%YAML 1.1
%TAG !u! tag:unity3d.com,2011:
--- !u!1045 &1
EditorBuildSettings:
  m_ObjectHideFlags: 0
  serializedVersion: 2
  m_Scenes:
  - enabled: 1
    path: Assets/Scenes/TP2 Solar System.unity
    guid: 94a156464b5ac5f44a481c0811558f2f
  m_configObjects: {}
