%YAML 1.1
%TAG !u! tag:unity3d.com,2011:
--- !u!1045 &1
EditorBuildSettings:
  m_ObjectHideFlags: 0
  serializedVersion: 2
  m_Scenes:
  - enabled: 1
    path: Assets/Scenes/MainMenu.unity
    guid: 4eeb6ea95f9e0e145ae1454806a6bb89
  - enabled: 1
    path: Assets/Scenes/Game.unity
    guid: 58a724ebb173cb34fbb1d97ff63f0df9
  - enabled: 1
    path: Assets/Scenes/Ranking.unity
    guid: f0689bba11192044b815c459df8b89f0
  - enabled: 1
    path: Assets/Scenes/Credits.unity
    guid: 012c16a78854dfd408a34fa28953083b
  m_configObjects: {}
