# -*- coding: utf-8 mode: shell-script -*-

UnitsOutput = ev_angstrom

CalculationMode = gs
fromScratch = yes

BoxShape = minimum
Radius  = 4.0*angstrom
Spacing = 0.4*angstrom

PseudopotentialSet = hgh_lda

%Coordinates
  "Xe" | -1.5*angstrom | 0 | 0
  "Xe" |  1.5*angstrom | 0 | 0
%
ExcessCharge = 1

SpinComponents = non_collinear
RelativisticCorrection = spin_orbit

GuessMagnetDensity = user_defined
%AtomsMagnetDirection
 0.0 | 0.0 | 1.0
 0.0 | 0.0 | 1.0
%

ConvRelDens = 1e-7
PoissonSolver = fft
FFTLibrary = fftw

Eigensolver = chebyshev_filter
ExtraStates = 3
