/home/martin/Dropbox/Java/Proyectos/IntelliJ/MiauApps/MiauPoemas/PoemasModel/src/main/java/org/miaupoemas/model/PresentType.java
/home/martin/Dropbox/Java/Proyectos/IntelliJ/MiauApps/MiauPoemas/PoemasModel/src/main/java/org/miaupoemas/model/ViewPresentMenu.java
/home/martin/Dropbox/Java/Proyectos/IntelliJ/MiauApps/MiauPoemas/PoemasModel/src/main/java/org/miaupoemas/model/Present.java
/home/martin/Dropbox/Java/Proyectos/IntelliJ/MiauApps/MiauPoemas/PoemasModel/src/main/java/org/miaupoemas/model/tools/BytesParser.java
/home/martin/Dropbox/Java/Proyectos/IntelliJ/MiauApps/MiauPoemas/PoemasModel/src/main/java/org/miaupoemas/model/Poem.java
/home/martin/Dropbox/Java/Proyectos/IntelliJ/MiauApps/MiauPoemas/PoemasModel/src/main/java/org/miaupoemas/model/App.java
