{
  "annotations": {
    "list": [
      {
        "builtIn": 1,
        "datasource": {
          "type": "grafana",
          "uid": "-- Grafana --"
        },
        "enable": true,
        "hide": true,
        "iconColor": "rgba(0, 211, 255, 1)",
        "name": "Annotations & Alerts",
        "type": "dashboard"
      }
    ]
  },
  "description": "",
  "editable": true,
  "fiscalYearStartMonth": 0,
  "graphTooltip": 0,
  "id": null,
  "links": [

  ],
  "liveNow": false,
  "panels": [
    {
      "datasource": {
        "type": "loki",
        "uid": "c24fe71a-946f-4290-a110-c610afbd3aca"
      },
      "fieldConfig": {
        "defaults": {
          "color": {
            "mode": "palette-classic"
          },
          "custom": {
            "axisCenteredZero": false,
            "axisColorMode": "text",
            "axisLabel": "",
            "axisPlacement": "auto",
            "barAlignment": 0,
            "drawStyle": "line",
            "fillOpacity": 0,
            "gradientMode": "none",
            "hideFrom": {
              "legend": false,
              "tooltip": false,
              "viz": false
            },
            "lineInterpolation": "linear",
            "lineWidth": 1,
            "pointSize": 5,
            "scaleDistribution": {
              "type": "linear"
            },
            "showPoints": "auto",
            "spanNulls": false,
            "stacking": {
              "group": "A",
              "mode": "none"
            },
            "thresholdsStyle": {
              "mode": "off"
            }
          },
          "links": [
            {
              "targetBlank": false,
              "title": "filter",
              "url": "https://dashboards.gitlab.net/d/a712e140-1d47-47ba-bd92-758d532f6f33/loki-trial-who-did-that?orgId=1&var-app=webservice&var-action=destroy&var-env=gprd&from=1694001600000&to=1694005199000&var-ProjectPath=gitlab&var-Action=delete&var-method=DELETE&var-clutser=gprd-us-east1-d&var-controller=${__data.fields.controller}"
            }
          ],
          "mappings": [

          ],
          "thresholds": {
            "mode": "absolute",
            "steps": [
              {
                "color": "green",
                "value": null
              },
              {
                "color": "red",
                "value": 80
              }
            ]
          }
        },
        "overrides": [

        ]
      },
      "gridPos": {
        "h": 12,
        "w": 24,
        "x": 0,
        "y": 0
      },
      "id": 2,
      "options": {
        "legend": {
          "calcs": [
            "sum"
          ],
          "displayMode": "table",
          "placement": "bottom",
          "showLegend": true
        },
        "tooltip": {
          "mode": "single",
          "sort": "none"
        }
      },
      "targets": [
        {
          "datasource": {
            "type": "loki",
            "uid": "c24fe71a-946f-4290-a110-c610afbd3aca"
          },
          "editorMode": "code",
          "expr": "sum by (controller) (count_over_time( { env=\"$env\"} | json | __error__!=\"JSONParserErr\" | subcomponent =~ \"production_json\" | method =~ \"$method\" | path =~ \".*$ProjectPath.*\" [5m]))",
          "queryType": "range",
          "refId": "A"
        }
      ],
      "title": "Count of requests",
      "transformations": [

      ],
      "type": "timeseries"
    },
    {
      "collapsed": false,
      "gridPos": {
        "h": 1,
        "w": 24,
        "x": 0,
        "y": 12
      },
      "id": 3,
      "panels": [

      ],
      "title": "Raw logs",
      "type": "row"
    },
    {
      "datasource": {
        "type": "loki",
        "uid": "c24fe71a-946f-4290-a110-c610afbd3aca"
      },
      "fieldConfig": {
        "defaults": {
          "color": {
            "mode": "thresholds"
          },
          "custom": {
            "align": "auto",
            "cellOptions": {
              "type": "auto"
            },
            "inspect": false
          },
          "mappings": [

          ],
          "thresholds": {
            "mode": "absolute",
            "steps": [
              {
                "color": "green",
                "value": null
              },
              {
                "color": "red",
                "value": 80
              }
            ]
          }
        },
        "overrides": [

        ]
      },
      "gridPos": {
        "h": 19,
        "w": 24,
        "x": 0,
        "y": 13
      },
      "id": 1,
      "options": {
        "cellHeight": "sm",
        "footer": {
          "countRows": false,
          "fields": "",
          "reducer": [
            "sum"
          ],
          "show": false
        },
        "showHeader": true
      },
      "pluginVersion": "9.5.1",
      "targets": [
        {
          "datasource": {
            "type": "loki",
            "uid": "c24fe71a-946f-4290-a110-c610afbd3aca"
          },
          "editorMode": "code",
          "expr": "{ env=\"$env\", app=\"$app\" } | json | __error__!=\"JSONParserErr\" | subcomponent =~ \"production_json\" | method =~ \"$method\" | path =~ \".*$ProjectPath.*\" | controller =~ \"$controller\"",
          "queryType": "range",
          "refId": "A"
        }
      ],
      "title": "Panel Title",
      "transformations": [
        {
          "id": "extractFields",
          "options": {
            "format": "json",
            "jsonPaths": [
              {
                "path": "path"
              },
              {
                "path": "username"
              },
              {
                "path": "method"
              },
              {
                "path": "controller"
              },
              {
                "path": "ua"
              },
              {
                "path": "remote_ip"
              },
              {
                "path": "subcomponent"
              }
            ],
            "keepTime": true,
            "replace": true,
            "source": "Line"
          }
        }
      ],
      "type": "table"
    }
  ],
  "refresh": "",
  "schemaVersion": 38,
  "style": "dark",
  "tags": [
    "unmanaged",
    "protected"
  ],
  "templating": {
    "list": [
      {
        "current": {
          "selected": false,
          "text": "gitlab-pages",
          "value": "gitlab-pages"
        },
        "datasource": {
          "type": "loki",
          "uid": "c24fe71a-946f-4290-a110-c610afbd3aca"
        },
        "definition": "",
        "hide": 0,
        "includeAll": false,
        "multi": false,
        "name": "app",
        "options": [

        ],
        "query": {
          "label": "app",
          "refId": "LokiVariableQueryEditor-VariableQuery",
          "stream": "",
          "type": 1
        },
        "refresh": 1,
        "regex": "",
        "skipUrlSync": false,
        "sort": 1,
        "type": "query"
      },
      {
        "current": {
          "selected": true,
          "text": "gprd",
          "value": "gprd"
        },
        "datasource": {
          "type": "prometheus",
          "uid": "PA258B30F88C30650"
        },
        "definition": "label_values(env)",
        "hide": 0,
        "includeAll": false,
        "multi": false,
        "name": "env",
        "options": [

        ],
        "query": {
          "query": "label_values(env)",
          "refId": "PrometheusVariableQueryEditor-VariableQuery"
        },
        "refresh": 1,
        "regex": "",
        "skipUrlSync": false,
        "sort": 0,
        "type": "query"
      },
      {
        "current": {
          "selected": false,
          "text": "",
          "value": ""
        },
        "hide": 0,
        "name": "ProjectPath",
        "options": [
          {
            "selected": false,
            "text": "",
            "value": ""
          }
        ],
        "query": "",
        "skipUrlSync": false,
        "type": "textbox"
      },
      {
        "current": {
          "selected": false,
          "text": "delete",
          "value": "delete"
        },
        "hide": 0,
        "name": "method",
        "options": [
          {
            "selected": false,
            "text": "delete",
            "value": "delete"
          }
        ],
        "query": "delete",
        "skipUrlSync": false,
        "type": "textbox"
      },
      {
        "current": {
          "selected": false,
          "text": "gprd-us-east1-d",
          "value": "gprd-us-east1-d"
        },
        "datasource": {
          "type": "loki",
          "uid": "c24fe71a-946f-4290-a110-c610afbd3aca"
        },
        "definition": "",
        "hide": 0,
        "includeAll": false,
        "multi": false,
        "name": "clutser",
        "options": [

        ],
        "query": {
          "label": "cluster",
          "refId": "LokiVariableQueryEditor-VariableQuery",
          "stream": "",
          "type": 1
        },
        "refresh": 1,
        "regex": "",
        "skipUrlSync": false,
        "sort": 0,
        "type": "query"
      },
      {
        "current": {
          "selected": false,
          "text": ".*",
          "value": ".*"
        },
        "hide": 0,
        "name": "controller",
        "options": [
          {
            "selected": true,
            "text": ".*",
            "value": ".*"
          }
        ],
        "query": ".*",
        "skipUrlSync": false,
        "type": "textbox"
      }
    ]
  },
  "time": {
    "from": "2023-09-06T12:00:00.000Z",
    "to": "2023-09-06T12:59:59.000Z"
  },
  "timepicker": {
  },
  "timezone": "",
  "title": "Loki Trial who did that",
  "uid": "a712e140-1d47-47ba-bd92-758d532f6f33",
  "version": 10,
  "weekStart": ""
}