{
  "annotations": {
    "list": [
      {
        "builtIn": 1,
        "datasource": {
          "type": "grafana",
          "uid": "-- Grafana --"
        },
        "enable": true,
        "hide": true,
        "iconColor": "rgba(0, 211, 255, 1)",
        "name": "Annotations & Alerts",
        "type": "dashboard"
      }
    ]
  },
  "editable": true,
  "fiscalYearStartMonth": 0,
  "graphTooltip": 1,
  "id": null,
  "links": [
    {
      "asDropdown": true,
      "icon": "external link",
      "includeVars": true,
      "keepTime": true,
      "tags": [
        "mimir"
      ],
      "targetBlank": false,
      "title": "Mimir dashboards",
      "type": "dashboards"
    }
  ],
  "liveNow": false,
  "panels": [
    {
      "collapsed": false,
      "datasource": {
        "type": "prometheus",
        "uid": "PA258B30F88C30650"
      },
      "gridPos": {
        "h": 1,
        "w": 24,
        "x": 0,
        "y": 0
      },
      "id": 20,
      "panels": [

      ],
      "targets": [
        {
          "datasource": {
            "type": "prometheus",
            "uid": "PA258B30F88C30650"
          },
          "refId": "A"
        }
      ],
      "title": "Mimir cluster health",
      "type": "row"
    },
    {
      "datasource": {
        "type": "prometheus",
        "uid": "PA258B30F88C30650"
      },
      "description": "",
      "gridPos": {
        "h": 7,
        "w": 6,
        "x": 0,
        "y": 1
      },
      "id": 1,
      "options": {
        "code": {
          "language": "plaintext",
          "showLineNumbers": false,
          "showMiniMap": false
        },
        "content": "The 'Status' panel shows an overview on the cluster health over the time.\nTo investigate failures, see a specific dashboard:\n\n- <a target=\"_blank\" href=\"./d/8280707b8f16e7b87b840fc1cc92d4c5/mimir-writes?${__url_time_range}&${__all_variables}\">Writes</a>\n- <a target=\"_blank\" href=\"./d/e327503188913dc38ad571c647eef643/mimir-reads?${__url_time_range}&${__all_variables}\">Reads</a>\n- <a target=\"_blank\" href=\"./d/631e15d5d85afb2ca8e35d62984eeaa0/mimir-ruler?${__url_time_range}&${__all_variables}\">Rule evaluations</a>\n- <a target=\"_blank\" href=\"./d/b0d38d318bbddd80476246d4930f9e55/mimir-alertmanager?${__url_time_range}&${__all_variables}\">Alerting notifications</a>\n- <a target=\"_blank\" href=\"./d/e1324ee2a434f4158c00a9ee279d3292/mimir-object-store?${__url_time_range}&${__all_variables}\">Object storage</a>\n",
        "mode": "markdown"
      },
      "pluginVersion": "10.1.5",
      "targets": [
        {
          "datasource": {
            "type": "prometheus",
            "uid": "PA258B30F88C30650"
          },
          "refId": "A"
        }
      ],
      "transparent": true,
      "type": "text"
    },
    {
      "datasource": {
        "uid": "$datasource"
      },
      "fieldConfig": {
        "defaults": {
          "color": {
            "mode": "thresholds"
          },
          "custom": {
            "fillOpacity": 70,
            "hideFrom": {
              "legend": false,
              "tooltip": false,
              "viz": false
            },
            "insertNulls": false,
            "lineWidth": 0,
            "spanNulls": false
          },
          "mappings": [

          ],
          "thresholds": {
            "mode": "absolute",
            "steps": [
              {
                "color": "#7EB26D",
                "value": null
              },
              {
                "color": "#EAB839",
                "value": 0.01
              },
              {
                "color": "#E24D42",
                "value": 0.05
              }
            ]
          }
        },
        "overrides": [

        ]
      },
      "gridPos": {
        "h": 7,
        "w": 12,
        "x": 6,
        "y": 1
      },
      "id": 2,
      "options": {
        "alignValue": "left",
        "legend": {
          "displayMode": "list",
          "placement": "bottom",
          "showLegend": true
        },
        "mergeValues": true,
        "rowHeight": 0.9,
        "showValue": "never",
        "tooltip": {
          "mode": "single",
          "sort": "none"
        }
      },
      "targets": [
        {
          "datasource": {
            "uid": "$datasource"
          },
          "exemplar": false,
          "expr": "(\n    # gRPC errors are not tracked as 5xx but \"error\".\n    sum(rate(cortex_request_duration_seconds_count{cluster=~\"$cluster\", job=~\"($namespace)/((distributor|cortex|mimir|mimir-write.*))\", route=~\"/distributor.Distributor/Push|/httpgrpc.*|api_(v1|prom)_push|otlp_v1_metrics\",status_code=~\"5.*|error\"}[$__rate_interval]))\n    or\n    # Handle the case no failure has been tracked yet.\n    vector(0)\n)\n/\nsum(rate(cortex_request_duration_seconds_count{cluster=~\"$cluster\", job=~\"($namespace)/((distributor|cortex|mimir|mimir-write.*))\", route=~\"/distributor.Distributor/Push|/httpgrpc.*|api_(v1|prom)_push|otlp_v1_metrics\"}[$__rate_interval]))\n",
          "instant": false,
          "legendFormat": "Writes",
          "range": true,
          "refId": "A"
        },
        {
          "datasource": {
            "uid": "$datasource"
          },
          "exemplar": false,
          "expr": "(\n    sum(rate(cortex_request_duration_seconds_count{cluster=~\"$cluster\", job=~\"($namespace)/((query-frontend.*|cortex|mimir|mimir-read.*))\", route=~\"(prometheus|api_prom)_api_v1_.+\",status_code=~\"5.*\"}[$__rate_interval]))\n    or\n    # Handle the case no failure has been tracked yet.\n    vector(0)\n)\n/\nsum(rate(cortex_request_duration_seconds_count{cluster=~\"$cluster\", job=~\"($namespace)/((query-frontend.*|cortex|mimir|mimir-read.*))\", route=~\"(prometheus|api_prom)_api_v1_.+\"}[$__rate_interval]))\n",
          "instant": false,
          "legendFormat": "Reads",
          "range": true,
          "refId": "B"
        },
        {
          "datasource": {
            "uid": "$datasource"
          },
          "exemplar": false,
          "expr": "(\n  (\n      sum(rate(cortex_prometheus_rule_evaluation_failures_total{cluster=~\"$cluster\", job=~\"($namespace)/((ruler|cortex|mimir|mimir-backend.*))\"}[$__rate_interval]))\n      +\n      # Consider missed evaluations as failures.\n      sum(rate(cortex_prometheus_rule_group_iterations_missed_total{cluster=~\"$cluster\", job=~\"($namespace)/((ruler|cortex|mimir|mimir-backend.*))\"}[$__rate_interval]))\n  )\n  or\n  # Handle the case no failure has been tracked yet.\n  vector(0)\n)\n/\nsum(rate(cortex_prometheus_rule_evaluations_total{cluster=~\"$cluster\", job=~\"($namespace)/((ruler|cortex|mimir|mimir-backend.*))\"}[$__rate_interval]))\n",
          "instant": false,
          "legendFormat": "Rule evaluations",
          "range": true,
          "refId": "C"
        },
        {
          "datasource": {
            "uid": "$datasource"
          },
          "exemplar": false,
          "expr": "(\n  # Failed notifications from ruler to Alertmanager (handling the case the ruler metrics are missing).\n  ((sum(rate(cortex_prometheus_notifications_errors_total{cluster=~\"$cluster\", job=~\"($namespace)/((ruler|cortex|mimir|mimir-backend.*))\"}[$__rate_interval]))\n) or vector(0))\n  +\n  # Failed notifications from Alertmanager to receivers (handling the case the alertmanager metrics are missing).\n  ((sum(cluster_job_integration:cortex_alertmanager_notifications_failed_total:rate5m{cluster=~\"$cluster\", job=~\"($namespace)/((alertmanager|cortex|mimir|mimir-backend.*))\"})\n) or vector(0))\n)\n/\n(\n  # Total notifications from ruler to Alertmanager (handling the case the ruler metrics are missing).\n  ((sum(rate(cortex_prometheus_notifications_sent_total{cluster=~\"$cluster\", job=~\"($namespace)/((ruler|cortex|mimir|mimir-backend.*))\"}[$__rate_interval]))\n) or vector(0))\n  +\n  # Total notifications from Alertmanager to receivers (handling the case the alertmanager metrics are missing).\n  ((sum(cluster_job_integration:cortex_alertmanager_notifications_total:rate5m{cluster=~\"$cluster\", job=~\"($namespace)/((alertmanager|cortex|mimir|mimir-backend.*))\"})\n) or vector(0))\n)\n",
          "instant": false,
          "legendFormat": "Alerting notifications",
          "range": true,
          "refId": "D"
        },
        {
          "datasource": {
            "uid": "$datasource"
          },
          "exemplar": false,
          "expr": "sum(rate(thanos_objstore_bucket_operation_failures_total{cluster=~\"$cluster\", namespace=~\"$namespace\"}[$__rate_interval]))\n/\nsum(rate(thanos_objstore_bucket_operations_total{cluster=~\"$cluster\", namespace=~\"$namespace\"}[$__rate_interval]))\n",
          "instant": false,
          "legendFormat": "Object storage",
          "range": true,
          "refId": "E"
        }
      ],
      "title": "Status",
      "type": "state-timeline"
    },
    {
      "datasource": {
        "type": "prometheus",
        "uid": "PA258B30F88C30650"
      },
      "gridPos": {
        "h": 7,
        "w": 6,
        "x": 18,
        "y": 1
      },
      "id": 3,
      "options": {
        "alertName": "Mimir",
        "dashboardAlerts": false,
        "dashboardTitle": "",
        "maxItems": 100,
        "showOptions": "current",
        "sortOrder": 3,
        "stateFilter": {
          "alerting": false,
          "error": true,
          "execution_error": false,
          "firing": true,
          "noData": false,
          "no_data": false,
          "normal": false,
          "ok": false,
          "paused": false,
          "pending": false
        },
        "tags": [

        ]
      },
      "pluginVersion": "10.1.5",
      "targets": [
        {
          "datasource": {
            "type": "prometheus",
            "uid": "PA258B30F88C30650"
          },
          "refId": "A"
        }
      ],
      "title": "Firing alerts",
      "type": "alertlist"
    },
    {
      "collapsed": false,
      "datasource": {
        "type": "prometheus",
        "uid": "PA258B30F88C30650"
      },
      "gridPos": {
        "h": 1,
        "w": 24,
        "x": 0,
        "y": 8
      },
      "id": 21,
      "panels": [

      ],
      "targets": [
        {
          "datasource": {
            "type": "prometheus",
            "uid": "PA258B30F88C30650"
          },
          "refId": "A"
        }
      ],
      "title": "Writes",
      "type": "row"
    },
    {
      "datasource": {
        "type": "prometheus",
        "uid": "PA258B30F88C30650"
      },
      "description": "",
      "gridPos": {
        "h": 7,
        "w": 6,
        "x": 0,
        "y": 9
      },
      "id": 4,
      "options": {
        "code": {
          "language": "plaintext",
          "showLineNumbers": false,
          "showMiniMap": false
        },
        "content": "These panels show an overview on the write path. \nTo examine the write path in detail, see a specific dashboard:\n\n- <a target=\"_blank\" href=\"./d/8280707b8f16e7b87b840fc1cc92d4c5/mimir-writes?${__url_time_range}&${__all_variables}\">Writes</a>\n- <a target=\"_blank\" href=\"./d/bc9160e50b52e89e0e49c840fea3d379/mimir-writes-resources?${__url_time_range}&${__all_variables}\">Writes resources</a>\n- <a target=\"_blank\" href=\"./d/978c1cb452585c96697a238eaac7fe2d/mimir-writes-networking?${__url_time_range}&${__all_variables}\">Writes networking</a>\n- <a target=\"_blank\" href=\"./d/a9b92d3c4d1af325d872a9e9a7083d71/mimir-overview-resources?${__url_time_range}&${__all_variables}\">Overview resources</a>\n- <a target=\"_blank\" href=\"./d/e15c71d372cc541367a088f10d9fcd92/mimir-overview-networking?${__url_time_range}&${__all_variables}\">Overview networking</a>\n",
        "mode": "markdown"
      },
      "pluginVersion": "10.1.5",
      "targets": [
        {
          "datasource": {
            "type": "prometheus",
            "uid": "PA258B30F88C30650"
          },
          "refId": "A"
        }
      ],
      "transparent": true,
      "type": "text"
    },
    {
      "aliasColors": {
        "1xx": "#EAB839",
        "2xx": "#7EB26D",
        "3xx": "#6ED0E0",
        "4xx": "#EF843C",
        "5xx": "#E24D42",
        "cancel": "#A9A9A9",
        "error": "#E24D42",
        "success": "#7EB26D"
      },
      "bars": false,
      "dashLength": 10,
      "dashes": false,
      "datasource": {
        "uid": "$datasource"
      },
      "fill": 10,
      "fillGradient": 0,
      "gridPos": {
        "h": 7,
        "w": 6,
        "x": 6,
        "y": 9
      },
      "hiddenSeries": false,
      "id": 5,
      "legend": {
        "avg": false,
        "current": false,
        "max": false,
        "min": false,
        "show": true,
        "total": false,
        "values": false
      },
      "lines": true,
      "linewidth": 0,
      "links": [

      ],
      "nullPointMode": "null as zero",
      "options": {
        "alertThreshold": true
      },
      "percentage": false,
      "pluginVersion": "10.1.5",
      "pointradius": 5,
      "points": false,
      "renderer": "flot",
      "seriesOverrides": [

      ],
      "spaceLength": 10,
      "stack": true,
      "steppedLine": false,
      "targets": [
        {
          "datasource": {
            "uid": "$datasource"
          },
          "expr": "sum by (status) (\n  label_replace(label_replace(rate(cortex_request_duration_seconds_count{cluster=~\"$cluster\", job=~\"($namespace)/((distributor|cortex|mimir|mimir-write.*))\", route=~\"/distributor.Distributor/Push|/httpgrpc.*|api_(v1|prom)_push|otlp_v1_metrics\"}[$__rate_interval]),\n  \"status\", \"${1}xx\", \"status_code\", \"([0-9])..\"),\n  \"status\", \"${1}\", \"status_code\", \"([a-z]+)\"))\n",
          "format": "time_series",
          "intervalFactor": 2,
          "legendFormat": "{{status}}",
          "refId": "A"
        }
      ],
      "thresholds": [

      ],
      "timeRegions": [

      ],
      "title": "Write requests / sec",
      "tooltip": {
        "shared": false,
        "sort": 0,
        "value_type": "individual"
      },
      "type": "graph",
      "xaxis": {
        "mode": "time",
        "show": true,
        "values": [

        ]
      },
      "yaxes": [
        {
          "format": "reqps",
          "logBase": 1,
          "min": 0,
          "show": true
        },
        {
          "format": "short",
          "logBase": 1,
          "show": false
        }
      ],
      "yaxis": {
        "align": false
      }
    },
    {
      "aliasColors": {
      },
      "bars": false,
      "dashLength": 10,
      "dashes": false,
      "datasource": {
        "uid": "$datasource"
      },
      "fill": 1,
      "fillGradient": 0,
      "gridPos": {
        "h": 7,
        "w": 6,
        "x": 12,
        "y": 9
      },
      "hiddenSeries": false,
      "id": 6,
      "legend": {
        "avg": false,
        "current": false,
        "max": false,
        "min": false,
        "show": true,
        "total": false,
        "values": false
      },
      "lines": true,
      "linewidth": 1,
      "links": [

      ],
      "nullPointMode": "null as zero",
      "options": {
        "alertThreshold": true
      },
      "percentage": false,
      "pluginVersion": "10.1.5",
      "pointradius": 5,
      "points": false,
      "renderer": "flot",
      "seriesOverrides": [

      ],
      "spaceLength": 10,
      "stack": false,
      "steppedLine": false,
      "targets": [
        {
          "datasource": {
            "uid": "$datasource"
          },
          "expr": "histogram_quantile(0.99, sum by (le) (cluster_job_route:cortex_request_duration_seconds_bucket:sum_rate{cluster=~\"$cluster\", job=~\"($namespace)/((distributor|cortex|mimir|mimir-write.*))\", route=~\"/distributor.Distributor/Push|/httpgrpc.*|api_(v1|prom)_push|otlp_v1_metrics\"})) * 1e3",
          "format": "time_series",
          "intervalFactor": 2,
          "legendFormat": "99th percentile",
          "refId": "A",
          "step": 10
        },
        {
          "datasource": {
            "uid": "$datasource"
          },
          "expr": "histogram_quantile(0.50, sum by (le) (cluster_job_route:cortex_request_duration_seconds_bucket:sum_rate{cluster=~\"$cluster\", job=~\"($namespace)/((distributor|cortex|mimir|mimir-write.*))\", route=~\"/distributor.Distributor/Push|/httpgrpc.*|api_(v1|prom)_push|otlp_v1_metrics\"})) * 1e3",
          "format": "time_series",
          "intervalFactor": 2,
          "legendFormat": "50th percentile",
          "refId": "B",
          "step": 10
        },
        {
          "datasource": {
            "uid": "$datasource"
          },
          "expr": "1e3 * sum(cluster_job_route:cortex_request_duration_seconds_sum:sum_rate{cluster=~\"$cluster\", job=~\"($namespace)/((distributor|cortex|mimir|mimir-write.*))\", route=~\"/distributor.Distributor/Push|/httpgrpc.*|api_(v1|prom)_push|otlp_v1_metrics\"}) / sum(cluster_job_route:cortex_request_duration_seconds_count:sum_rate{cluster=~\"$cluster\", job=~\"($namespace)/((distributor|cortex|mimir|mimir-write.*))\", route=~\"/distributor.Distributor/Push|/httpgrpc.*|api_(v1|prom)_push|otlp_v1_metrics\"})",
          "format": "time_series",
          "intervalFactor": 2,
          "legendFormat": "Average",
          "refId": "C",
          "step": 10
        }
      ],
      "thresholds": [

      ],
      "timeRegions": [

      ],
      "title": "Write latency",
      "tooltip": {
        "shared": false,
        "sort": 0,
        "value_type": "individual"
      },
      "type": "graph",
      "xaxis": {
        "mode": "time",
        "show": true,
        "values": [

        ]
      },
      "yaxes": [
        {
          "format": "ms",
          "logBase": 1,
          "min": 0,
          "show": true
        },
        {
          "format": "short",
          "logBase": 1,
          "show": false
        }
      ],
      "yaxis": {
        "align": false
      }
    },
    {
      "aliasColors": {
      },
      "bars": false,
      "dashLength": 10,
      "dashes": false,
      "datasource": {
        "uid": "$datasource"
      },
      "fill": 10,
      "fillGradient": 0,
      "gridPos": {
        "h": 7,
        "w": 6,
        "x": 18,
        "y": 9
      },
      "hiddenSeries": false,
      "id": 7,
      "legend": {
        "avg": false,
        "current": false,
        "max": false,
        "min": false,
        "show": true,
        "total": false,
        "values": false
      },
      "lines": true,
      "linewidth": 0,
      "links": [

      ],
      "nullPointMode": "null as zero",
      "options": {
        "alertThreshold": true
      },
      "percentage": false,
      "pluginVersion": "10.1.5",
      "pointradius": 5,
      "points": false,
      "renderer": "flot",
      "seriesOverrides": [

      ],
      "spaceLength": 10,
      "stack": true,
      "steppedLine": false,
      "targets": [
        {
          "datasource": {
            "uid": "$datasource"
          },
          "expr": "sum(cluster_namespace_job:cortex_distributor_received_samples:rate5m{cluster=~\"$cluster\", job=~\"($namespace)/((distributor|cortex|mimir|mimir-write.*))\"})",
          "format": "time_series",
          "intervalFactor": 2,
          "legendFormat": "samples / sec",
          "refId": "A"
        },
        {
          "datasource": {
            "uid": "$datasource"
          },
          "expr": "sum(cluster_namespace_job:cortex_distributor_received_exemplars:rate5m{cluster=~\"$cluster\", job=~\"($namespace)/((distributor|cortex|mimir|mimir-write.*))\"})",
          "format": "time_series",
          "intervalFactor": 2,
          "legendFormat": "exemplars / sec",
          "refId": "B"
        }
      ],
      "thresholds": [

      ],
      "timeRegions": [

      ],
      "title": "Ingestion / sec",
      "tooltip": {
        "shared": false,
        "sort": 0,
        "value_type": "individual"
      },
      "type": "graph",
      "xaxis": {
        "mode": "time",
        "show": true,
        "values": [

        ]
      },
      "yaxes": [
        {
          "format": "cps",
          "logBase": 1,
          "min": 0,
          "show": true
        },
        {
          "format": "short",
          "logBase": 1,
          "show": false
        }
      ],
      "yaxis": {
        "align": false
      }
    },
    {
      "collapsed": false,
      "datasource": {
        "type": "prometheus",
        "uid": "PA258B30F88C30650"
      },
      "gridPos": {
        "h": 1,
        "w": 24,
        "x": 0,
        "y": 16
      },
      "id": 22,
      "panels": [

      ],
      "targets": [
        {
          "datasource": {
            "type": "prometheus",
            "uid": "PA258B30F88C30650"
          },
          "refId": "A"
        }
      ],
      "title": "Reads",
      "type": "row"
    },
    {
      "datasource": {
        "type": "prometheus",
        "uid": "PA258B30F88C30650"
      },
      "description": "",
      "gridPos": {
        "h": 7,
        "w": 6,
        "x": 0,
        "y": 17
      },
      "id": 8,
      "options": {
        "code": {
          "language": "plaintext",
          "showLineNumbers": false,
          "showMiniMap": false
        },
        "content": "These panels show an overview on the read path. \nTo examine the read path in detail, see a specific dashboard:\n\n- <a target=\"_blank\" href=\"./d/e327503188913dc38ad571c647eef643/mimir-reads?${__url_time_range}&${__all_variables}\">Reads</a>\n- <a target=\"_blank\" href=\"./d/cc86fd5aa9301c6528986572ad974db9/mimir-reads-resources?${__url_time_range}&${__all_variables}\">Reads resources</a>\n- <a target=\"_blank\" href=\"./d/54b2a0a4748b3bd1aefa92ce5559a1c2/mimir-reads-networking?${__url_time_range}&${__all_variables}\">Reads networking</a>\n- <a target=\"_blank\" href=\"./d/a9b92d3c4d1af325d872a9e9a7083d71/mimir-overview-resources?${__url_time_range}&${__all_variables}\">Overview resources</a>\n- <a target=\"_blank\" href=\"./d/e15c71d372cc541367a088f10d9fcd92/mimir-overview-networking?${__url_time_range}&${__all_variables}\">Overview networking</a>\n- <a target=\"_blank\" href=\"./d/b3abe8d5c040395cc36615cb4334c92d/mimir-queries?${__url_time_range}&${__all_variables}\">Queries</a>\n- <a target=\"_blank\" href=\"./d/1b3443aea86db629e6efdb7d05c53823/mimir-compactor?${__url_time_range}&${__all_variables}\">Compactor</a>\n",
        "mode": "markdown"
      },
      "pluginVersion": "10.1.5",
      "targets": [
        {
          "datasource": {
            "type": "prometheus",
            "uid": "PA258B30F88C30650"
          },
          "refId": "A"
        }
      ],
      "transparent": true,
      "type": "text"
    },
    {
      "aliasColors": {
        "1xx": "#EAB839",
        "2xx": "#7EB26D",
        "3xx": "#6ED0E0",
        "4xx": "#EF843C",
        "5xx": "#E24D42",
        "cancel": "#A9A9A9",
        "error": "#E24D42",
        "success": "#7EB26D"
      },
      "bars": false,
      "dashLength": 10,
      "dashes": false,
      "datasource": {
        "uid": "$datasource"
      },
      "fill": 10,
      "fillGradient": 0,
      "gridPos": {
        "h": 7,
        "w": 6,
        "x": 6,
        "y": 17
      },
      "hiddenSeries": false,
      "id": 9,
      "legend": {
        "avg": false,
        "current": false,
        "max": false,
        "min": false,
        "show": true,
        "total": false,
        "values": false
      },
      "lines": true,
      "linewidth": 0,
      "links": [

      ],
      "nullPointMode": "null as zero",
      "options": {
        "alertThreshold": true
      },
      "percentage": false,
      "pluginVersion": "10.1.5",
      "pointradius": 5,
      "points": false,
      "renderer": "flot",
      "seriesOverrides": [

      ],
      "spaceLength": 10,
      "stack": true,
      "steppedLine": false,
      "targets": [
        {
          "datasource": {
            "uid": "$datasource"
          },
          "expr": "sum by (status) (\n  label_replace(label_replace(rate(cortex_request_duration_seconds_count{cluster=~\"$cluster\", job=~\"($namespace)/((query-frontend.*|cortex|mimir|mimir-read.*))\", route=~\"(prometheus|api_prom)_api_v1_.+\"}[$__rate_interval]),\n  \"status\", \"${1}xx\", \"status_code\", \"([0-9])..\"),\n  \"status\", \"${1}\", \"status_code\", \"([a-z]+)\"))\n",
          "format": "time_series",
          "intervalFactor": 2,
          "legendFormat": "{{status}}",
          "refId": "A"
        }
      ],
      "thresholds": [

      ],
      "timeRegions": [

      ],
      "title": "Read requests / sec",
      "tooltip": {
        "shared": false,
        "sort": 0,
        "value_type": "individual"
      },
      "type": "graph",
      "xaxis": {
        "mode": "time",
        "show": true,
        "values": [

        ]
      },
      "yaxes": [
        {
          "format": "reqps",
          "logBase": 1,
          "min": 0,
          "show": true
        },
        {
          "format": "short",
          "logBase": 1,
          "show": false
        }
      ],
      "yaxis": {
        "align": false
      }
    },
    {
      "aliasColors": {
      },
      "bars": false,
      "dashLength": 10,
      "dashes": false,
      "datasource": {
        "uid": "$datasource"
      },
      "fill": 1,
      "fillGradient": 0,
      "gridPos": {
        "h": 7,
        "w": 6,
        "x": 12,
        "y": 17
      },
      "hiddenSeries": false,
      "id": 10,
      "legend": {
        "avg": false,
        "current": false,
        "max": false,
        "min": false,
        "show": true,
        "total": false,
        "values": false
      },
      "lines": true,
      "linewidth": 1,
      "links": [

      ],
      "nullPointMode": "null as zero",
      "options": {
        "alertThreshold": true
      },
      "percentage": false,
      "pluginVersion": "10.1.5",
      "pointradius": 5,
      "points": false,
      "renderer": "flot",
      "seriesOverrides": [

      ],
      "spaceLength": 10,
      "stack": false,
      "steppedLine": false,
      "targets": [
        {
          "datasource": {
            "uid": "$datasource"
          },
          "expr": "histogram_quantile(0.99, sum by (le) (cluster_job_route:cortex_request_duration_seconds_bucket:sum_rate{cluster=~\"$cluster\", job=~\"($namespace)/((query-frontend.*|cortex|mimir|mimir-read.*))\", route=~\"(prometheus|api_prom)_api_v1_.+\"})) * 1e3",
          "format": "time_series",
          "intervalFactor": 2,
          "legendFormat": "99th percentile",
          "refId": "A",
          "step": 10
        },
        {
          "datasource": {
            "uid": "$datasource"
          },
          "expr": "histogram_quantile(0.50, sum by (le) (cluster_job_route:cortex_request_duration_seconds_bucket:sum_rate{cluster=~\"$cluster\", job=~\"($namespace)/((query-frontend.*|cortex|mimir|mimir-read.*))\", route=~\"(prometheus|api_prom)_api_v1_.+\"})) * 1e3",
          "format": "time_series",
          "intervalFactor": 2,
          "legendFormat": "50th percentile",
          "refId": "B",
          "step": 10
        },
        {
          "datasource": {
            "uid": "$datasource"
          },
          "expr": "1e3 * sum(cluster_job_route:cortex_request_duration_seconds_sum:sum_rate{cluster=~\"$cluster\", job=~\"($namespace)/((query-frontend.*|cortex|mimir|mimir-read.*))\", route=~\"(prometheus|api_prom)_api_v1_.+\"}) / sum(cluster_job_route:cortex_request_duration_seconds_count:sum_rate{cluster=~\"$cluster\", job=~\"($namespace)/((query-frontend.*|cortex|mimir|mimir-read.*))\", route=~\"(prometheus|api_prom)_api_v1_.+\"})",
          "format": "time_series",
          "intervalFactor": 2,
          "legendFormat": "Average",
          "refId": "C",
          "step": 10
        }
      ],
      "thresholds": [

      ],
      "timeRegions": [

      ],
      "title": "Read latency",
      "tooltip": {
        "shared": false,
        "sort": 0,
        "value_type": "individual"
      },
      "type": "graph",
      "xaxis": {
        "mode": "time",
        "show": true,
        "values": [

        ]
      },
      "yaxes": [
        {
          "format": "ms",
          "logBase": 1,
          "min": 0,
          "show": true
        },
        {
          "format": "short",
          "logBase": 1,
          "show": false
        }
      ],
      "yaxis": {
        "align": false
      }
    },
    {
      "aliasColors": {
      },
      "bars": false,
      "dashLength": 10,
      "dashes": false,
      "datasource": {
        "uid": "$datasource"
      },
      "fill": 10,
      "fillGradient": 0,
      "gridPos": {
        "h": 7,
        "w": 6,
        "x": 18,
        "y": 17
      },
      "hiddenSeries": false,
      "id": 11,
      "legend": {
        "avg": false,
        "current": false,
        "max": false,
        "min": false,
        "show": true,
        "total": false,
        "values": false
      },
      "lines": true,
      "linewidth": 0,
      "links": [

      ],
      "nullPointMode": "null as zero",
      "options": {
        "alertThreshold": true
      },
      "percentage": false,
      "pluginVersion": "10.1.5",
      "pointradius": 5,
      "points": false,
      "renderer": "flot",
      "seriesOverrides": [
        {
          "alias": "instant queries",
          "color": "#429D48"
        },
        {
          "alias": "range queries",
          "color": "#F1C731"
        },
        {
          "alias": "\"label names\" queries",
          "color": "#2A66CF"
        },
        {
          "alias": "\"label values\" queries",
          "color": "#9E44C1"
        },
        {
          "alias": "series queries",
          "color": "#FFAB57"
        },
        {
          "alias": "remote read queries",
          "color": "#C79424"
        },
        {
          "alias": "metadata queries",
          "color": "#84D586"
        },
        {
          "alias": "exemplar queries",
          "color": "#A1C4FC"
        },
        {
          "alias": "other",
          "color": "#C788DE"
        }
      ],
      "spaceLength": 10,
      "stack": true,
      "steppedLine": false,
      "targets": [
        {
          "datasource": {
            "uid": "$datasource"
          },
          "expr": "sum(rate(cortex_request_duration_seconds_count{cluster=~\"$cluster\", job=~\"($namespace)/((query-frontend.*|cortex|mimir|mimir-read.*))\",route=~\"(prometheus|api_prom)_api_v1_query\"}[$__rate_interval]))",
          "format": "time_series",
          "intervalFactor": 2,
          "legendFormat": "instant queries",
          "refId": "A"
        },
        {
          "datasource": {
            "uid": "$datasource"
          },
          "expr": "sum(rate(cortex_request_duration_seconds_count{cluster=~\"$cluster\", job=~\"($namespace)/((query-frontend.*|cortex|mimir|mimir-read.*))\",route=~\"(prometheus|api_prom)_api_v1_query_range\"}[$__rate_interval]))",
          "format": "time_series",
          "intervalFactor": 2,
          "legendFormat": "range queries",
          "refId": "B"
        },
        {
          "datasource": {
            "uid": "$datasource"
          },
          "expr": "sum(rate(cortex_request_duration_seconds_count{cluster=~\"$cluster\", job=~\"($namespace)/((query-frontend.*|cortex|mimir|mimir-read.*))\",route=~\"(prometheus|api_prom)_api_v1_labels\"}[$__rate_interval]))",
          "format": "time_series",
          "intervalFactor": 2,
          "legendFormat": "\"label names\" queries",
          "refId": "C"
        },
        {
          "datasource": {
            "uid": "$datasource"
          },
          "expr": "sum(rate(cortex_request_duration_seconds_count{cluster=~\"$cluster\", job=~\"($namespace)/((query-frontend.*|cortex|mimir|mimir-read.*))\",route=~\"(prometheus|api_prom)_api_v1_label_name_values\"}[$__rate_interval]))",
          "format": "time_series",
          "intervalFactor": 2,
          "legendFormat": "\"label values\" queries",
          "refId": "D"
        },
        {
          "datasource": {
            "uid": "$datasource"
          },
          "expr": "sum(rate(cortex_request_duration_seconds_count{cluster=~\"$cluster\", job=~\"($namespace)/((query-frontend.*|cortex|mimir|mimir-read.*))\",route=~\"(prometheus|api_prom)_api_v1_series\"}[$__rate_interval]))",
          "format": "time_series",
          "intervalFactor": 2,
          "legendFormat": "series queries",
          "refId": "E"
        },
        {
          "datasource": {
            "uid": "$datasource"
          },
          "expr": "sum(rate(cortex_request_duration_seconds_count{cluster=~\"$cluster\", job=~\"($namespace)/((query-frontend.*|cortex|mimir|mimir-read.*))\",route=~\"(prometheus|api_prom)_api_v1_read\"}[$__rate_interval]))",
          "format": "time_series",
          "intervalFactor": 2,
          "legendFormat": "remote read queries",
          "refId": "F"
        },
        {
          "datasource": {
            "uid": "$datasource"
          },
          "expr": "sum(rate(cortex_request_duration_seconds_count{cluster=~\"$cluster\", job=~\"($namespace)/((query-frontend.*|cortex|mimir|mimir-read.*))\",route=~\"(prometheus|api_prom)_api_v1_metadata\"}[$__rate_interval]))",
          "format": "time_series",
          "intervalFactor": 2,
          "legendFormat": "metadata queries",
          "refId": "G"
        },
        {
          "datasource": {
            "uid": "$datasource"
          },
          "expr": "sum(rate(cortex_request_duration_seconds_count{cluster=~\"$cluster\", job=~\"($namespace)/((query-frontend.*|cortex|mimir|mimir-read.*))\",route=~\"(prometheus|api_prom)_api_v1_query_exemplars\"}[$__rate_interval]))",
          "format": "time_series",
          "intervalFactor": 2,
          "legendFormat": "exemplar queries",
          "refId": "H"
        },
        {
          "datasource": {
            "uid": "$datasource"
          },
          "expr": "sum(rate(cortex_request_duration_seconds_count{cluster=~\"$cluster\", job=~\"($namespace)/((query-frontend.*|cortex|mimir|mimir-read.*))\",route=~\"(prometheus|api_prom)_api_v1_.*\",route!~\".*(query|query_range|label.*|series|read|metadata|query_exemplars)\"}[$__rate_interval]))",
          "format": "time_series",
          "intervalFactor": 2,
          "legendFormat": "other",
          "refId": "I"
        }
      ],
      "thresholds": [

      ],
      "timeRegions": [

      ],
      "title": "Queries / sec",
      "tooltip": {
        "shared": false,
        "sort": 0,
        "value_type": "individual"
      },
      "type": "graph",
      "xaxis": {
        "mode": "time",
        "show": true,
        "values": [

        ]
      },
      "yaxes": [
        {
          "format": "reqps",
          "logBase": 1,
          "min": 0,
          "show": true
        },
        {
          "format": "short",
          "logBase": 1,
          "show": false
        }
      ],
      "yaxis": {
        "align": false
      }
    },
    {
      "collapsed": false,
      "datasource": {
        "type": "prometheus",
        "uid": "PA258B30F88C30650"
      },
      "gridPos": {
        "h": 1,
        "w": 24,
        "x": 0,
        "y": 24
      },
      "id": 23,
      "panels": [

      ],
      "targets": [
        {
          "datasource": {
            "type": "prometheus",
            "uid": "PA258B30F88C30650"
          },
          "refId": "A"
        }
      ],
      "title": "Recording and alerting rules",
      "type": "row"
    },
    {
      "datasource": {
        "type": "prometheus",
        "uid": "PA258B30F88C30650"
      },
      "description": "",
      "gridPos": {
        "h": 7,
        "w": 6,
        "x": 0,
        "y": 25
      },
      "id": 12,
      "options": {
        "code": {
          "language": "plaintext",
          "showLineNumbers": false,
          "showMiniMap": false
        },
        "content": "These panels show an overview on the recording and alerting rules evaluation.\nTo examine the rules evaluation and alerts notifications in detail, see a specific dashboard:\n\n- <a target=\"_blank\" href=\"./d/631e15d5d85afb2ca8e35d62984eeaa0/mimir-ruler?${__url_time_range}&${__all_variables}\">Ruler</a>\n- <a target=\"_blank\" href=\"./d/b0d38d318bbddd80476246d4930f9e55/mimir-alertmanager?${__url_time_range}&${__all_variables}\">Alertmanager</a>\n- <a target=\"_blank\" href=\"./d/a6883fb22799ac74479c7db872451092/mimir-alertmanager-resources?${__url_time_range}&${__all_variables}\">Alertmanager resources</a>\n- <a target=\"_blank\" href=\"./d/a9b92d3c4d1af325d872a9e9a7083d71/mimir-overview-resources?${__url_time_range}&${__all_variables}\">Overview resources</a>\n- <a target=\"_blank\" href=\"./d/e15c71d372cc541367a088f10d9fcd92/mimir-overview-networking?${__url_time_range}&${__all_variables}\">Overview networking</a>\n",
        "mode": "markdown"
      },
      "pluginVersion": "10.1.5",
      "targets": [
        {
          "datasource": {
            "type": "prometheus",
            "uid": "PA258B30F88C30650"
          },
          "refId": "A"
        }
      ],
      "transparent": true,
      "type": "text"
    },
    {
      "aliasColors": {
        "failed": "#E24D42",
        "success": "#7EB26D"
      },
      "bars": false,
      "dashLength": 10,
      "dashes": false,
      "datasource": {
        "uid": "$datasource"
      },
      "fill": 1,
      "fillGradient": 0,
      "gridPos": {
        "h": 7,
        "w": 6,
        "x": 6,
        "y": 25
      },
      "hiddenSeries": false,
      "id": 13,
      "legend": {
        "avg": false,
        "current": false,
        "max": false,
        "min": false,
        "show": true,
        "total": false,
        "values": false
      },
      "lines": true,
      "linewidth": 1,
      "links": [

      ],
      "nullPointMode": "null as zero",
      "options": {
        "alertThreshold": true
      },
      "percentage": false,
      "pluginVersion": "10.1.5",
      "pointradius": 5,
      "points": false,
      "renderer": "flot",
      "seriesOverrides": [

      ],
      "spaceLength": 10,
      "stack": false,
      "steppedLine": false,
      "targets": [
        {
          "datasource": {
            "uid": "$datasource"
          },
          "expr": "sum(rate(cortex_prometheus_rule_evaluations_total{cluster=~\"$cluster\", job=~\"($namespace)/((ruler|cortex|mimir|mimir-backend.*))\"}[$__rate_interval]))\n-\nsum(rate(cortex_prometheus_rule_evaluation_failures_total{cluster=~\"$cluster\", job=~\"($namespace)/((ruler|cortex|mimir|mimir-backend.*))\"}[$__rate_interval]))\n",
          "format": "time_series",
          "intervalFactor": 2,
          "legendFormat": "success",
          "refId": "A"
        },
        {
          "datasource": {
            "uid": "$datasource"
          },
          "expr": "sum(rate(cortex_prometheus_rule_evaluation_failures_total{cluster=~\"$cluster\", job=~\"($namespace)/((ruler|cortex|mimir|mimir-backend.*))\"}[$__rate_interval]))",
          "format": "time_series",
          "intervalFactor": 2,
          "legendFormat": "failed",
          "refId": "B"
        },
        {
          "datasource": {
            "uid": "$datasource"
          },
          "expr": "sum(rate(cortex_prometheus_rule_group_iterations_missed_total{cluster=~\"$cluster\", job=~\"($namespace)/((ruler|cortex|mimir|mimir-backend.*))\"}[$__rate_interval]))",
          "format": "time_series",
          "intervalFactor": 2,
          "legendFormat": "missed",
          "refId": "C"
        }
      ],
      "thresholds": [

      ],
      "timeRegions": [

      ],
      "title": "Rule evaluations / sec",
      "tooltip": {
        "shared": false,
        "sort": 0,
        "value_type": "individual"
      },
      "type": "graph",
      "xaxis": {
        "mode": "time",
        "show": true,
        "values": [

        ]
      },
      "yaxes": [
        {
          "format": "short",
          "logBase": 1,
          "min": 0,
          "show": true
        },
        {
          "format": "short",
          "logBase": 1,
          "show": false
        }
      ],
      "yaxis": {
        "align": false
      }
    },
    {
      "aliasColors": {
      },
      "bars": false,
      "dashLength": 10,
      "dashes": false,
      "datasource": {
        "uid": "$datasource"
      },
      "fill": 1,
      "fillGradient": 0,
      "gridPos": {
        "h": 7,
        "w": 6,
        "x": 12,
        "y": 25
      },
      "hiddenSeries": false,
      "id": 14,
      "legend": {
        "avg": false,
        "current": false,
        "max": false,
        "min": false,
        "show": true,
        "total": false,
        "values": false
      },
      "lines": true,
      "linewidth": 1,
      "links": [

      ],
      "nullPointMode": "null as zero",
      "options": {
        "alertThreshold": true
      },
      "percentage": false,
      "pluginVersion": "10.1.5",
      "pointradius": 5,
      "points": false,
      "renderer": "flot",
      "seriesOverrides": [

      ],
      "spaceLength": 10,
      "stack": false,
      "steppedLine": false,
      "targets": [
        {
          "datasource": {
            "uid": "$datasource"
          },
          "expr": "sum (rate(cortex_prometheus_rule_evaluation_duration_seconds_sum{cluster=~\"$cluster\", job=~\"($namespace)/((ruler|cortex|mimir|mimir-backend.*))\"}[$__rate_interval]))\n  /\nsum (rate(cortex_prometheus_rule_evaluation_duration_seconds_count{cluster=~\"$cluster\", job=~\"($namespace)/((ruler|cortex|mimir|mimir-backend.*))\"}[$__rate_interval]))\n",
          "format": "time_series",
          "intervalFactor": 2,
          "legendFormat": "average",
          "refId": "A"
        }
      ],
      "thresholds": [

      ],
      "timeRegions": [

      ],
      "title": "Rule evaluations latency",
      "tooltip": {
        "shared": false,
        "sort": 0,
        "value_type": "individual"
      },
      "type": "graph",
      "xaxis": {
        "mode": "time",
        "show": true,
        "values": [

        ]
      },
      "yaxes": [
        {
          "format": "s",
          "logBase": 1,
          "min": 0,
          "show": true
        },
        {
          "format": "short",
          "logBase": 1,
          "show": false
        }
      ],
      "yaxis": {
        "align": false
      }
    },
    {
      "aliasColors": {
        "failed": "#E24D42",
        "successful": "#7EB26D"
      },
      "bars": false,
      "dashLength": 10,
      "dashes": false,
      "datasource": {
        "uid": "$datasource"
      },
      "fill": 10,
      "fillGradient": 0,
      "gridPos": {
        "h": 7,
        "w": 6,
        "x": 18,
        "y": 25
      },
      "hiddenSeries": false,
      "id": 15,
      "legend": {
        "avg": false,
        "current": false,
        "max": false,
        "min": false,
        "show": true,
        "total": false,
        "values": false
      },
      "lines": true,
      "linewidth": 0,
      "links": [

      ],
      "nullPointMode": "null as zero",
      "options": {
        "alertThreshold": true
      },
      "percentage": false,
      "pluginVersion": "10.1.5",
      "pointradius": 5,
      "points": false,
      "renderer": "flot",
      "seriesOverrides": [

      ],
      "spaceLength": 10,
      "stack": true,
      "steppedLine": false,
      "targets": [
        {
          "datasource": {
            "uid": "$datasource"
          },
          "expr": "sum(rate(cortex_prometheus_notifications_sent_total{cluster=~\"$cluster\", job=~\"($namespace)/((ruler|cortex|mimir|mimir-backend.*))\"}[$__rate_interval]))\n  -\nsum(rate(cortex_prometheus_notifications_errors_total{cluster=~\"$cluster\", job=~\"($namespace)/((ruler|cortex|mimir|mimir-backend.*))\"}[$__rate_interval]))\n",
          "format": "time_series",
          "intervalFactor": 2,
          "legendFormat": "successful",
          "refId": "A"
        },
        {
          "datasource": {
            "uid": "$datasource"
          },
          "expr": "sum(rate(cortex_prometheus_notifications_errors_total{cluster=~\"$cluster\", job=~\"($namespace)/((ruler|cortex|mimir|mimir-backend.*))\"}[$__rate_interval]))\n",
          "format": "time_series",
          "intervalFactor": 2,
          "legendFormat": "failed",
          "refId": "B"
        }
      ],
      "thresholds": [

      ],
      "timeRegions": [

      ],
      "title": "Alerting notifications sent to Alertmanager / sec",
      "tooltip": {
        "shared": false,
        "sort": 0,
        "value_type": "individual"
      },
      "type": "graph",
      "xaxis": {
        "mode": "time",
        "show": true,
        "values": [

        ]
      },
      "yaxes": [
        {
          "format": "short",
          "logBase": 1,
          "min": 0,
          "show": true
        },
        {
          "format": "short",
          "logBase": 1,
          "show": false
        }
      ],
      "yaxis": {
        "align": false
      }
    },
    {
      "collapsed": false,
      "datasource": {
        "type": "prometheus",
        "uid": "PA258B30F88C30650"
      },
      "gridPos": {
        "h": 1,
        "w": 24,
        "x": 0,
        "y": 32
      },
      "id": 24,
      "panels": [

      ],
      "targets": [
        {
          "datasource": {
            "type": "prometheus",
            "uid": "PA258B30F88C30650"
          },
          "refId": "A"
        }
      ],
      "title": "Long-term storage (object storage)",
      "type": "row"
    },
    {
      "datasource": {
        "type": "prometheus",
        "uid": "PA258B30F88C30650"
      },
      "description": "",
      "gridPos": {
        "h": 7,
        "w": 6,
        "x": 0,
        "y": 33
      },
      "id": 16,
      "options": {
        "code": {
          "language": "plaintext",
          "showLineNumbers": false,
          "showMiniMap": false
        },
        "content": "These panels show an overview on the long-term storage (object storage).\nTo examine the storage in detail, see a specific dashboard:\n\n- <a target=\"_blank\" href=\"./d/e1324ee2a434f4158c00a9ee279d3292/mimir-object-store?${__url_time_range}&${__all_variables}\">Object store</a>\n- <a target=\"_blank\" href=\"./d/1b3443aea86db629e6efdb7d05c53823/mimir-compactor?${__url_time_range}&${__all_variables}\">Compactor</a>\n",
        "mode": "markdown"
      },
      "pluginVersion": "10.1.5",
      "targets": [
        {
          "datasource": {
            "type": "prometheus",
            "uid": "PA258B30F88C30650"
          },
          "refId": "A"
        }
      ],
      "transparent": true,
      "type": "text"
    },
    {
      "aliasColors": {
        "failed": "#E24D42",
        "successful": "#7EB26D"
      },
      "bars": false,
      "dashLength": 10,
      "dashes": false,
      "datasource": {
        "uid": "$datasource"
      },
      "fill": 10,
      "fillGradient": 0,
      "gridPos": {
        "h": 7,
        "w": 6,
        "x": 6,
        "y": 33
      },
      "hiddenSeries": false,
      "id": 17,
      "legend": {
        "avg": false,
        "current": false,
        "max": false,
        "min": false,
        "show": true,
        "total": false,
        "values": false
      },
      "lines": true,
      "linewidth": 0,
      "links": [

      ],
      "nullPointMode": "null as zero",
      "options": {
        "alertThreshold": true
      },
      "percentage": false,
      "pluginVersion": "10.1.5",
      "pointradius": 5,
      "points": false,
      "renderer": "flot",
      "seriesOverrides": [

      ],
      "spaceLength": 10,
      "stack": true,
      "steppedLine": false,
      "targets": [
        {
          "datasource": {
            "uid": "$datasource"
          },
          "expr": "sum(rate(thanos_objstore_bucket_operations_total{cluster=~\"$cluster\", namespace=~\"$namespace\"}[$__rate_interval]))\n-\nsum(rate(thanos_objstore_bucket_operation_failures_total{cluster=~\"$cluster\", namespace=~\"$namespace\"}[$__rate_interval]))\n",
          "format": "time_series",
          "intervalFactor": 2,
          "legendFormat": "successful",
          "refId": "A"
        },
        {
          "datasource": {
            "uid": "$datasource"
          },
          "expr": "sum(rate(thanos_objstore_bucket_operation_failures_total{cluster=~\"$cluster\", namespace=~\"$namespace\"}[$__rate_interval]))\n",
          "format": "time_series",
          "intervalFactor": 2,
          "legendFormat": "failed",
          "refId": "B"
        }
      ],
      "thresholds": [

      ],
      "timeRegions": [

      ],
      "title": "Requests / sec",
      "tooltip": {
        "shared": false,
        "sort": 0,
        "value_type": "individual"
      },
      "type": "graph",
      "xaxis": {
        "mode": "time",
        "show": true,
        "values": [

        ]
      },
      "yaxes": [
        {
          "format": "reqps",
          "logBase": 1,
          "min": 0,
          "show": true
        },
        {
          "format": "short",
          "logBase": 1,
          "show": false
        }
      ],
      "yaxis": {
        "align": false
      }
    },
    {
      "aliasColors": {
      },
      "bars": false,
      "dashLength": 10,
      "dashes": false,
      "datasource": {
        "uid": "$datasource"
      },
      "fill": 10,
      "fillGradient": 0,
      "gridPos": {
        "h": 7,
        "w": 6,
        "x": 12,
        "y": 33
      },
      "hiddenSeries": false,
      "id": 18,
      "legend": {
        "avg": false,
        "current": false,
        "max": false,
        "min": false,
        "show": true,
        "total": false,
        "values": false
      },
      "lines": true,
      "linewidth": 0,
      "links": [

      ],
      "nullPointMode": "null as zero",
      "options": {
        "alertThreshold": true
      },
      "percentage": false,
      "pluginVersion": "10.1.5",
      "pointradius": 5,
      "points": false,
      "renderer": "flot",
      "seriesOverrides": [
        {
          "alias": "attributes",
          "color": "#429D48"
        },
        {
          "alias": "delete",
          "color": "#F1C731"
        },
        {
          "alias": "exists",
          "color": "#2A66CF"
        },
        {
          "alias": "get",
          "color": "#9E44C1"
        },
        {
          "alias": "get_range",
          "color": "#FFAB57"
        },
        {
          "alias": "iter",
          "color": "#C79424"
        },
        {
          "alias": "upload",
          "color": "#84D586"
        }
      ],
      "spaceLength": 10,
      "stack": true,
      "steppedLine": false,
      "targets": [
        {
          "datasource": {
            "uid": "$datasource"
          },
          "expr": "sum by(operation) (rate(thanos_objstore_bucket_operations_total{cluster=~\"$cluster\", namespace=~\"$namespace\"}[$__rate_interval]))",
          "format": "time_series",
          "intervalFactor": 2,
          "legendFormat": "{{operation}}",
          "refId": "A"
        }
      ],
      "thresholds": [

      ],
      "timeRegions": [

      ],
      "title": "Operations / sec",
      "tooltip": {
        "shared": false,
        "sort": 0,
        "value_type": "individual"
      },
      "type": "graph",
      "xaxis": {
        "mode": "time",
        "show": true,
        "values": [

        ]
      },
      "yaxes": [
        {
          "format": "reqps",
          "logBase": 1,
          "min": 0,
          "show": true
        },
        {
          "format": "short",
          "logBase": 1,
          "show": false
        }
      ],
      "yaxis": {
        "align": false
      }
    },
    {
      "aliasColors": {
      },
      "bars": false,
      "dashLength": 10,
      "dashes": false,
      "datasource": {
        "uid": "$datasource"
      },
      "fill": 1,
      "fillGradient": 0,
      "gridPos": {
        "h": 7,
        "w": 6,
        "x": 18,
        "y": 33
      },
      "hiddenSeries": false,
      "id": 19,
      "legend": {
        "avg": false,
        "current": false,
        "max": false,
        "min": false,
        "show": true,
        "total": false,
        "values": false
      },
      "lines": true,
      "linewidth": 1,
      "links": [

      ],
      "nullPointMode": "null as zero",
      "options": {
        "alertThreshold": true
      },
      "percentage": false,
      "pluginVersion": "10.1.5",
      "pointradius": 5,
      "points": false,
      "renderer": "flot",
      "seriesOverrides": [

      ],
      "spaceLength": 10,
      "stack": false,
      "steppedLine": false,
      "targets": [
        {
          "datasource": {
            "uid": "$datasource"
          },
          "expr": "sum(max by(user) (max_over_time(cortex_bucket_blocks_count{cluster=~\"$cluster\", job=~\"($namespace)/((compactor.*|cortex|mimir|mimir-backend.*))\"}[15m])))",
          "format": "time_series",
          "intervalFactor": 2,
          "legendFormat": "blocks",
          "refId": "A"
        }
      ],
      "thresholds": [

      ],
      "timeRegions": [

      ],
      "title": "Total number of blocks in the storage",
      "tooltip": {
        "shared": false,
        "sort": 0,
        "value_type": "individual"
      },
      "type": "graph",
      "xaxis": {
        "mode": "time",
        "show": true,
        "values": [

        ]
      },
      "yaxes": [
        {
          "format": "short",
          "logBase": 1,
          "min": 0,
          "show": true
        },
        {
          "format": "short",
          "logBase": 1,
          "show": false
        }
      ],
      "yaxis": {
        "align": false
      }
    }
  ],
  "refresh": "5m",
  "schemaVersion": 38,
  "style": "dark",
  "tags": [
    "mimir",
    "protected",
    "unmanaged"
  ],
  "templating": {
    "list": [
      {
        "current": {
          "selected": true,
          "text": "Mimir - Global",
          "value": "e58c2f51-20f8-4f4b-ad48-2968782ca7d6"
        },
        "hide": 0,
        "includeAll": false,
        "label": "Data Source",
        "multi": false,
        "name": "datasource",
        "options": [

        ],
        "query": "prometheus",
        "queryValue": "mimir",
        "refresh": 1,
        "regex": "",
        "skipUrlSync": false,
        "type": "datasource"
      },
      {
        "allValue": ".+",
        "current": {
          "selected": true,
          "text": [
            "mimir"
          ],
          "value": [
            "mimir"
          ]
        },
        "datasource": {
          "type": "prometheus",
          "uid": "$datasource"
        },
        "definition": "",
        "hide": 0,
        "includeAll": true,
        "label": "cluster",
        "multi": true,
        "name": "cluster",
        "options": [

        ],
        "query": "label_values(cortex_build_info, cluster)",
        "refresh": 1,
        "regex": "",
        "skipUrlSync": false,
        "sort": 1,
        "tagValuesQuery": "",
        "tagsQuery": "",
        "type": "query",
        "useTags": false
      },
      {
        "allValue": ".+",
        "current": {
          "selected": true,
          "text": [
            "mimir"
          ],
          "value": [
            "mimir"
          ]
        },
        "datasource": {
          "type": "prometheus",
          "uid": "$datasource"
        },
        "definition": "",
        "hide": 0,
        "includeAll": true,
        "label": "namespace",
        "multi": true,
        "name": "namespace",
        "options": [

        ],
        "query": "label_values(cortex_build_info{cluster=~\"$cluster\"}, namespace)",
        "refresh": 1,
        "regex": "",
        "skipUrlSync": false,
        "sort": 1,
        "tagValuesQuery": "",
        "tagsQuery": "",
        "type": "query",
        "useTags": false
      }
    ]
  },
  "time": {
    "from": "now-1h",
    "to": "now"
  },
  "timepicker": {
    "refresh_intervals": [
      "5s",
      "10s",
      "30s",
      "1m",
      "5m",
      "15m",
      "30m",
      "1h",
      "2h",
      "1d"
    ],
    "time_options": [
      "5m",
      "15m",
      "1h",
      "6h",
      "12h",
      "24h",
      "2d",
      "7d",
      "30d"
    ]
  },
  "timezone": "utc",
  "title": "Mimir / Overview",
  "uid": "ffcd83628d7d4b5a03d1cafd159e6c9c",
  "version": 5,
  "weekStart": ""
}