{
  "__inputs": [

  ],
  "__requires": [

  ],
  "annotations": {
    "list": [
      {
        "builtIn": 1,
        "datasource": "-- Grafana --",
        "enable": true,
        "hide": false,
        "iconColor": "#96D98D",
        "name": "deploy",
        "showIn": 0,
        "tags": [
          "deploy",
          "$environment"
        ],
        "type": "tags"
      },
      {
        "builtIn": 1,
        "datasource": "-- Grafana --",
        "enable": false,
        "hide": false,
        "iconColor": "#FFEE52",
        "name": "canary-deploy",
        "showIn": 0,
        "tags": [
          "deploy",
          "${environment}-cny"
        ],
        "type": "tags"
      },
      {
        "builtIn": 1,
        "datasource": "-- Grafana --",
        "enable": false,
        "hide": false,
        "iconColor": "#CA95E5",
        "name": "feature-flags",
        "showIn": 0,
        "tags": [
          "feature-flag",
          "${environment}"
        ],
        "type": "tags"
      }
    ]
  },
  "description": "Uploaded by https://gitlab.com/gitlab-com/runbooks/-/jobs/5761247267 at Fri Dec 15 13:19:43 UTC 2023",
  "editable": false,
  "gnetId": null,
  "graphTooltip": 1,
  "hideControls": false,
  "id": null,
  "links": [
    {
      "asDropdown": true,
      "icon": "external link",
      "includeVars": false,
      "keepTime": true,
      "tags": "",
      "targetBlank": false,
      "title": "Platform Triage",
      "type": "link",
      "url": "https://dashboards.gitlab.net/d/general-triage/platform-triage?orgId=1"
    }
  ],
  "panels": [
    {
      "datasource": null,
      "fieldConfig": {
        "defaults": {
          "displayName": "Status",
          "links": [

          ],
          "mappings": [
            {
              "id": 0,
              "options": {
                "0": {
                  "color": "black",
                  "index": 0,
                  "text": "Healthy"
                },
                "1": {
                  "color": "orange",
                  "index": 1,
                  "text": "Warning 🔥"
                },
                "10": {
                  "color": "orange",
                  "index": 10,
                  "text": "Warning 🔥🥵"
                },
                "11": {
                  "color": "red",
                  "index": 11,
                  "text": "Degraded 🔥🥵"
                },
                "12": {
                  "color": "red",
                  "index": 12,
                  "text": "Degraded 🥵"
                },
                "13": {
                  "color": "red",
                  "index": 13,
                  "text": "Degraded 🔥🥵"
                },
                "14": {
                  "color": "red",
                  "index": 14,
                  "text": "Degraded 🔥🥵"
                },
                "15": {
                  "color": "red",
                  "index": 15,
                  "text": "Degraded 🔥🥵"
                },
                "2": {
                  "color": "orange",
                  "index": 2,
                  "text": "Warning 🔥"
                },
                "3": {
                  "color": "red",
                  "index": 3,
                  "text": "Degraded 🔥"
                },
                "4": {
                  "color": "orange",
                  "index": 4,
                  "text": "Warning 🥵"
                },
                "5": {
                  "color": "orange",
                  "index": 5,
                  "text": "Warning 🔥🥵"
                },
                "6": {
                  "color": "orange",
                  "index": 6,
                  "text": "Warning 🔥🥵"
                },
                "7": {
                  "color": "red",
                  "index": 7,
                  "text": "Degraded 🔥🥵"
                },
                "8": {
                  "color": "orange",
                  "index": 8,
                  "text": "Warning 🥵"
                },
                "9": {
                  "color": "orange",
                  "index": 9,
                  "text": "Warning 🔥🥵"
                }
              },
              "type": "value"
            }
          ],
          "thresholds": {
            "mode": "absolute",
            "steps": [
              {
                "color": "black",
                "value": 0
              },
              {
                "color": "orange",
                "value": 1
              },
              {
                "color": "orange",
                "value": 2
              },
              {
                "color": "red",
                "value": 3
              },
              {
                "color": "orange",
                "value": 4
              },
              {
                "color": "orange",
                "value": 5
              },
              {
                "color": "orange",
                "value": 6
              },
              {
                "color": "red",
                "value": 7
              },
              {
                "color": "orange",
                "value": 8
              },
              {
                "color": "orange",
                "value": 9
              },
              {
                "color": "orange",
                "value": 10
              },
              {
                "color": "red",
                "value": 11
              },
              {
                "color": "red",
                "value": 12
              },
              {
                "color": "red",
                "value": 13
              },
              {
                "color": "red",
                "value": 14
              },
              {
                "color": "red",
                "value": 15
              }
            ]
          },
          "unit": "none"
        }
      },
      "gridPos": {
        "h": 6,
        "w": 6,
        "x": 0,
        "y": 0
      },
      "id": 2,
      "links": [

      ],
      "options": {
        "colorMode": "background",
        "graphMode": "none",
        "justifyMode": "auto",
        "orientation": "vertical",
        "reduceOptions": {
          "calcs": [
            "lastNotNull"
          ],
          "fields": "",
          "values": false
        },
        "textMode": "auto"
      },
      "pluginVersion": "7",
      "targets": [
        {
          "expr": "sum(\n  label_replace(\n    vector(0) and on() (gitlab_regional_sli_apdex:ratio_1h{component=\"$component\",environment=\"$environment\",monitor=\"global\",region=\"$region\",stage=\"$stage\",type=\"$type\"}),\n    \"period\", \"na\", \"\", \"\"\n  )\n  or\n  label_replace(\n    vector(1) and on () (gitlab_regional_sli_apdex:ratio_5m{component=\"$component\",environment=\"$environment\",monitor=\"global\",region=\"$region\",stage=\"$stage\",type=\"$type\"} < on(tier, type) group_left() (1 - (14.4 * (1 - slo:min:events:gitlab_service_apdex:ratio{component=\"$component\",monitor=\"global\",type=\"$type\"})))),\n    \"period\", \"5m\", \"\", \"\"\n  )\n  or\n  label_replace(\n    vector(2) and on () (gitlab_regional_sli_apdex:ratio_1h{component=\"$component\",environment=\"$environment\",monitor=\"global\",region=\"$region\",stage=\"$stage\",type=\"$type\"} < on(tier, type) group_left() (1 - (14.4 * (1 - slo:min:events:gitlab_service_apdex:ratio{component=\"$component\",monitor=\"global\",type=\"$type\"})))),\n    \"period\", \"1h\", \"\", \"\"\n  )\n  or\n  label_replace(\n    vector(4) and on () (gitlab_regional_sli_apdex:ratio_30m{component=\"$component\",environment=\"$environment\",monitor=\"global\",region=\"$region\",stage=\"$stage\",type=\"$type\"} < on(tier, type) group_left() (1 - (6 * (1 - slo:min:events:gitlab_service_apdex:ratio{component=\"$component\",monitor=\"global\",type=\"$type\"})))),\n    \"period\", \"30m\", \"\", \"\"\n  )\n  or\n  label_replace(\n    vector(8) and on () (gitlab_regional_sli_apdex:ratio_6h{component=\"$component\",environment=\"$environment\",monitor=\"global\",region=\"$region\",stage=\"$stage\",type=\"$type\"} < on(tier, type) group_left() (1 - (6 * (1 - slo:min:events:gitlab_service_apdex:ratio{component=\"$component\",monitor=\"global\",type=\"$type\"})))),\n    \"period\", \"6h\", \"\", \"\"\n  )\n)\n",
          "format": "time_series",
          "instant": true,
          "interval": "1m",
          "intervalFactor": 1,
          "legendFormat": "SLO Analysis | Latency/Apdex",
          "refId": "A"
        }
      ],
      "title": "",
      "transparent": false,
      "type": "stat"
    },
    {
      "datasource": "$PROMETHEUS_DS",
      "description": "Availability",
      "fieldConfig": {
        "defaults": {
          "decimals": 2,
          "links": [

          ],
          "mappings": [

          ],
          "max": 1,
          "min": 0,
          "thresholds": {
            "mode": "absolute",
            "steps": [
              {
                "color": "red",
                "value": 0
              },
              {
                "color": "light-red",
                "value": 0.95
              },
              {
                "color": "orange",
                "value": 0.99
              },
              {
                "color": "light-orange",
                "value": 0.995
              },
              {
                "color": "yellow",
                "value": 0.9994
              },
              {
                "color": "light-yellow",
                "value": 0.9995
              },
              {
                "color": "green",
                "value": 0.9998
              }
            ]
          },
          "unit": "percentunit"
        }
      },
      "gridPos": {
        "h": 6,
        "w": 6,
        "x": 6,
        "y": 0
      },
      "id": 3,
      "links": [

      ],
      "options": {
        "colorMode": "background",
        "graphMode": "none",
        "justifyMode": "auto",
        "orientation": "auto",
        "reduceOptions": {
          "calcs": [
            "last"
          ],
          "fields": "",
          "values": true
        },
        "textMode": "auto"
      },
      "pluginVersion": "7",
      "targets": [
        {
          "expr": "avg(slo:max:events:gitlab_service_errors:ratio{monitor=\"global\",type=\"$type\"}) by (type)",
          "format": "time_series",
          "instant": true,
          "interval": "1m",
          "intervalFactor": 1,
          "legendFormat": "{{ type }} service monitoring SLO",
          "refId": "A"
        }
      ],
      "title": "",
      "transparent": false,
      "type": "stat"
    },
    {
      "content": "The SLO for this service will determine the thresholds (indicated by the dotted lines)\nin the following graphs. Over time, we expect these SLOs to become stricter (more nines) by\nimproving the reliability of our service.\n\n**For more details of this technique, be sure to the Alerting on SLOs chapter of the\n[Google SRE Workbook](https://landing.google.com/sre/workbook/chapters/alerting-on-slos/)**\n",
      "datasource": null,
      "gridPos": {
        "h": 6,
        "w": 12,
        "x": 12,
        "y": 0
      },
      "id": 4,
      "mode": "markdown",
      "title": "Help",
      "type": "text"
    },
    {
      "aliasColors": {
      },
      "bars": false,
      "dashLength": 10,
      "dashes": false,
      "datasource": "$PROMETHEUS_DS",
      "decimals": 4,
      "description": "apdex burn rates: higher is better",
      "fill": 0,
      "fillGradient": 0,
      "gridPos": {
        "h": 10,
        "w": 18,
        "x": 0,
        "y": 100
      },
      "id": 965700560,
      "legend": {
        "alignAsTable": true,
        "avg": true,
        "current": true,
        "hideEmpty": true,
        "max": true,
        "min": true,
        "rightSide": false,
        "show": true,
        "sideWidth": null,
        "total": false,
        "values": true
      },
      "lines": true,
      "linewidth": 2,
      "links": [

      ],
      "nullPointMode": "null",
      "percentage": false,
      "pointradius": 5,
      "points": false,
      "renderer": "flot",
      "repeat": null,
      "seriesOverrides": [
        {
          "alias": "6h apdex burn rate",
          "color": "#5794F2",
          "fillBelowTo": "30m apdex burn rate",
          "linewidth": 4,
          "zindex": 0
        },
        {
          "alias": "1h apdex burn rate",
          "color": "#73BF69",
          "fillBelowTo": "5m apdex burn rate",
          "linewidth": 4,
          "zindex": 1
        },
        {
          "alias": "30m apdex burn rate",
          "color": "#5794F2",
          "linewidth": 2,
          "zindex": 2
        },
        {
          "alias": "5m apdex burn rate",
          "color": "#73BF69",
          "linewidth": 2,
          "zindex": 3
        },
        {
          "alias": "6h apdex burn threshold",
          "color": "#5794F2",
          "dashLength": 2,
          "dashes": true,
          "lines": true,
          "linewidth": 2,
          "spaceLength": 4,
          "zindex": -1
        },
        {
          "alias": "1h apdex burn threshold",
          "color": "#73BF69",
          "dashLength": 2,
          "dashes": true,
          "lines": true,
          "linewidth": 2,
          "spaceLength": 4,
          "zindex": -2
        }
      ],
      "spaceLength": 10,
      "stableId": "multiwindow-multiburnrate",
      "stack": false,
      "steppedLine": false,
      "targets": [
        {
          "expr": "clamp_min(clamp_max(gitlab_regional_sli_errors:ratio_1h{component=\"$component\",environment=\"$environment\",monitor=\"global\",region=\"$region\",stage=\"$stage\",type=\"$type\"}\n,1),0)\n",
          "format": "time_series",
          "interval": "1m",
          "intervalFactor": 1,
          "legendFormat": "1h error burn rate",
          "refId": "A"
        },
        {
          "expr": "gitlab_regional_sli_errors:ratio_5m{component=\"$component\",environment=\"$environment\",monitor=\"global\",region=\"$region\",stage=\"$stage\",type=\"$type\"}\n",
          "format": "time_series",
          "interval": "1m",
          "intervalFactor": 1,
          "legendFormat": "5m error burn rate",
          "refId": "B"
        },
        {
          "expr": "(14.4 * avg(slo:max:events:gitlab_service_errors:ratio{monitor=\"global\", type=\"$type\"})) unless (vector($proposed_slo) > 0)",
          "format": "time_series",
          "interval": "1m",
          "intervalFactor": 1,
          "legendFormat": "1h error burn threshold",
          "refId": "C"
        },
        {
          "expr": "14.4 * (1 - $proposed_slo)",
          "format": "time_series",
          "interval": "1m",
          "intervalFactor": 1,
          "legendFormat": "Proposed SLO @ 1h burn",
          "refId": "D"
        },
        {
          "expr": "gitlab_regional_sli_errors:ratio_6h{component=\"$component\",environment=\"$environment\",monitor=\"global\",region=\"$region\",stage=\"$stage\",type=\"$type\"}\n",
          "format": "time_series",
          "interval": "1m",
          "intervalFactor": 1,
          "legendFormat": "6h error burn rate",
          "refId": "E"
        },
        {
          "expr": "gitlab_regional_sli_errors:ratio_30m{component=\"$component\",environment=\"$environment\",monitor=\"global\",region=\"$region\",stage=\"$stage\",type=\"$type\"}\n",
          "format": "time_series",
          "interval": "1m",
          "intervalFactor": 1,
          "legendFormat": "30m error burn rate",
          "refId": "F"
        },
        {
          "expr": "(6 * avg(slo:max:events:gitlab_service_errors:ratio{monitor=\"global\", type=\"$type\"})) unless (vector($proposed_slo) > 0)",
          "format": "time_series",
          "interval": "1m",
          "intervalFactor": 1,
          "legendFormat": "6h error burn threshold",
          "refId": "G"
        },
        {
          "expr": "6 * (1 - $proposed_slo)",
          "format": "time_series",
          "interval": "1m",
          "intervalFactor": 1,
          "legendFormat": "Proposed SLO @ 6h burn",
          "refId": "H"
        }
      ],
      "thresholds": null,
      "timeFrom": null,
      "timeShift": null,
      "title": "Multi-window, multi-burn-rates",
      "tooltip": {
        "shared": true,
        "sort": 2,
        "value_type": "individual"
      },
      "type": "graph",
      "xaxis": {
        "buckets": null,
        "mode": "time",
        "name": null,
        "show": true,
        "values": [

        ]
      },
      "yaxes": [
        {
          "format": "percentunit",
          "label": "Percent",
          "logBase": 1,
          "max": null,
          "min": null,
          "show": true
        },
        {
          "format": "short",
          "label": null,
          "logBase": 1,
          "max": 1,
          "min": 0,
          "show": false
        }
      ]
    },
    {
      "content": "# Multi-window, multi-burn-rates\n\nThe alert will fire when both of the green solid series cross the green dotted threshold, or\nboth of the blue solid series cross the blue dotted threshold.\n",
      "datasource": null,
      "gridPos": {
        "h": 10,
        "w": 6,
        "x": 18,
        "y": 100
      },
      "id": 6,
      "mode": "markdown",
      "title": "Help",
      "type": "text"
    },
    {
      "aliasColors": {
      },
      "bars": false,
      "dashLength": 10,
      "dashes": false,
      "datasource": "$PROMETHEUS_DS",
      "decimals": 4,
      "description": "apdex burn rates: higher is better",
      "fill": 0,
      "fillGradient": 0,
      "gridPos": {
        "h": 10,
        "w": 18,
        "x": 0,
        "y": 110
      },
      "id": 7,
      "legend": {
        "alignAsTable": true,
        "avg": true,
        "current": true,
        "hideEmpty": true,
        "max": true,
        "min": true,
        "rightSide": false,
        "show": true,
        "sideWidth": null,
        "total": false,
        "values": true
      },
      "lines": true,
      "linewidth": 2,
      "links": [

      ],
      "nullPointMode": "null",
      "percentage": false,
      "pointradius": 5,
      "points": false,
      "renderer": "flot",
      "repeat": null,
      "seriesOverrides": [
        {
          "alias": "6h apdex burn rate",
          "color": "#5794F2",
          "fillBelowTo": "30m apdex burn rate",
          "linewidth": 4,
          "zindex": 0
        },
        {
          "alias": "1h apdex burn rate",
          "color": "#73BF69",
          "fillBelowTo": "5m apdex burn rate",
          "linewidth": 4,
          "zindex": 1
        },
        {
          "alias": "30m apdex burn rate",
          "color": "#5794F2",
          "linewidth": 2,
          "zindex": 2
        },
        {
          "alias": "5m apdex burn rate",
          "color": "#73BF69",
          "linewidth": 2,
          "zindex": 3
        },
        {
          "alias": "6h apdex burn threshold",
          "color": "#5794F2",
          "dashLength": 2,
          "dashes": true,
          "lines": true,
          "linewidth": 2,
          "spaceLength": 4,
          "zindex": -1
        },
        {
          "alias": "1h apdex burn threshold",
          "color": "#73BF69",
          "dashLength": 2,
          "dashes": true,
          "lines": true,
          "linewidth": 2,
          "spaceLength": 4,
          "zindex": -2
        }
      ],
      "spaceLength": 10,
      "stack": false,
      "steppedLine": false,
      "targets": [
        {
          "expr": "clamp_min(clamp_max(gitlab_regional_sli_errors:ratio_1h{component=\"$component\",environment=\"$environment\",monitor=\"global\",region=\"$region\",stage=\"$stage\",type=\"$type\"}\n,1),0)\n",
          "format": "time_series",
          "interval": "1m",
          "intervalFactor": 1,
          "legendFormat": "1h error burn rate",
          "refId": "A"
        },
        {
          "expr": "gitlab_regional_sli_errors:ratio_5m{component=\"$component\",environment=\"$environment\",monitor=\"global\",region=\"$region\",stage=\"$stage\",type=\"$type\"}\n",
          "format": "time_series",
          "interval": "1m",
          "intervalFactor": 1,
          "legendFormat": "5m error burn rate",
          "refId": "B"
        },
        {
          "expr": "(14.4 * avg(slo:max:events:gitlab_service_errors:ratio{monitor=\"global\", type=\"$type\"})) unless (vector($proposed_slo) > 0)",
          "format": "time_series",
          "interval": "1m",
          "intervalFactor": 1,
          "legendFormat": "1h error burn threshold",
          "refId": "C"
        },
        {
          "expr": "14.4 * (1 - $proposed_slo)",
          "format": "time_series",
          "interval": "1m",
          "intervalFactor": 1,
          "legendFormat": "Proposed SLO @ 1h burn",
          "refId": "D"
        }
      ],
      "thresholds": null,
      "timeFrom": null,
      "timeShift": null,
      "title": "Single window, 1h/5m burn-rates",
      "tooltip": {
        "shared": true,
        "sort": 2,
        "value_type": "individual"
      },
      "type": "graph",
      "xaxis": {
        "buckets": null,
        "mode": "time",
        "name": null,
        "show": true,
        "values": [

        ]
      },
      "yaxes": [
        {
          "format": "percentunit",
          "label": "Percent",
          "logBase": 1,
          "max": null,
          "min": null,
          "show": true
        },
        {
          "format": "short",
          "label": null,
          "logBase": 1,
          "max": 1,
          "min": 0,
          "show": false
        }
      ]
    },
    {
      "content": "# Single window, 1h/5m burn-rates\n\nRemoving the 6h/30m burn-rates, this shows the same data over the 1h/5m burn-rates.\n\nThe alert will fire when the solid lines cross the dotted threshold.\n",
      "datasource": null,
      "gridPos": {
        "h": 10,
        "w": 6,
        "x": 18,
        "y": 110
      },
      "id": 8,
      "mode": "markdown",
      "title": "Help",
      "type": "text"
    },
    {
      "aliasColors": {
      },
      "bars": false,
      "dashLength": 10,
      "dashes": false,
      "datasource": "$PROMETHEUS_DS",
      "decimals": 4,
      "description": "apdex burn rates: higher is better",
      "fill": 0,
      "fillGradient": 0,
      "gridPos": {
        "h": 10,
        "w": 18,
        "x": 0,
        "y": 120
      },
      "id": 9,
      "legend": {
        "alignAsTable": true,
        "avg": true,
        "current": true,
        "hideEmpty": true,
        "max": true,
        "min": true,
        "rightSide": false,
        "show": true,
        "sideWidth": null,
        "total": false,
        "values": true
      },
      "lines": true,
      "linewidth": 2,
      "links": [

      ],
      "nullPointMode": "null",
      "percentage": false,
      "pointradius": 5,
      "points": false,
      "renderer": "flot",
      "repeat": null,
      "seriesOverrides": [
        {
          "alias": "6h apdex burn rate",
          "color": "#5794F2",
          "fillBelowTo": "30m apdex burn rate",
          "linewidth": 4,
          "zindex": 0
        },
        {
          "alias": "1h apdex burn rate",
          "color": "#73BF69",
          "fillBelowTo": "5m apdex burn rate",
          "linewidth": 4,
          "zindex": 1
        },
        {
          "alias": "30m apdex burn rate",
          "color": "#5794F2",
          "linewidth": 2,
          "zindex": 2
        },
        {
          "alias": "5m apdex burn rate",
          "color": "#73BF69",
          "linewidth": 2,
          "zindex": 3
        },
        {
          "alias": "6h apdex burn threshold",
          "color": "#5794F2",
          "dashLength": 2,
          "dashes": true,
          "lines": true,
          "linewidth": 2,
          "spaceLength": 4,
          "zindex": -1
        },
        {
          "alias": "1h apdex burn threshold",
          "color": "#73BF69",
          "dashLength": 2,
          "dashes": true,
          "lines": true,
          "linewidth": 2,
          "spaceLength": 4,
          "zindex": -2
        }
      ],
      "spaceLength": 10,
      "stack": false,
      "steppedLine": false,
      "targets": [
        {
          "expr": "clamp_min(clamp_max(gitlab_regional_sli_errors:ratio_6h{component=\"$component\",environment=\"$environment\",monitor=\"global\",region=\"$region\",stage=\"$stage\",type=\"$type\"}\n,1),0)\n",
          "format": "time_series",
          "interval": "1m",
          "intervalFactor": 1,
          "legendFormat": "6h error burn rate",
          "refId": "A"
        },
        {
          "expr": "gitlab_regional_sli_errors:ratio_30m{component=\"$component\",environment=\"$environment\",monitor=\"global\",region=\"$region\",stage=\"$stage\",type=\"$type\"}\n",
          "format": "time_series",
          "interval": "1m",
          "intervalFactor": 1,
          "legendFormat": "30m error burn rate",
          "refId": "B"
        },
        {
          "expr": "(6 * avg(slo:max:events:gitlab_service_errors:ratio{monitor=\"global\", type=\"$type\"})) unless (vector($proposed_slo) > 0)",
          "format": "time_series",
          "interval": "1m",
          "intervalFactor": 1,
          "legendFormat": "6h error burn threshold",
          "refId": "C"
        },
        {
          "expr": "6 * (1 - $proposed_slo)",
          "format": "time_series",
          "interval": "1m",
          "intervalFactor": 1,
          "legendFormat": "Proposed SLO @ 6h burn",
          "refId": "D"
        }
      ],
      "thresholds": null,
      "timeFrom": null,
      "timeShift": null,
      "title": "Single window, 6h/30m burn-rates",
      "tooltip": {
        "shared": true,
        "sort": 2,
        "value_type": "individual"
      },
      "type": "graph",
      "xaxis": {
        "buckets": null,
        "mode": "time",
        "name": null,
        "show": true,
        "values": [

        ]
      },
      "yaxes": [
        {
          "format": "percentunit",
          "label": "Percent",
          "logBase": 1,
          "max": null,
          "min": null,
          "show": true
        },
        {
          "format": "short",
          "label": null,
          "logBase": 1,
          "max": 1,
          "min": 0,
          "show": false
        }
      ]
    },
    {
      "content": "# Single window, 6h/30m burn-rates\n\nRemoving the 1h/5m burn-rates, this shows the same data over the 6h/30m burn-rates.\n\nThe alert will fire when the solid lines cross the dotted threshold.\n",
      "datasource": null,
      "gridPos": {
        "h": 10,
        "w": 6,
        "x": 18,
        "y": 120
      },
      "id": 10,
      "mode": "markdown",
      "title": "Help",
      "type": "text"
    },
    {
      "aliasColors": {
      },
      "bars": false,
      "dashLength": 10,
      "dashes": false,
      "datasource": "$PROMETHEUS_DS",
      "decimals": 4,
      "description": "apdex burn rates: higher is better",
      "fill": 0,
      "fillGradient": 0,
      "gridPos": {
        "h": 10,
        "w": 18,
        "x": 0,
        "y": 130
      },
      "id": 11,
      "legend": {
        "alignAsTable": true,
        "avg": true,
        "current": true,
        "hideEmpty": true,
        "max": true,
        "min": true,
        "rightSide": false,
        "show": true,
        "sideWidth": null,
        "total": false,
        "values": true
      },
      "lines": true,
      "linewidth": 2,
      "links": [

      ],
      "nullPointMode": "null",
      "percentage": false,
      "pointradius": 5,
      "points": false,
      "renderer": "flot",
      "repeat": null,
      "seriesOverrides": [
        {
          "alias": "6h apdex burn rate",
          "color": "#5794F2",
          "fillBelowTo": "30m apdex burn rate",
          "linewidth": 4,
          "zindex": 0
        },
        {
          "alias": "1h apdex burn rate",
          "color": "#73BF69",
          "fillBelowTo": "5m apdex burn rate",
          "linewidth": 4,
          "zindex": 1
        },
        {
          "alias": "30m apdex burn rate",
          "color": "#5794F2",
          "linewidth": 2,
          "zindex": 2
        },
        {
          "alias": "5m apdex burn rate",
          "color": "#73BF69",
          "linewidth": 2,
          "zindex": 3
        },
        {
          "alias": "6h apdex burn threshold",
          "color": "#5794F2",
          "dashLength": 2,
          "dashes": true,
          "lines": true,
          "linewidth": 2,
          "spaceLength": 4,
          "zindex": -1
        },
        {
          "alias": "1h apdex burn threshold",
          "color": "#73BF69",
          "dashLength": 2,
          "dashes": true,
          "lines": true,
          "linewidth": 2,
          "spaceLength": 4,
          "zindex": -2
        }
      ],
      "spaceLength": 10,
      "stack": false,
      "steppedLine": false,
      "targets": [
        {
          "expr": "clamp_min(clamp_max(gitlab_regional_sli_errors:ratio_1h{component=\"$component\",environment=\"$environment\",monitor=\"global\",region=\"$region\",stage=\"$stage\",type=\"$type\"}\n,1),0)\n",
          "format": "time_series",
          "interval": "1m",
          "intervalFactor": 1,
          "legendFormat": "1h error burn rate",
          "refId": "A"
        },
        {
          "expr": "gitlab_regional_sli_errors:ratio_5m{component=\"$component\",environment=\"$environment\",monitor=\"global\",region=\"$region\",stage=\"$stage\",type=\"$type\"}\n",
          "format": "time_series",
          "interval": "1m",
          "intervalFactor": 1,
          "legendFormat": "5m error burn rate",
          "refId": "B"
        }
      ],
      "thresholds": null,
      "timeFrom": null,
      "timeShift": null,
      "title": "Single window, 1h/5m burn-rates, no thresholds",
      "tooltip": {
        "shared": true,
        "sort": 2,
        "value_type": "individual"
      },
      "type": "graph",
      "xaxis": {
        "buckets": null,
        "mode": "time",
        "name": null,
        "show": true,
        "values": [

        ]
      },
      "yaxes": [
        {
          "format": "percentunit",
          "label": "Percent",
          "logBase": 1,
          "max": null,
          "min": null,
          "show": true
        },
        {
          "format": "short",
          "label": null,
          "logBase": 1,
          "max": 1,
          "min": 0,
          "show": false
        }
      ]
    },
    {
      "content": "# Single window, 1h/5m burn-rates, no thresholds\n\nSince the threshold can be relatively high, removing it can help visualise the current values better.\n",
      "datasource": null,
      "gridPos": {
        "h": 10,
        "w": 6,
        "x": 18,
        "y": 130
      },
      "id": 12,
      "mode": "markdown",
      "title": "Help",
      "type": "text"
    },
    {
      "aliasColors": {
      },
      "bars": false,
      "dashLength": 10,
      "dashes": false,
      "datasource": "$PROMETHEUS_DS",
      "decimals": 4,
      "description": "apdex burn rates: higher is better",
      "fill": 0,
      "fillGradient": 0,
      "gridPos": {
        "h": 10,
        "w": 18,
        "x": 0,
        "y": 140
      },
      "id": 13,
      "legend": {
        "alignAsTable": true,
        "avg": true,
        "current": true,
        "hideEmpty": true,
        "max": true,
        "min": true,
        "rightSide": false,
        "show": true,
        "sideWidth": null,
        "total": false,
        "values": true
      },
      "lines": true,
      "linewidth": 2,
      "links": [

      ],
      "nullPointMode": "null",
      "percentage": false,
      "pointradius": 5,
      "points": false,
      "renderer": "flot",
      "repeat": null,
      "seriesOverrides": [
        {
          "alias": "6h apdex burn rate",
          "color": "#5794F2",
          "fillBelowTo": "30m apdex burn rate",
          "linewidth": 4,
          "zindex": 0
        },
        {
          "alias": "1h apdex burn rate",
          "color": "#73BF69",
          "fillBelowTo": "5m apdex burn rate",
          "linewidth": 4,
          "zindex": 1
        },
        {
          "alias": "30m apdex burn rate",
          "color": "#5794F2",
          "linewidth": 2,
          "zindex": 2
        },
        {
          "alias": "5m apdex burn rate",
          "color": "#73BF69",
          "linewidth": 2,
          "zindex": 3
        },
        {
          "alias": "6h apdex burn threshold",
          "color": "#5794F2",
          "dashLength": 2,
          "dashes": true,
          "lines": true,
          "linewidth": 2,
          "spaceLength": 4,
          "zindex": -1
        },
        {
          "alias": "1h apdex burn threshold",
          "color": "#73BF69",
          "dashLength": 2,
          "dashes": true,
          "lines": true,
          "linewidth": 2,
          "spaceLength": 4,
          "zindex": -2
        }
      ],
      "spaceLength": 10,
      "stack": false,
      "steppedLine": false,
      "targets": [
        {
          "expr": "clamp_min(clamp_max(gitlab_regional_sli_errors:ratio_6h{component=\"$component\",environment=\"$environment\",monitor=\"global\",region=\"$region\",stage=\"$stage\",type=\"$type\"}\n,1),0)\n",
          "format": "time_series",
          "interval": "1m",
          "intervalFactor": 1,
          "legendFormat": "6h error burn rate",
          "refId": "A"
        },
        {
          "expr": "gitlab_regional_sli_errors:ratio_30m{component=\"$component\",environment=\"$environment\",monitor=\"global\",region=\"$region\",stage=\"$stage\",type=\"$type\"}\n",
          "format": "time_series",
          "interval": "1m",
          "intervalFactor": 1,
          "legendFormat": "30m error burn rate",
          "refId": "B"
        }
      ],
      "thresholds": null,
      "timeFrom": null,
      "timeShift": null,
      "title": "Single window, 6h/30m burn-rates, no thresholds",
      "tooltip": {
        "shared": true,
        "sort": 2,
        "value_type": "individual"
      },
      "type": "graph",
      "xaxis": {
        "buckets": null,
        "mode": "time",
        "name": null,
        "show": true,
        "values": [

        ]
      },
      "yaxes": [
        {
          "format": "percentunit",
          "label": "Percent",
          "logBase": 1,
          "max": null,
          "min": null,
          "show": true
        },
        {
          "format": "short",
          "label": null,
          "logBase": 1,
          "max": 1,
          "min": 0,
          "show": false
        }
      ]
    },
    {
      "content": "# Single window, 6h/30m burn-rates, no thresholds\n\nSince the threshold can be relatively high, removing it can help visualise the current values better.\n",
      "datasource": null,
      "gridPos": {
        "h": 10,
        "w": 6,
        "x": 18,
        "y": 140
      },
      "id": 14,
      "mode": "markdown",
      "title": "Help",
      "type": "text"
    },
    {
      "content": "Made with ❤️ and [Grafonnet](https://github.com/grafana/grafonnet-lib). [Contribute to this dashboard on GitLab.com](https://gitlab.com/gitlab-com/runbooks/blob/master/dashboards)\n",
      "datasource": null,
      "gridPos": {
        "h": 2,
        "w": 24,
        "x": 0,
        "y": 110000
      },
      "id": 15,
      "mode": "markdown",
      "title": "Source",
      "type": "text"
    }
  ],
  "refresh": "",
  "rows": [

  ],
  "schemaVersion": 16,
  "style": "light",
  "tags": [
    "managed",
    "alerts",
    "alert-target",
    "general"
  ],
  "templating": {
    "list": [
      {
        "current": {
          "text": "Global",
          "value": "Global"
        },
        "hide": 0,
        "label": null,
        "name": "PROMETHEUS_DS",
        "options": [

        ],
        "query": "prometheus",
        "refresh": 1,
        "regex": "",
        "type": "datasource"
      },
      {
        "allValue": null,
        "current": {
          "text": "gprd",
          "value": "gprd"
        },
        "datasource": "$PROMETHEUS_DS",
        "hide": 0,
        "includeAll": false,
        "label": null,
        "multi": false,
        "name": "environment",
        "options": [

        ],
        "query": "label_values(gitlab_service_ops:rate, environment)",
        "refresh": 1,
        "regex": "",
        "sort": 1,
        "tagValuesQuery": "",
        "tags": [

        ],
        "tagsQuery": "",
        "type": "query",
        "useTags": false
      },
      {
        "allValue": null,
        "current": {
        },
        "datasource": "$PROMETHEUS_DS",
        "hide": 0,
        "includeAll": false,
        "label": null,
        "multi": false,
        "name": "environment",
        "options": [

        ],
        "query": "label_values(gitlab_regional_sli_errors:ratio_1h{monitor=\"global\"}, environment)",
        "refresh": 2,
        "regex": "",
        "sort": 1,
        "tagValuesQuery": "",
        "tags": [

        ],
        "tagsQuery": "",
        "type": "query",
        "useTags": false
      },
      {
        "allValue": null,
        "current": {
        },
        "datasource": "$PROMETHEUS_DS",
        "hide": 0,
        "includeAll": false,
        "label": null,
        "multi": false,
        "name": "type",
        "options": [

        ],
        "query": "label_values(gitlab_regional_sli_errors:ratio_1h{environment=\"$environment\",monitor=\"global\"}, type)",
        "refresh": 2,
        "regex": "",
        "sort": 1,
        "tagValuesQuery": "",
        "tags": [

        ],
        "tagsQuery": "",
        "type": "query",
        "useTags": false
      },
      {
        "allValue": null,
        "current": {
        },
        "datasource": "$PROMETHEUS_DS",
        "hide": 0,
        "includeAll": false,
        "label": null,
        "multi": false,
        "name": "stage",
        "options": [

        ],
        "query": "label_values(gitlab_regional_sli_errors:ratio_1h{environment=\"$environment\",monitor=\"global\",type=\"$type\"}, stage)",
        "refresh": 2,
        "regex": "",
        "sort": 1,
        "tagValuesQuery": "",
        "tags": [

        ],
        "tagsQuery": "",
        "type": "query",
        "useTags": false
      },
      {
        "allValue": null,
        "current": {
        },
        "datasource": "$PROMETHEUS_DS",
        "hide": 0,
        "includeAll": false,
        "label": null,
        "multi": false,
        "name": "region",
        "options": [

        ],
        "query": "label_values(gitlab_regional_sli_errors:ratio_1h{environment=\"$environment\",monitor=\"global\",stage=\"$stage\",type=\"$type\"}, region)",
        "refresh": 2,
        "regex": "",
        "sort": 1,
        "tagValuesQuery": "",
        "tags": [

        ],
        "tagsQuery": "",
        "type": "query",
        "useTags": false
      },
      {
        "allValue": null,
        "current": {
        },
        "datasource": "$PROMETHEUS_DS",
        "hide": 0,
        "includeAll": false,
        "label": null,
        "multi": false,
        "name": "component",
        "options": [

        ],
        "query": "label_values(gitlab_regional_sli_errors:ratio_1h{environment=\"$environment\",monitor=\"global\",region=\"$region\",stage=\"$stage\",type=\"$type\"}, component)",
        "refresh": 2,
        "regex": "",
        "sort": 1,
        "tagValuesQuery": "",
        "tags": [

        ],
        "tagsQuery": "",
        "type": "query",
        "useTags": false
      },
      {
        "allValue": null,
        "current": {
          "text": "NaN",
          "value": "NaN"
        },
        "hide": 0,
        "includeAll": false,
        "label": "",
        "multi": false,
        "name": "proposed_slo",
        "options": [
          {
            "text": "NaN",
            "value": "NaN"
          },
          {
            "text": "0.9",
            "value": "0.9"
          },
          {
            "text": "0.95",
            "value": "0.95"
          },
          {
            "text": "0.99",
            "value": "0.99"
          },
          {
            "text": "0.995",
            "value": "0.995"
          },
          {
            "text": "0.999",
            "value": "0.999"
          },
          {
            "text": "0.9995",
            "value": "0.9995"
          },
          {
            "text": "0.9999",
            "value": "0.9999"
          }
        ],
        "query": "NaN,0.9,0.95,0.99,0.995,0.999,0.9995,0.9999",
        "refresh": 0,
        "type": "custom"
      }
    ]
  },
  "time": {
    "from": "now-6h/m",
    "to": "now/m"
  },
  "timepicker": {
    "refresh_intervals": [
      "1m",
      "5m",
      "10m",
      "15m",
      "30m"
    ],
    "time_options": [
      "5m",
      "15m",
      "1h",
      "6h",
      "12h",
      "24h",
      "2d",
      "7d",
      "30d"
    ]
  },
  "timezone": "utc",
  "title": "alerts: Regional SLI Metrics Error SLO Analysis",
  "uid": "alerts-regional_component_slo_error",
  "version": 3149
}