{
  "__inputs": [

  ],
  "__requires": [

  ],
  "annotations": {
    "list": [
      {
        "builtIn": 1,
        "datasource": "-- Grafana --",
        "enable": true,
        "hide": false,
        "iconColor": "#96D98D",
        "name": "deploy",
        "showIn": 0,
        "tags": [
          "deploy",
          "$environment"
        ],
        "type": "tags"
      },
      {
        "builtIn": 1,
        "datasource": "-- Grafana --",
        "enable": false,
        "hide": false,
        "iconColor": "#FFEE52",
        "name": "canary-deploy",
        "showIn": 0,
        "tags": [
          "deploy",
          "${environment}-cny"
        ],
        "type": "tags"
      },
      {
        "builtIn": 1,
        "datasource": "-- Grafana --",
        "enable": false,
        "hide": false,
        "iconColor": "#CA95E5",
        "name": "feature-flags",
        "showIn": 0,
        "tags": [
          "feature-flag",
          "${environment}"
        ],
        "type": "tags"
      }
    ]
  },
  "description": "Uploaded by https://gitlab.com/gitlab-com/runbooks/-/jobs/5761247267 at Fri Dec 15 13:25:19 UTC 2023",
  "editable": false,
  "gnetId": null,
  "graphTooltip": 1,
  "hideControls": false,
  "id": null,
  "links": [

  ],
  "panels": [
    {
      "content": "### [Error budget](https://about.gitlab.com/handbook/engineering/error-budgets/)\n\nThese error budget panels show an aggregate of SLIs across all components.\nHowever, not all components have been implemented yet.\n\nThe [handbook](https://about.gitlab.com/handbook/engineering/error-budgets/)\nexplains how these budgets are used.\n\nRead more about how the error budgets are calculated in the\n[stage group dashboard documentation](https://docs.gitlab.com/ee/development/stage_group_dashboards.html#error-budget).\n\nThe error budget is compared to our SLO of 99.95% and is always in\na range of 28 days from the selected end date in Grafana.\n\n### Availability\n\nThe availability shows the percentage of operations labeled with one of the\ncategories owned by modelops with satisfactory completion.\n\n### Budget remaining\n\nThe error budget in minutes is calculated based on the 99.95%.\nThere are 40320 minutes in 28 days, we allow 0.05% of failures, which\nmeans the budget in minutes is (1 - 0.9995) * $__range_s / 60.0 minutes.\n\nThe budget remaining shows how many minutes have not been spent in the\npast 28 days.\n\n### Minutes spent\n\nThis shows the total minutes spent over the past 28 days.\n\nFor example, if there were 403200 (28 * 24 * 60) operations in 28 days.\nThis would be 1 every minute. If 10 of those were unsatisfactory, that\nwould mean 10 minutes of the budget were spent.\n",
      "datasource": null,
      "gridPos": {
        "h": 6,
        "w": 24,
        "x": 0,
        "y": 300
      },
      "id": 2,
      "mode": "markdown",
      "title": "Info",
      "type": "text"
    },
    {
      "collapse": false,
      "collapsed": false,
      "gridPos": {
        "h": 1,
        "w": 24,
        "x": 0,
        "y": 100
      },
      "id": 3,
      "panels": [

      ],
      "repeat": null,
      "repeatIteration": null,
      "repeatRowId": null,
      "showTitle": true,
      "title": "DataOps's Error Budgets (From ${__from:date:YYYY-MM-DD HHːmm} to ${__to:date:YYYY-MM-DD HHːmm})",
      "titleSize": "h6",
      "type": "row"
    },
    {
      "description": "",
      "fieldConfig": {
        "defaults": {
          "decimals": 2,
          "displayName": "",
          "thresholds": {
            "mode": "absolute",
            "steps": [
              {
                "color": "red",
                "value": 0
              },
              {
                "color": "green",
                "value": 0.9995
              }
            ]
          },
          "unit": "percentunit"
        }
      },
      "gridPos": {
        "h": 4,
        "w": 6,
        "x": 0,
        "y": 100
      },
      "id": 4,
      "options": {
        "colorMode": "background",
        "graphMode": "none",
        "justifyMode": "auto",
        "orientation": "vertical",
        "reduceOptions": {
          "calcs": [
            "lastNotNull"
          ],
          "fields": "",
          "values": false
        },
        "textMode": "auto"
      },
      "pluginVersion": "7",
      "targets": [
        {
          "expr": "clamp_max(\n  sum by ()(\n    sum by (stage_group,component) (\n      label_replace(\n        sum_over_time(\n          gitlab:component:stage_group:execution:apdex:success:rate_1h{environment=\"$environment\",monitor=\"global\",stage=\"$stage\",stage_group=\"dataops\"}[$__range]\n        ), 'sli_kind', 'apdex', '', ''\n      )\n      or\n      label_replace(\n        sum_over_time(\n          gitlab:component:stage_group:execution:ops:rate_1h{environment=\"$environment\",monitor=\"global\",stage=\"$stage\",stage_group=\"dataops\"}[$__range]\n        )\n        -\n        sum_over_time(\n          gitlab:component:stage_group:execution:error:rate_1h{environment=\"$environment\",monitor=\"global\",stage=\"$stage\",stage_group=\"dataops\"}[$__range]\n        ), 'sli_kind', 'error', '', ''\n      )\n    ) unless on (stage_group,component) gitlab:ignored_component:stage_group\n  )\n  /\n  sum by ()(\n    sum by (stage_group,component) (\n      label_replace(\n        sum_over_time(\n          gitlab:component:stage_group:execution:apdex:weight:score_1h{environment=\"$environment\",monitor=\"global\",stage=\"$stage\",stage_group=\"dataops\"}[$__range]\n        ),\n        'sli_kind', 'apdex', '', ''\n      )\n      or\n      label_replace(\n        sum_over_time(\n          gitlab:component:stage_group:execution:ops:rate_1h{environment=\"$environment\",monitor=\"global\",stage=\"$stage\",stage_group=\"dataops\"}[$__range]\n        )\n        and sum_over_time(gitlab:component:stage_group:execution:error:rate_1h{environment=\"$environment\",monitor=\"global\",stage=\"$stage\",stage_group=\"dataops\"}[$__range]),\n        'sli_kind', 'error', '', ''\n      )\n    ) unless on (stage_group,component) gitlab:ignored_component:stage_group\n  ),\n1)\n",
          "format": "time_series",
          "instant": true,
          "interval": "1m",
          "intervalFactor": 1,
          "legendFormat": "%",
          "refId": "A"
        }
      ],
      "title": "Availability",
      "transparent": false,
      "type": "stat"
    },
    {
      "description": "",
      "fieldConfig": {
        "defaults": {
          "decimals": "2",
          "displayName": "",
          "mappings": [
            {
              "id": 0,
              "options": {
                "from": 0,
                "result": {
                  "color": "red",
                  "index": 0,
                  "text": "🥵 Unhealthy"
                },
                "to": 0.9995
              },
              "type": "range"
            },
            {
              "id": 1,
              "options": {
                "from": 0.9995,
                "result": {
                  "color": "green",
                  "index": 1,
                  "text": "🥳 Healthy"
                },
                "to": 1
              },
              "type": "range"
            }
          ],
          "thresholds": {
            "mode": "absolute",
            "steps": [
              {
                "color": "red",
                "value": 0
              },
              {
                "color": "green",
                "value": 0.9995
              }
            ]
          },
          "unit": "none"
        }
      },
      "gridPos": {
        "h": 1.5,
        "w": 6,
        "x": 0,
        "y": 104
      },
      "id": 5,
      "options": {
        "colorMode": "background",
        "graphMode": "none",
        "justifyMode": "auto",
        "orientation": "vertical",
        "reduceOptions": {
          "calcs": [
            "lastNotNull"
          ],
          "fields": "",
          "values": false
        },
        "textMode": "value"
      },
      "pluginVersion": "7",
      "targets": [
        {
          "expr": "clamp_max(\n  sum by ()(\n    sum by (stage_group,component) (\n      label_replace(\n        sum_over_time(\n          gitlab:component:stage_group:execution:apdex:success:rate_1h{environment=\"$environment\",monitor=\"global\",stage=\"$stage\",stage_group=\"dataops\"}[$__range]\n        ), 'sli_kind', 'apdex', '', ''\n      )\n      or\n      label_replace(\n        sum_over_time(\n          gitlab:component:stage_group:execution:ops:rate_1h{environment=\"$environment\",monitor=\"global\",stage=\"$stage\",stage_group=\"dataops\"}[$__range]\n        )\n        -\n        sum_over_time(\n          gitlab:component:stage_group:execution:error:rate_1h{environment=\"$environment\",monitor=\"global\",stage=\"$stage\",stage_group=\"dataops\"}[$__range]\n        ), 'sli_kind', 'error', '', ''\n      )\n    ) unless on (stage_group,component) gitlab:ignored_component:stage_group\n  )\n  /\n  sum by ()(\n    sum by (stage_group,component) (\n      label_replace(\n        sum_over_time(\n          gitlab:component:stage_group:execution:apdex:weight:score_1h{environment=\"$environment\",monitor=\"global\",stage=\"$stage\",stage_group=\"dataops\"}[$__range]\n        ),\n        'sli_kind', 'apdex', '', ''\n      )\n      or\n      label_replace(\n        sum_over_time(\n          gitlab:component:stage_group:execution:ops:rate_1h{environment=\"$environment\",monitor=\"global\",stage=\"$stage\",stage_group=\"dataops\"}[$__range]\n        )\n        and sum_over_time(gitlab:component:stage_group:execution:error:rate_1h{environment=\"$environment\",monitor=\"global\",stage=\"$stage\",stage_group=\"dataops\"}[$__range]),\n        'sli_kind', 'error', '', ''\n      )\n    ) unless on (stage_group,component) gitlab:ignored_component:stage_group\n  ),\n1)\n",
          "format": "time_series",
          "instant": true,
          "interval": "1m",
          "intervalFactor": 1,
          "legendFormat": "",
          "refId": "A"
        }
      ],
      "title": "",
      "transparent": false,
      "type": "stat"
    },
    {
      "description": "",
      "fieldConfig": {
        "defaults": {
          "decimals": "2",
          "displayName": "Target:",
          "thresholds": {
            "mode": "absolute",
            "steps": [
              {
                "color": "gray"
              }
            ]
          },
          "unit": "percent"
        }
      },
      "gridPos": {
        "h": 1.5,
        "w": 6,
        "x": 0,
        "y": 105.5
      },
      "id": 6,
      "options": {
        "colorMode": "background",
        "graphMode": "none",
        "justifyMode": "auto",
        "orientation": "vertical",
        "reduceOptions": {
          "calcs": [
            "lastNotNull"
          ],
          "fields": "",
          "values": false
        },
        "textMode": "auto"
      },
      "pluginVersion": "7",
      "targets": [
        {
          "expr": "0.9995 * 100.0",
          "format": "time_series",
          "instant": true,
          "interval": "1m",
          "intervalFactor": 1,
          "legendFormat": "",
          "refId": "A"
        }
      ],
      "title": "",
      "transparent": false,
      "type": "stat"
    },
    {
      "description": "",
      "fieldConfig": {
        "defaults": {
          "decimals": 0,
          "displayName": "",
          "thresholds": {
            "mode": "absolute",
            "steps": [
              {
                "color": "red",
                "value": -315360000
              },
              {
                "color": "green",
                "value": 0
              }
            ]
          },
          "unit": "s"
        }
      },
      "gridPos": {
        "h": 4,
        "w": 6,
        "x": 6,
        "y": 100
      },
      "id": 7,
      "options": {
        "colorMode": "background",
        "graphMode": "none",
        "justifyMode": "auto",
        "orientation": "vertical",
        "reduceOptions": {
          "calcs": [
            "lastNotNull"
          ],
          "fields": "",
          "values": false
        },
        "textMode": "auto"
      },
      "pluginVersion": "7",
      "targets": [
        {
          "expr": "# The number of seconds allowed to be spent in $__range\n(1 - 0.9995) * $__range_s\n-\n(\n  (\n     1 - clamp_max(\n  sum by ()(\n    sum by (stage_group,component) (\n      label_replace(\n        sum_over_time(\n          gitlab:component:stage_group:execution:apdex:success:rate_1h{environment=\"$environment\",monitor=\"global\",stage=\"$stage\",stage_group=\"dataops\"}[$__range]\n        ), 'sli_kind', 'apdex', '', ''\n      )\n      or\n      label_replace(\n        sum_over_time(\n          gitlab:component:stage_group:execution:ops:rate_1h{environment=\"$environment\",monitor=\"global\",stage=\"$stage\",stage_group=\"dataops\"}[$__range]\n        )\n        -\n        sum_over_time(\n          gitlab:component:stage_group:execution:error:rate_1h{environment=\"$environment\",monitor=\"global\",stage=\"$stage\",stage_group=\"dataops\"}[$__range]\n        ), 'sli_kind', 'error', '', ''\n      )\n    ) unless on (stage_group,component) gitlab:ignored_component:stage_group\n  )\n  /\n  sum by ()(\n    sum by (stage_group,component) (\n      label_replace(\n        sum_over_time(\n          gitlab:component:stage_group:execution:apdex:weight:score_1h{environment=\"$environment\",monitor=\"global\",stage=\"$stage\",stage_group=\"dataops\"}[$__range]\n        ),\n        'sli_kind', 'apdex', '', ''\n      )\n      or\n      label_replace(\n        sum_over_time(\n          gitlab:component:stage_group:execution:ops:rate_1h{environment=\"$environment\",monitor=\"global\",stage=\"$stage\",stage_group=\"dataops\"}[$__range]\n        )\n        and sum_over_time(gitlab:component:stage_group:execution:error:rate_1h{environment=\"$environment\",monitor=\"global\",stage=\"$stage\",stage_group=\"dataops\"}[$__range]),\n        'sli_kind', 'error', '', ''\n      )\n    ) unless on (stage_group,component) gitlab:ignored_component:stage_group\n  ),\n1)\n\n  ) * $__range_s\n)\n\n",
          "format": "time_series",
          "instant": true,
          "interval": "1m",
          "intervalFactor": 1,
          "legendFormat": "",
          "refId": "A"
        }
      ],
      "title": "Budget remaining",
      "transparent": false,
      "type": "stat"
    },
    {
      "description": "",
      "fieldConfig": {
        "defaults": {
          "decimals": "2",
          "displayName": "",
          "mappings": [
            {
              "id": 0,
              "options": {
                "from": 0,
                "result": {
                  "color": "red",
                  "index": 0,
                  "text": "🥵 Unhealthy"
                },
                "to": 0.9995
              },
              "type": "range"
            },
            {
              "id": 1,
              "options": {
                "from": 0.9995,
                "result": {
                  "color": "green",
                  "index": 1,
                  "text": "🥳 Healthy"
                },
                "to": 1
              },
              "type": "range"
            }
          ],
          "thresholds": {
            "mode": "absolute",
            "steps": [
              {
                "color": "red",
                "value": 0
              },
              {
                "color": "green",
                "value": 0.9995
              }
            ]
          },
          "unit": "none"
        }
      },
      "gridPos": {
        "h": 1.5,
        "w": 6,
        "x": 6,
        "y": 104
      },
      "id": 8,
      "options": {
        "colorMode": "background",
        "graphMode": "none",
        "justifyMode": "auto",
        "orientation": "vertical",
        "reduceOptions": {
          "calcs": [
            "lastNotNull"
          ],
          "fields": "",
          "values": false
        },
        "textMode": "value"
      },
      "pluginVersion": "7",
      "targets": [
        {
          "expr": "clamp_max(\n  sum by ()(\n    sum by (stage_group,component) (\n      label_replace(\n        sum_over_time(\n          gitlab:component:stage_group:execution:apdex:success:rate_1h{environment=\"$environment\",monitor=\"global\",stage=\"$stage\",stage_group=\"dataops\"}[$__range]\n        ), 'sli_kind', 'apdex', '', ''\n      )\n      or\n      label_replace(\n        sum_over_time(\n          gitlab:component:stage_group:execution:ops:rate_1h{environment=\"$environment\",monitor=\"global\",stage=\"$stage\",stage_group=\"dataops\"}[$__range]\n        )\n        -\n        sum_over_time(\n          gitlab:component:stage_group:execution:error:rate_1h{environment=\"$environment\",monitor=\"global\",stage=\"$stage\",stage_group=\"dataops\"}[$__range]\n        ), 'sli_kind', 'error', '', ''\n      )\n    ) unless on (stage_group,component) gitlab:ignored_component:stage_group\n  )\n  /\n  sum by ()(\n    sum by (stage_group,component) (\n      label_replace(\n        sum_over_time(\n          gitlab:component:stage_group:execution:apdex:weight:score_1h{environment=\"$environment\",monitor=\"global\",stage=\"$stage\",stage_group=\"dataops\"}[$__range]\n        ),\n        'sli_kind', 'apdex', '', ''\n      )\n      or\n      label_replace(\n        sum_over_time(\n          gitlab:component:stage_group:execution:ops:rate_1h{environment=\"$environment\",monitor=\"global\",stage=\"$stage\",stage_group=\"dataops\"}[$__range]\n        )\n        and sum_over_time(gitlab:component:stage_group:execution:error:rate_1h{environment=\"$environment\",monitor=\"global\",stage=\"$stage\",stage_group=\"dataops\"}[$__range]),\n        'sli_kind', 'error', '', ''\n      )\n    ) unless on (stage_group,component) gitlab:ignored_component:stage_group\n  ),\n1)\n",
          "format": "time_series",
          "instant": true,
          "interval": "1m",
          "intervalFactor": 1,
          "legendFormat": "",
          "refId": "A"
        }
      ],
      "title": "",
      "transparent": false,
      "type": "stat"
    },
    {
      "description": "",
      "fieldConfig": {
        "defaults": {
          "decimals": 0,
          "displayName": "Budget:",
          "thresholds": {
            "mode": "absolute",
            "steps": [
              {
                "color": "gray"
              }
            ]
          },
          "unit": "s"
        }
      },
      "gridPos": {
        "h": 1.5,
        "w": 6,
        "x": 6,
        "y": 105.5
      },
      "id": 9,
      "options": {
        "colorMode": "background",
        "graphMode": "none",
        "justifyMode": "auto",
        "orientation": "vertical",
        "reduceOptions": {
          "calcs": [
            "lastNotNull"
          ],
          "fields": "",
          "values": false
        },
        "textMode": "auto"
      },
      "pluginVersion": "7",
      "targets": [
        {
          "expr": "# The number of seconds allowed to be spent in $__range\n(1 - 0.9995) * $__range_s\n",
          "format": "time_series",
          "instant": true,
          "interval": "1m",
          "intervalFactor": 1,
          "legendFormat": "",
          "refId": "A"
        }
      ],
      "title": "",
      "transparent": false,
      "type": "stat"
    },
    {
      "description": "",
      "fieldConfig": {
        "defaults": {
          "decimals": 0,
          "displayName": "",
          "thresholds": {
            "mode": "absolute"
          },
          "unit": "s"
        }
      },
      "gridPos": {
        "h": 4,
        "w": 6,
        "x": 12,
        "y": 100
      },
      "id": 10,
      "options": {
        "colorMode": "background",
        "graphMode": "none",
        "justifyMode": "auto",
        "orientation": "vertical",
        "reduceOptions": {
          "calcs": [
            "lastNotNull"
          ],
          "fields": "",
          "values": false
        },
        "textMode": "auto"
      },
      "pluginVersion": "7",
      "targets": [
        {
          "expr": "(\n  (\n     1 - clamp_max(\n  sum by ()(\n    sum by (stage_group,component) (\n      label_replace(\n        sum_over_time(\n          gitlab:component:stage_group:execution:apdex:success:rate_1h{environment=\"$environment\",monitor=\"global\",stage=\"$stage\",stage_group=\"dataops\"}[$__range]\n        ), 'sli_kind', 'apdex', '', ''\n      )\n      or\n      label_replace(\n        sum_over_time(\n          gitlab:component:stage_group:execution:ops:rate_1h{environment=\"$environment\",monitor=\"global\",stage=\"$stage\",stage_group=\"dataops\"}[$__range]\n        )\n        -\n        sum_over_time(\n          gitlab:component:stage_group:execution:error:rate_1h{environment=\"$environment\",monitor=\"global\",stage=\"$stage\",stage_group=\"dataops\"}[$__range]\n        ), 'sli_kind', 'error', '', ''\n      )\n    ) unless on (stage_group,component) gitlab:ignored_component:stage_group\n  )\n  /\n  sum by ()(\n    sum by (stage_group,component) (\n      label_replace(\n        sum_over_time(\n          gitlab:component:stage_group:execution:apdex:weight:score_1h{environment=\"$environment\",monitor=\"global\",stage=\"$stage\",stage_group=\"dataops\"}[$__range]\n        ),\n        'sli_kind', 'apdex', '', ''\n      )\n      or\n      label_replace(\n        sum_over_time(\n          gitlab:component:stage_group:execution:ops:rate_1h{environment=\"$environment\",monitor=\"global\",stage=\"$stage\",stage_group=\"dataops\"}[$__range]\n        )\n        and sum_over_time(gitlab:component:stage_group:execution:error:rate_1h{environment=\"$environment\",monitor=\"global\",stage=\"$stage\",stage_group=\"dataops\"}[$__range]),\n        'sli_kind', 'error', '', ''\n      )\n    ) unless on (stage_group,component) gitlab:ignored_component:stage_group\n  ),\n1)\n\n  ) * $__range_s\n)\n",
          "format": "time_series",
          "instant": true,
          "interval": "1m",
          "intervalFactor": 1,
          "legendFormat": "",
          "refId": "A"
        },
        {
          "expr": "# The number of seconds allowed to be spent in $__range\n(1 - 0.9995) * $__range_s\n",
          "format": "time_series",
          "interval": "1m",
          "intervalFactor": 1,
          "legendFormat": "budget",
          "refId": "B"
        }
      ],
      "title": "Budget spent",
      "transformations": [
        {
          "id": "configFromData",
          "options": {
            "configRefId": "B",
            "mappings": [
              {
                "fieldName": "budget",
                "handlerKey": "threshold1"
              }
            ]
          }
        }
      ],
      "transparent": false,
      "type": "stat"
    },
    {
      "description": "",
      "fieldConfig": {
        "defaults": {
          "decimals": "2",
          "displayName": "",
          "mappings": [
            {
              "id": 0,
              "options": {
                "from": 0,
                "result": {
                  "color": "red",
                  "index": 0,
                  "text": "🥵 Unhealthy"
                },
                "to": 0.9995
              },
              "type": "range"
            },
            {
              "id": 1,
              "options": {
                "from": 0.9995,
                "result": {
                  "color": "green",
                  "index": 1,
                  "text": "🥳 Healthy"
                },
                "to": 1
              },
              "type": "range"
            }
          ],
          "thresholds": {
            "mode": "absolute",
            "steps": [
              {
                "color": "red",
                "value": 0
              },
              {
                "color": "green",
                "value": 0.9995
              }
            ]
          },
          "unit": "none"
        }
      },
      "gridPos": {
        "h": 1.5,
        "w": 6,
        "x": 12,
        "y": 104
      },
      "id": 11,
      "options": {
        "colorMode": "background",
        "graphMode": "none",
        "justifyMode": "auto",
        "orientation": "vertical",
        "reduceOptions": {
          "calcs": [
            "lastNotNull"
          ],
          "fields": "",
          "values": false
        },
        "textMode": "value"
      },
      "pluginVersion": "7",
      "targets": [
        {
          "expr": "clamp_max(\n  sum by ()(\n    sum by (stage_group,component) (\n      label_replace(\n        sum_over_time(\n          gitlab:component:stage_group:execution:apdex:success:rate_1h{environment=\"$environment\",monitor=\"global\",stage=\"$stage\",stage_group=\"dataops\"}[$__range]\n        ), 'sli_kind', 'apdex', '', ''\n      )\n      or\n      label_replace(\n        sum_over_time(\n          gitlab:component:stage_group:execution:ops:rate_1h{environment=\"$environment\",monitor=\"global\",stage=\"$stage\",stage_group=\"dataops\"}[$__range]\n        )\n        -\n        sum_over_time(\n          gitlab:component:stage_group:execution:error:rate_1h{environment=\"$environment\",monitor=\"global\",stage=\"$stage\",stage_group=\"dataops\"}[$__range]\n        ), 'sli_kind', 'error', '', ''\n      )\n    ) unless on (stage_group,component) gitlab:ignored_component:stage_group\n  )\n  /\n  sum by ()(\n    sum by (stage_group,component) (\n      label_replace(\n        sum_over_time(\n          gitlab:component:stage_group:execution:apdex:weight:score_1h{environment=\"$environment\",monitor=\"global\",stage=\"$stage\",stage_group=\"dataops\"}[$__range]\n        ),\n        'sli_kind', 'apdex', '', ''\n      )\n      or\n      label_replace(\n        sum_over_time(\n          gitlab:component:stage_group:execution:ops:rate_1h{environment=\"$environment\",monitor=\"global\",stage=\"$stage\",stage_group=\"dataops\"}[$__range]\n        )\n        and sum_over_time(gitlab:component:stage_group:execution:error:rate_1h{environment=\"$environment\",monitor=\"global\",stage=\"$stage\",stage_group=\"dataops\"}[$__range]),\n        'sli_kind', 'error', '', ''\n      )\n    ) unless on (stage_group,component) gitlab:ignored_component:stage_group\n  ),\n1)\n",
          "format": "time_series",
          "instant": true,
          "interval": "1m",
          "intervalFactor": 1,
          "legendFormat": "",
          "refId": "A"
        }
      ],
      "title": "",
      "transparent": false,
      "type": "stat"
    },
    {
      "description": "",
      "fieldConfig": {
        "defaults": {
          "decimals": 0,
          "displayName": "Budget:",
          "thresholds": {
            "mode": "absolute",
            "steps": [
              {
                "color": "gray"
              }
            ]
          },
          "unit": "s"
        }
      },
      "gridPos": {
        "h": 1.5,
        "w": 6,
        "x": 12,
        "y": 105.5
      },
      "id": 12,
      "options": {
        "colorMode": "background",
        "graphMode": "none",
        "justifyMode": "auto",
        "orientation": "vertical",
        "reduceOptions": {
          "calcs": [
            "lastNotNull"
          ],
          "fields": "",
          "values": false
        },
        "textMode": "auto"
      },
      "pluginVersion": "7",
      "targets": [
        {
          "expr": "# The number of seconds allowed to be spent in $__range\n(1 - 0.9995) * $__range_s\n",
          "format": "time_series",
          "instant": true,
          "interval": "1m",
          "intervalFactor": 1,
          "legendFormat": "",
          "refId": "A"
        }
      ],
      "title": "",
      "transparent": false,
      "type": "stat"
    },
    {
      "content": "- [DataOps's handbook page](https://about.gitlab.com/handbook/product/categories/#dataops-group)\n* [Grafana: DataOps's group dashboard](/d/stage-groups-dataops?)\n\n* [Grafana: DataOps's error budget detail dashboard](/d/stage-groups-detail-dataops?)\n\n",
      "gridPos": {
        "h": 7,
        "w": 6,
        "x": 18,
        "y": 100
      },
      "id": 13,
      "mode": "markdown",
      "title": "Extra links",
      "type": "text"
    },
    {
      "collapse": false,
      "collapsed": false,
      "gridPos": {
        "h": 1,
        "w": 24,
        "x": 0,
        "y": 200
      },
      "id": 14,
      "panels": [

      ],
      "repeat": null,
      "repeatIteration": null,
      "repeatRowId": null,
      "showTitle": true,
      "title": "MLOps's Error Budgets (From ${__from:date:YYYY-MM-DD HHːmm} to ${__to:date:YYYY-MM-DD HHːmm})",
      "titleSize": "h6",
      "type": "row"
    },
    {
      "description": "",
      "fieldConfig": {
        "defaults": {
          "decimals": 2,
          "displayName": "",
          "thresholds": {
            "mode": "absolute",
            "steps": [
              {
                "color": "red",
                "value": 0
              },
              {
                "color": "green",
                "value": 0.9995
              }
            ]
          },
          "unit": "percentunit"
        }
      },
      "gridPos": {
        "h": 4,
        "w": 6,
        "x": 0,
        "y": 200
      },
      "id": 15,
      "options": {
        "colorMode": "background",
        "graphMode": "none",
        "justifyMode": "auto",
        "orientation": "vertical",
        "reduceOptions": {
          "calcs": [
            "lastNotNull"
          ],
          "fields": "",
          "values": false
        },
        "textMode": "auto"
      },
      "pluginVersion": "7",
      "targets": [
        {
          "expr": "clamp_max(\n  sum by ()(\n    sum by (stage_group,component) (\n      label_replace(\n        sum_over_time(\n          gitlab:component:stage_group:execution:apdex:success:rate_1h{environment=\"$environment\",monitor=\"global\",stage=\"$stage\",stage_group=\"mlops\"}[$__range]\n        ), 'sli_kind', 'apdex', '', ''\n      )\n      or\n      label_replace(\n        sum_over_time(\n          gitlab:component:stage_group:execution:ops:rate_1h{environment=\"$environment\",monitor=\"global\",stage=\"$stage\",stage_group=\"mlops\"}[$__range]\n        )\n        -\n        sum_over_time(\n          gitlab:component:stage_group:execution:error:rate_1h{environment=\"$environment\",monitor=\"global\",stage=\"$stage\",stage_group=\"mlops\"}[$__range]\n        ), 'sli_kind', 'error', '', ''\n      )\n    ) unless on (stage_group,component) gitlab:ignored_component:stage_group\n  )\n  /\n  sum by ()(\n    sum by (stage_group,component) (\n      label_replace(\n        sum_over_time(\n          gitlab:component:stage_group:execution:apdex:weight:score_1h{environment=\"$environment\",monitor=\"global\",stage=\"$stage\",stage_group=\"mlops\"}[$__range]\n        ),\n        'sli_kind', 'apdex', '', ''\n      )\n      or\n      label_replace(\n        sum_over_time(\n          gitlab:component:stage_group:execution:ops:rate_1h{environment=\"$environment\",monitor=\"global\",stage=\"$stage\",stage_group=\"mlops\"}[$__range]\n        )\n        and sum_over_time(gitlab:component:stage_group:execution:error:rate_1h{environment=\"$environment\",monitor=\"global\",stage=\"$stage\",stage_group=\"mlops\"}[$__range]),\n        'sli_kind', 'error', '', ''\n      )\n    ) unless on (stage_group,component) gitlab:ignored_component:stage_group\n  ),\n1)\n",
          "format": "time_series",
          "instant": true,
          "interval": "1m",
          "intervalFactor": 1,
          "legendFormat": "%",
          "refId": "A"
        }
      ],
      "title": "Availability",
      "transparent": false,
      "type": "stat"
    },
    {
      "description": "",
      "fieldConfig": {
        "defaults": {
          "decimals": "2",
          "displayName": "",
          "mappings": [
            {
              "id": 0,
              "options": {
                "from": 0,
                "result": {
                  "color": "red",
                  "index": 0,
                  "text": "🥵 Unhealthy"
                },
                "to": 0.9995
              },
              "type": "range"
            },
            {
              "id": 1,
              "options": {
                "from": 0.9995,
                "result": {
                  "color": "green",
                  "index": 1,
                  "text": "🥳 Healthy"
                },
                "to": 1
              },
              "type": "range"
            }
          ],
          "thresholds": {
            "mode": "absolute",
            "steps": [
              {
                "color": "red",
                "value": 0
              },
              {
                "color": "green",
                "value": 0.9995
              }
            ]
          },
          "unit": "none"
        }
      },
      "gridPos": {
        "h": 1.5,
        "w": 6,
        "x": 0,
        "y": 204
      },
      "id": 16,
      "options": {
        "colorMode": "background",
        "graphMode": "none",
        "justifyMode": "auto",
        "orientation": "vertical",
        "reduceOptions": {
          "calcs": [
            "lastNotNull"
          ],
          "fields": "",
          "values": false
        },
        "textMode": "value"
      },
      "pluginVersion": "7",
      "targets": [
        {
          "expr": "clamp_max(\n  sum by ()(\n    sum by (stage_group,component) (\n      label_replace(\n        sum_over_time(\n          gitlab:component:stage_group:execution:apdex:success:rate_1h{environment=\"$environment\",monitor=\"global\",stage=\"$stage\",stage_group=\"mlops\"}[$__range]\n        ), 'sli_kind', 'apdex', '', ''\n      )\n      or\n      label_replace(\n        sum_over_time(\n          gitlab:component:stage_group:execution:ops:rate_1h{environment=\"$environment\",monitor=\"global\",stage=\"$stage\",stage_group=\"mlops\"}[$__range]\n        )\n        -\n        sum_over_time(\n          gitlab:component:stage_group:execution:error:rate_1h{environment=\"$environment\",monitor=\"global\",stage=\"$stage\",stage_group=\"mlops\"}[$__range]\n        ), 'sli_kind', 'error', '', ''\n      )\n    ) unless on (stage_group,component) gitlab:ignored_component:stage_group\n  )\n  /\n  sum by ()(\n    sum by (stage_group,component) (\n      label_replace(\n        sum_over_time(\n          gitlab:component:stage_group:execution:apdex:weight:score_1h{environment=\"$environment\",monitor=\"global\",stage=\"$stage\",stage_group=\"mlops\"}[$__range]\n        ),\n        'sli_kind', 'apdex', '', ''\n      )\n      or\n      label_replace(\n        sum_over_time(\n          gitlab:component:stage_group:execution:ops:rate_1h{environment=\"$environment\",monitor=\"global\",stage=\"$stage\",stage_group=\"mlops\"}[$__range]\n        )\n        and sum_over_time(gitlab:component:stage_group:execution:error:rate_1h{environment=\"$environment\",monitor=\"global\",stage=\"$stage\",stage_group=\"mlops\"}[$__range]),\n        'sli_kind', 'error', '', ''\n      )\n    ) unless on (stage_group,component) gitlab:ignored_component:stage_group\n  ),\n1)\n",
          "format": "time_series",
          "instant": true,
          "interval": "1m",
          "intervalFactor": 1,
          "legendFormat": "",
          "refId": "A"
        }
      ],
      "title": "",
      "transparent": false,
      "type": "stat"
    },
    {
      "description": "",
      "fieldConfig": {
        "defaults": {
          "decimals": "2",
          "displayName": "Target:",
          "thresholds": {
            "mode": "absolute",
            "steps": [
              {
                "color": "gray"
              }
            ]
          },
          "unit": "percent"
        }
      },
      "gridPos": {
        "h": 1.5,
        "w": 6,
        "x": 0,
        "y": 205.5
      },
      "id": 17,
      "options": {
        "colorMode": "background",
        "graphMode": "none",
        "justifyMode": "auto",
        "orientation": "vertical",
        "reduceOptions": {
          "calcs": [
            "lastNotNull"
          ],
          "fields": "",
          "values": false
        },
        "textMode": "auto"
      },
      "pluginVersion": "7",
      "targets": [
        {
          "expr": "0.9995 * 100.0",
          "format": "time_series",
          "instant": true,
          "interval": "1m",
          "intervalFactor": 1,
          "legendFormat": "",
          "refId": "A"
        }
      ],
      "title": "",
      "transparent": false,
      "type": "stat"
    },
    {
      "description": "",
      "fieldConfig": {
        "defaults": {
          "decimals": 0,
          "displayName": "",
          "thresholds": {
            "mode": "absolute",
            "steps": [
              {
                "color": "red",
                "value": -315360000
              },
              {
                "color": "green",
                "value": 0
              }
            ]
          },
          "unit": "s"
        }
      },
      "gridPos": {
        "h": 4,
        "w": 6,
        "x": 6,
        "y": 200
      },
      "id": 18,
      "options": {
        "colorMode": "background",
        "graphMode": "none",
        "justifyMode": "auto",
        "orientation": "vertical",
        "reduceOptions": {
          "calcs": [
            "lastNotNull"
          ],
          "fields": "",
          "values": false
        },
        "textMode": "auto"
      },
      "pluginVersion": "7",
      "targets": [
        {
          "expr": "# The number of seconds allowed to be spent in $__range\n(1 - 0.9995) * $__range_s\n-\n(\n  (\n     1 - clamp_max(\n  sum by ()(\n    sum by (stage_group,component) (\n      label_replace(\n        sum_over_time(\n          gitlab:component:stage_group:execution:apdex:success:rate_1h{environment=\"$environment\",monitor=\"global\",stage=\"$stage\",stage_group=\"mlops\"}[$__range]\n        ), 'sli_kind', 'apdex', '', ''\n      )\n      or\n      label_replace(\n        sum_over_time(\n          gitlab:component:stage_group:execution:ops:rate_1h{environment=\"$environment\",monitor=\"global\",stage=\"$stage\",stage_group=\"mlops\"}[$__range]\n        )\n        -\n        sum_over_time(\n          gitlab:component:stage_group:execution:error:rate_1h{environment=\"$environment\",monitor=\"global\",stage=\"$stage\",stage_group=\"mlops\"}[$__range]\n        ), 'sli_kind', 'error', '', ''\n      )\n    ) unless on (stage_group,component) gitlab:ignored_component:stage_group\n  )\n  /\n  sum by ()(\n    sum by (stage_group,component) (\n      label_replace(\n        sum_over_time(\n          gitlab:component:stage_group:execution:apdex:weight:score_1h{environment=\"$environment\",monitor=\"global\",stage=\"$stage\",stage_group=\"mlops\"}[$__range]\n        ),\n        'sli_kind', 'apdex', '', ''\n      )\n      or\n      label_replace(\n        sum_over_time(\n          gitlab:component:stage_group:execution:ops:rate_1h{environment=\"$environment\",monitor=\"global\",stage=\"$stage\",stage_group=\"mlops\"}[$__range]\n        )\n        and sum_over_time(gitlab:component:stage_group:execution:error:rate_1h{environment=\"$environment\",monitor=\"global\",stage=\"$stage\",stage_group=\"mlops\"}[$__range]),\n        'sli_kind', 'error', '', ''\n      )\n    ) unless on (stage_group,component) gitlab:ignored_component:stage_group\n  ),\n1)\n\n  ) * $__range_s\n)\n\n",
          "format": "time_series",
          "instant": true,
          "interval": "1m",
          "intervalFactor": 1,
          "legendFormat": "",
          "refId": "A"
        }
      ],
      "title": "Budget remaining",
      "transparent": false,
      "type": "stat"
    },
    {
      "description": "",
      "fieldConfig": {
        "defaults": {
          "decimals": "2",
          "displayName": "",
          "mappings": [
            {
              "id": 0,
              "options": {
                "from": 0,
                "result": {
                  "color": "red",
                  "index": 0,
                  "text": "🥵 Unhealthy"
                },
                "to": 0.9995
              },
              "type": "range"
            },
            {
              "id": 1,
              "options": {
                "from": 0.9995,
                "result": {
                  "color": "green",
                  "index": 1,
                  "text": "🥳 Healthy"
                },
                "to": 1
              },
              "type": "range"
            }
          ],
          "thresholds": {
            "mode": "absolute",
            "steps": [
              {
                "color": "red",
                "value": 0
              },
              {
                "color": "green",
                "value": 0.9995
              }
            ]
          },
          "unit": "none"
        }
      },
      "gridPos": {
        "h": 1.5,
        "w": 6,
        "x": 6,
        "y": 204
      },
      "id": 19,
      "options": {
        "colorMode": "background",
        "graphMode": "none",
        "justifyMode": "auto",
        "orientation": "vertical",
        "reduceOptions": {
          "calcs": [
            "lastNotNull"
          ],
          "fields": "",
          "values": false
        },
        "textMode": "value"
      },
      "pluginVersion": "7",
      "targets": [
        {
          "expr": "clamp_max(\n  sum by ()(\n    sum by (stage_group,component) (\n      label_replace(\n        sum_over_time(\n          gitlab:component:stage_group:execution:apdex:success:rate_1h{environment=\"$environment\",monitor=\"global\",stage=\"$stage\",stage_group=\"mlops\"}[$__range]\n        ), 'sli_kind', 'apdex', '', ''\n      )\n      or\n      label_replace(\n        sum_over_time(\n          gitlab:component:stage_group:execution:ops:rate_1h{environment=\"$environment\",monitor=\"global\",stage=\"$stage\",stage_group=\"mlops\"}[$__range]\n        )\n        -\n        sum_over_time(\n          gitlab:component:stage_group:execution:error:rate_1h{environment=\"$environment\",monitor=\"global\",stage=\"$stage\",stage_group=\"mlops\"}[$__range]\n        ), 'sli_kind', 'error', '', ''\n      )\n    ) unless on (stage_group,component) gitlab:ignored_component:stage_group\n  )\n  /\n  sum by ()(\n    sum by (stage_group,component) (\n      label_replace(\n        sum_over_time(\n          gitlab:component:stage_group:execution:apdex:weight:score_1h{environment=\"$environment\",monitor=\"global\",stage=\"$stage\",stage_group=\"mlops\"}[$__range]\n        ),\n        'sli_kind', 'apdex', '', ''\n      )\n      or\n      label_replace(\n        sum_over_time(\n          gitlab:component:stage_group:execution:ops:rate_1h{environment=\"$environment\",monitor=\"global\",stage=\"$stage\",stage_group=\"mlops\"}[$__range]\n        )\n        and sum_over_time(gitlab:component:stage_group:execution:error:rate_1h{environment=\"$environment\",monitor=\"global\",stage=\"$stage\",stage_group=\"mlops\"}[$__range]),\n        'sli_kind', 'error', '', ''\n      )\n    ) unless on (stage_group,component) gitlab:ignored_component:stage_group\n  ),\n1)\n",
          "format": "time_series",
          "instant": true,
          "interval": "1m",
          "intervalFactor": 1,
          "legendFormat": "",
          "refId": "A"
        }
      ],
      "title": "",
      "transparent": false,
      "type": "stat"
    },
    {
      "description": "",
      "fieldConfig": {
        "defaults": {
          "decimals": 0,
          "displayName": "Budget:",
          "thresholds": {
            "mode": "absolute",
            "steps": [
              {
                "color": "gray"
              }
            ]
          },
          "unit": "s"
        }
      },
      "gridPos": {
        "h": 1.5,
        "w": 6,
        "x": 6,
        "y": 205.5
      },
      "id": 20,
      "options": {
        "colorMode": "background",
        "graphMode": "none",
        "justifyMode": "auto",
        "orientation": "vertical",
        "reduceOptions": {
          "calcs": [
            "lastNotNull"
          ],
          "fields": "",
          "values": false
        },
        "textMode": "auto"
      },
      "pluginVersion": "7",
      "targets": [
        {
          "expr": "# The number of seconds allowed to be spent in $__range\n(1 - 0.9995) * $__range_s\n",
          "format": "time_series",
          "instant": true,
          "interval": "1m",
          "intervalFactor": 1,
          "legendFormat": "",
          "refId": "A"
        }
      ],
      "title": "",
      "transparent": false,
      "type": "stat"
    },
    {
      "description": "",
      "fieldConfig": {
        "defaults": {
          "decimals": 0,
          "displayName": "",
          "thresholds": {
            "mode": "absolute"
          },
          "unit": "s"
        }
      },
      "gridPos": {
        "h": 4,
        "w": 6,
        "x": 12,
        "y": 200
      },
      "id": 21,
      "options": {
        "colorMode": "background",
        "graphMode": "none",
        "justifyMode": "auto",
        "orientation": "vertical",
        "reduceOptions": {
          "calcs": [
            "lastNotNull"
          ],
          "fields": "",
          "values": false
        },
        "textMode": "auto"
      },
      "pluginVersion": "7",
      "targets": [
        {
          "expr": "(\n  (\n     1 - clamp_max(\n  sum by ()(\n    sum by (stage_group,component) (\n      label_replace(\n        sum_over_time(\n          gitlab:component:stage_group:execution:apdex:success:rate_1h{environment=\"$environment\",monitor=\"global\",stage=\"$stage\",stage_group=\"mlops\"}[$__range]\n        ), 'sli_kind', 'apdex', '', ''\n      )\n      or\n      label_replace(\n        sum_over_time(\n          gitlab:component:stage_group:execution:ops:rate_1h{environment=\"$environment\",monitor=\"global\",stage=\"$stage\",stage_group=\"mlops\"}[$__range]\n        )\n        -\n        sum_over_time(\n          gitlab:component:stage_group:execution:error:rate_1h{environment=\"$environment\",monitor=\"global\",stage=\"$stage\",stage_group=\"mlops\"}[$__range]\n        ), 'sli_kind', 'error', '', ''\n      )\n    ) unless on (stage_group,component) gitlab:ignored_component:stage_group\n  )\n  /\n  sum by ()(\n    sum by (stage_group,component) (\n      label_replace(\n        sum_over_time(\n          gitlab:component:stage_group:execution:apdex:weight:score_1h{environment=\"$environment\",monitor=\"global\",stage=\"$stage\",stage_group=\"mlops\"}[$__range]\n        ),\n        'sli_kind', 'apdex', '', ''\n      )\n      or\n      label_replace(\n        sum_over_time(\n          gitlab:component:stage_group:execution:ops:rate_1h{environment=\"$environment\",monitor=\"global\",stage=\"$stage\",stage_group=\"mlops\"}[$__range]\n        )\n        and sum_over_time(gitlab:component:stage_group:execution:error:rate_1h{environment=\"$environment\",monitor=\"global\",stage=\"$stage\",stage_group=\"mlops\"}[$__range]),\n        'sli_kind', 'error', '', ''\n      )\n    ) unless on (stage_group,component) gitlab:ignored_component:stage_group\n  ),\n1)\n\n  ) * $__range_s\n)\n",
          "format": "time_series",
          "instant": true,
          "interval": "1m",
          "intervalFactor": 1,
          "legendFormat": "",
          "refId": "A"
        },
        {
          "expr": "# The number of seconds allowed to be spent in $__range\n(1 - 0.9995) * $__range_s\n",
          "format": "time_series",
          "interval": "1m",
          "intervalFactor": 1,
          "legendFormat": "budget",
          "refId": "B"
        }
      ],
      "title": "Budget spent",
      "transformations": [
        {
          "id": "configFromData",
          "options": {
            "configRefId": "B",
            "mappings": [
              {
                "fieldName": "budget",
                "handlerKey": "threshold1"
              }
            ]
          }
        }
      ],
      "transparent": false,
      "type": "stat"
    },
    {
      "description": "",
      "fieldConfig": {
        "defaults": {
          "decimals": "2",
          "displayName": "",
          "mappings": [
            {
              "id": 0,
              "options": {
                "from": 0,
                "result": {
                  "color": "red",
                  "index": 0,
                  "text": "🥵 Unhealthy"
                },
                "to": 0.9995
              },
              "type": "range"
            },
            {
              "id": 1,
              "options": {
                "from": 0.9995,
                "result": {
                  "color": "green",
                  "index": 1,
                  "text": "🥳 Healthy"
                },
                "to": 1
              },
              "type": "range"
            }
          ],
          "thresholds": {
            "mode": "absolute",
            "steps": [
              {
                "color": "red",
                "value": 0
              },
              {
                "color": "green",
                "value": 0.9995
              }
            ]
          },
          "unit": "none"
        }
      },
      "gridPos": {
        "h": 1.5,
        "w": 6,
        "x": 12,
        "y": 204
      },
      "id": 22,
      "options": {
        "colorMode": "background",
        "graphMode": "none",
        "justifyMode": "auto",
        "orientation": "vertical",
        "reduceOptions": {
          "calcs": [
            "lastNotNull"
          ],
          "fields": "",
          "values": false
        },
        "textMode": "value"
      },
      "pluginVersion": "7",
      "targets": [
        {
          "expr": "clamp_max(\n  sum by ()(\n    sum by (stage_group,component) (\n      label_replace(\n        sum_over_time(\n          gitlab:component:stage_group:execution:apdex:success:rate_1h{environment=\"$environment\",monitor=\"global\",stage=\"$stage\",stage_group=\"mlops\"}[$__range]\n        ), 'sli_kind', 'apdex', '', ''\n      )\n      or\n      label_replace(\n        sum_over_time(\n          gitlab:component:stage_group:execution:ops:rate_1h{environment=\"$environment\",monitor=\"global\",stage=\"$stage\",stage_group=\"mlops\"}[$__range]\n        )\n        -\n        sum_over_time(\n          gitlab:component:stage_group:execution:error:rate_1h{environment=\"$environment\",monitor=\"global\",stage=\"$stage\",stage_group=\"mlops\"}[$__range]\n        ), 'sli_kind', 'error', '', ''\n      )\n    ) unless on (stage_group,component) gitlab:ignored_component:stage_group\n  )\n  /\n  sum by ()(\n    sum by (stage_group,component) (\n      label_replace(\n        sum_over_time(\n          gitlab:component:stage_group:execution:apdex:weight:score_1h{environment=\"$environment\",monitor=\"global\",stage=\"$stage\",stage_group=\"mlops\"}[$__range]\n        ),\n        'sli_kind', 'apdex', '', ''\n      )\n      or\n      label_replace(\n        sum_over_time(\n          gitlab:component:stage_group:execution:ops:rate_1h{environment=\"$environment\",monitor=\"global\",stage=\"$stage\",stage_group=\"mlops\"}[$__range]\n        )\n        and sum_over_time(gitlab:component:stage_group:execution:error:rate_1h{environment=\"$environment\",monitor=\"global\",stage=\"$stage\",stage_group=\"mlops\"}[$__range]),\n        'sli_kind', 'error', '', ''\n      )\n    ) unless on (stage_group,component) gitlab:ignored_component:stage_group\n  ),\n1)\n",
          "format": "time_series",
          "instant": true,
          "interval": "1m",
          "intervalFactor": 1,
          "legendFormat": "",
          "refId": "A"
        }
      ],
      "title": "",
      "transparent": false,
      "type": "stat"
    },
    {
      "description": "",
      "fieldConfig": {
        "defaults": {
          "decimals": 0,
          "displayName": "Budget:",
          "thresholds": {
            "mode": "absolute",
            "steps": [
              {
                "color": "gray"
              }
            ]
          },
          "unit": "s"
        }
      },
      "gridPos": {
        "h": 1.5,
        "w": 6,
        "x": 12,
        "y": 205.5
      },
      "id": 23,
      "options": {
        "colorMode": "background",
        "graphMode": "none",
        "justifyMode": "auto",
        "orientation": "vertical",
        "reduceOptions": {
          "calcs": [
            "lastNotNull"
          ],
          "fields": "",
          "values": false
        },
        "textMode": "auto"
      },
      "pluginVersion": "7",
      "targets": [
        {
          "expr": "# The number of seconds allowed to be spent in $__range\n(1 - 0.9995) * $__range_s\n",
          "format": "time_series",
          "instant": true,
          "interval": "1m",
          "intervalFactor": 1,
          "legendFormat": "",
          "refId": "A"
        }
      ],
      "title": "",
      "transparent": false,
      "type": "stat"
    },
    {
      "content": "- [MLOps's handbook page](https://about.gitlab.com/handbook/product/categories/#mlops-group)\n* [Grafana: MLOps's group dashboard](/d/stage-groups-mlops?)\n\n* [Grafana: MLOps's error budget detail dashboard](/d/stage-groups-detail-mlops?)\n\n",
      "gridPos": {
        "h": 7,
        "w": 6,
        "x": 18,
        "y": 200
      },
      "id": 24,
      "mode": "markdown",
      "title": "Extra links",
      "type": "text"
    },
    {
      "content": "Made with ❤️ and [Grafonnet](https://github.com/grafana/grafonnet-lib). [Contribute to this dashboard on GitLab.com](https://gitlab.com/gitlab-com/runbooks/blob/master/dashboards)\n",
      "datasource": null,
      "gridPos": {
        "h": 2,
        "w": 24,
        "x": 0,
        "y": 110000
      },
      "id": 25,
      "mode": "markdown",
      "title": "Source",
      "type": "text"
    }
  ],
  "refresh": "",
  "rows": [

  ],
  "schemaVersion": 16,
  "style": "light",
  "tags": [
    "managed",
    "product",
    "product performance"
  ],
  "templating": {
    "list": [
      {
        "current": {
          "text": "Global",
          "value": "Global"
        },
        "hide": 0,
        "label": null,
        "name": "PROMETHEUS_DS",
        "options": [

        ],
        "query": "prometheus",
        "refresh": 1,
        "regex": "",
        "type": "datasource"
      },
      {
        "allValue": null,
        "current": {
          "text": "gprd",
          "value": "gprd"
        },
        "datasource": "$PROMETHEUS_DS",
        "hide": 0,
        "includeAll": false,
        "label": null,
        "multi": false,
        "name": "environment",
        "options": [

        ],
        "query": "label_values(gitlab_service_ops:rate, environment)",
        "refresh": 1,
        "regex": "",
        "sort": 1,
        "tagValuesQuery": "",
        "tags": [

        ],
        "tagsQuery": "",
        "type": "query",
        "useTags": false
      },
      {
        "allValue": null,
        "current": {
          "text": "main",
          "value": "main"
        },
        "hide": 0,
        "includeAll": false,
        "label": "",
        "multi": false,
        "name": "stage",
        "options": [
          {
            "text": "main",
            "value": "main"
          },
          {
            "text": "cny",
            "value": "cny"
          },
          {
            "text": "",
            "value": ""
          }
        ],
        "query": "main,cny,",
        "refresh": 0,
        "type": "custom"
      }
    ]
  },
  "time": {
    "from": "now-28d",
    "to": "now/m"
  },
  "timepicker": {
    "refresh_intervals": [
      "1m",
      "5m",
      "10m",
      "15m",
      "30m"
    ],
    "time_options": [
      "5m",
      "15m",
      "1h",
      "6h",
      "12h",
      "24h",
      "2d",
      "7d",
      "30d"
    ]
  },
  "timezone": "utc",
  "title": "product: Error Budgets - modelops",
  "uid": "product-ModelOps_error_budget",
  "version": 1938
}