{
  "annotations": {
    "list": [
      {
        "builtIn": 1,
        "datasource": {
          "type": "grafana",
          "uid": "-- Grafana --"
        },
        "enable": true,
        "hide": true,
        "iconColor": "rgba(0, 211, 255, 1)",
        "name": "Annotations & Alerts",
        "type": "dashboard"
      }
    ]
  },
  "editable": true,
  "fiscalYearStartMonth": 0,
  "graphTooltip": 1,
  "id": null,
  "links": [
    {
      "asDropdown": true,
      "icon": "external link",
      "includeVars": true,
      "keepTime": true,
      "tags": [
        "mimir"
      ],
      "targetBlank": false,
      "title": "Mimir dashboards",
      "type": "dashboards"
    }
  ],
  "liveNow": false,
  "panels": [
    {
      "collapsed": false,
      "datasource": {
        "type": "prometheus",
        "uid": "PA258B30F88C30650"
      },
      "gridPos": {
        "h": 1,
        "w": 24,
        "x": 0,
        "y": 0
      },
      "id": 2,
      "panels": [

      ],
      "targets": [
        {
          "datasource": {
            "type": "prometheus",
            "uid": "PA258B30F88C30650"
          },
          "refId": "A"
        }
      ],
      "type": "row"
    },
    {
      "datasource": {
        "uid": "${lokidatasource}"
      },
      "fieldConfig": {
        "defaults": {
          "custom": {
            "align": "auto",
            "cellOptions": {
              "type": "auto"
            },
            "inspect": false
          },
          "mappings": [

          ],
          "thresholds": {
            "mode": "absolute",
            "steps": [
              {
                "color": "green",
                "value": null
              },
              {
                "color": "red",
                "value": 80
              }
            ]
          }
        },
        "overrides": [
          {
            "matcher": {
              "id": "byName",
              "options": "Time range"
            },
            "properties": [
              {
                "id": "mappings",
                "value": [
                  {
                    "options": {
                      "0": {
                        "text": "Instant query"
                      }
                    },
                    "type": "value"
                  }
                ]
              },
              {
                "id": "unit",
                "value": "s"
              }
            ]
          },
          {
            "matcher": {
              "id": "byName",
              "options": "Step"
            },
            "properties": [
              {
                "id": "unit",
                "value": "s"
              }
            ]
          }
        ]
      },
      "gridPos": {
        "h": 7,
        "w": 24,
        "x": 0,
        "y": 1
      },
      "id": 1,
      "options": {
        "cellHeight": "sm",
        "footer": {
          "countRows": false,
          "fields": "",
          "reducer": [
            "sum"
          ],
          "show": false
        },
        "showHeader": true
      },
      "pluginVersion": "9.5.13",
      "targets": [
        {
          "datasource": {
            "uid": "${lokidatasource}"
          },
          "expr": "{cluster=~\"$cluster\",namespace=~\"$namespace\",name=~\"query-frontend.*\"} |= \"query stats\" != \"/api/v1/read\" | logfmt | user=~\"${tenant_id}\" | response_time > ${min_duration}",
          "instant": false,
          "legendFormat": "",
          "range": true,
          "refId": "A"
        }
      ],
      "title": "Slow queries",
      "transformations": [
        {
          "id": "extractFields",
          "options": {
            "source": "labels"
          }
        },
        {
          "id": "calculateField",
          "options": {
            "alias": "Time range",
            "binary": {
              "left": "param_end",
              "operator": "-",
              "reducer": "sum",
              "right": "param_start"
            },
            "mode": "binary",
            "reduce": {
              "reducer": "sum"
            },
            "replaceFields": false
          }
        },
        {
          "id": "organize",
          "options": {
            "excludeByName": {
              "Line": true,
              "Time": true,
              "caller": true,
              "cluster": true,
              "container": true,
              "host": true,
              "id": true,
              "job": true,
              "labels": true,
              "level": true,
              "line": true,
              "method": true,
              "msg": true,
              "name": true,
              "namespace": true,
              "param_end": true,
              "param_start": true,
              "param_time": true,
              "path": true,
              "pod": true,
              "pod_template_hash": true,
              "query_wall_time_seconds": true,
              "stream": true,
              "traceID": true,
              "tsNs": true
            },
            "indexByName": {
              "Time range": 3,
              "param_query": 2,
              "param_step": 4,
              "response_time": 5,
              "ts": 0,
              "user": 1
            },
            "renameByName": {
              "org_id": "Tenant ID",
              "param_query": "Query",
              "param_step": "Step",
              "response_time": "Duration"
            }
          }
        }
      ],
      "type": "table"
    }
  ],
  "refresh": "",
  "schemaVersion": 39,
  "style": "dark",
  "tags": [
    "mimir",
    "protected",
    "unmanaged"
  ],
  "templating": {
    "list": [
      {
        "current": {
          "text": "default",
          "value": "default"
        },
        "hide": 0,
        "includeAll": false,
        "label": "Data Source",
        "multi": false,
        "name": "datasource",
        "options": [

        ],
        "query": "prometheus",
        "refresh": 1,
        "regex": "",
        "skipUrlSync": false,
        "type": "datasource"
      },
      {
        "allValue": ".*",
        "current": {
          "text": "prod",
          "value": "prod"
        },
        "datasource": {
          "type": "prometheus",
          "uid": "$datasource"
        },
        "definition": "",
        "hide": 0,
        "includeAll": true,
        "label": "cluster",
        "multi": false,
        "name": "cluster",
        "options": [

        ],
        "query": "label_values(cortex_build_info, cluster)",
        "refresh": 1,
        "regex": "",
        "skipUrlSync": false,
        "sort": 1,
        "tagValuesQuery": "",
        "tagsQuery": "",
        "type": "query",
        "useTags": false
      },
      {
        "current": {
          "text": "prod",
          "value": "prod"
        },
        "datasource": {
          "type": "prometheus",
          "uid": "$datasource"
        },
        "definition": "",
        "hide": 0,
        "includeAll": false,
        "label": "namespace",
        "multi": false,
        "name": "namespace",
        "options": [

        ],
        "query": "label_values(cortex_build_info{cluster=~\"$cluster\"}, namespace)",
        "refresh": 1,
        "regex": "",
        "skipUrlSync": false,
        "sort": 1,
        "tagValuesQuery": "",
        "tagsQuery": "",
        "type": "query",
        "useTags": false
      },
      {
        "hide": 0,
        "includeAll": false,
        "label": "Logs datasource",
        "multi": false,
        "name": "lokidatasource",
        "options": [

        ],
        "query": "loki",
        "refresh": 1,
        "regex": "",
        "skipUrlSync": false,
        "type": "datasource"
      },
      {
        "current": {
          "selected": true,
          "text": "5s",
          "value": "5s"
        },
        "hide": 0,
        "label": "Min duration",
        "name": "min_duration",
        "options": [
          {
            "selected": true,
            "text": "5s",
            "value": "5s"
          }
        ],
        "query": "5s",
        "skipUrlSync": false,
        "type": "textbox"
      },
      {
        "current": {
          "selected": true,
          "text": ".*",
          "value": ".*"
        },
        "hide": 0,
        "label": "Tenant ID",
        "name": "tenant_id",
        "options": [
          {
            "selected": true,
            "text": ".*",
            "value": ".*"
          }
        ],
        "query": ".*",
        "skipUrlSync": false,
        "type": "textbox"
      }
    ]
  },
  "time": {
    "from": "now-1h",
    "to": "now"
  },
  "timepicker": {
    "refresh_intervals": [
      "5s",
      "10s",
      "30s",
      "1m",
      "5m",
      "15m",
      "30m",
      "1h",
      "2h",
      "1d"
    ],
    "time_options": [
      "5m",
      "15m",
      "1h",
      "6h",
      "12h",
      "24h",
      "2d",
      "7d",
      "30d"
    ]
  },
  "timezone": "utc",
  "title": "Mimir / Slow queries",
  "uid": "6089e1ce1e678788f46312a0a1e647e6",
  "version": 3,
  "weekStart": ""
}