{
  "__inputs": [

  ],
  "__requires": [

  ],
  "annotations": {
    "list": [
      {
        "builtIn": 1,
        "datasource": "-- Grafana --",
        "enable": true,
        "hide": false,
        "iconColor": "#96D98D",
        "name": "deploy",
        "showIn": 0,
        "tags": [
          "deploy",
          "$environment"
        ],
        "type": "tags"
      },
      {
        "builtIn": 1,
        "datasource": "-- Grafana --",
        "enable": false,
        "hide": false,
        "iconColor": "#FFEE52",
        "name": "canary-deploy",
        "showIn": 0,
        "tags": [
          "deploy",
          "${environment}-cny"
        ],
        "type": "tags"
      },
      {
        "builtIn": 1,
        "datasource": "-- Grafana --",
        "enable": false,
        "hide": false,
        "iconColor": "#CA95E5",
        "name": "feature-flags",
        "showIn": 0,
        "tags": [
          "feature-flag",
          "${environment}"
        ],
        "type": "tags"
      }
    ]
  },
  "description": "Uploaded by https://gitlab.com/gitlab-com/runbooks/-/jobs/5761247267 at Fri Dec 15 13:19:39 UTC 2023",
  "editable": false,
  "gnetId": null,
  "graphTooltip": 1,
  "hideControls": false,
  "id": null,
  "links": [
    {
      "asDropdown": true,
      "icon": "external link",
      "includeVars": false,
      "keepTime": true,
      "tags": "",
      "targetBlank": false,
      "title": "patroni service",
      "type": "link",
      "url": "https://dashboards.gitlab.net/d/patroni-main/patroni-overview?orgId=1"
    },
    {
      "asDropdown": true,
      "icon": "external link",
      "includeVars": false,
      "keepTime": true,
      "tags": "",
      "targetBlank": false,
      "title": "Platform Triage",
      "type": "link",
      "url": "https://dashboards.gitlab.net/d/general-triage/platform-triage?orgId=1"
    }
  ],
  "panels": [
    {
      "columns": [

      ],
      "datasource": "$PROMETHEUS_DS",
      "description": "",
      "gridPos": {
        "h": 12,
        "w": 24,
        "x": 0,
        "y": 0
      },
      "id": 2,
      "links": [

      ],
      "sort": {
        "col": 3,
        "desc": true
      },
      "styles": [
        {
          "mappingType": 1,
          "pattern": "Time",
          "type": "hidden"
        },
        {
          "decimals": 0,
          "mappingType": 1,
          "pattern": "Value",
          "type": "number",
          "unit": "s"
        }
      ],
      "targets": [
        {
          "expr": "topk(10,\n  max by (application, endpoint) (\n    max_over_time(\n      pg_stat_activity_marginalia_sampler_max_tx_age_in_seconds{\n        type=\"patroni\",\n        environment=\"$environment\",\n        command!=\"autovacuum\",\n        command!~\"[aA][nN][aA][lL][yY][zZ][eE]\",\n      }[$__range])\n    and on(instance, job)\n    pg_replication_is_replica == 0\n  )\n)\n",
          "format": "table",
          "instant": true,
          "interval": "1m",
          "intervalFactor": 1,
          "legendFormat": "",
          "refId": "A"
        }
      ],
      "timeFrom": null,
      "timeShift": null,
      "title": "Longest Samples Transactions observed running on the Primary",
      "transformations": [

      ],
      "type": "table"
    },
    {
      "columns": [

      ],
      "datasource": "$PROMETHEUS_DS",
      "description": "",
      "gridPos": {
        "h": 12,
        "w": 24,
        "x": 0,
        "y": 12
      },
      "id": 3,
      "links": [

      ],
      "sort": {
        "col": 3,
        "desc": true
      },
      "styles": [
        {
          "mappingType": 1,
          "pattern": "Time",
          "type": "hidden"
        },
        {
          "decimals": 0,
          "mappingType": 1,
          "pattern": "Value",
          "type": "number",
          "unit": "s"
        }
      ],
      "targets": [
        {
          "expr": "topk(10,\n  max by (application, endpoint) (\n    max_over_time(\n      pg_stat_activity_marginalia_sampler_max_tx_age_in_seconds{\n        type=\"patroni\",\n        environment=\"$environment\",\n        command!=\"autovacuum\",\n        command!~\"[aA][nN][aA][lL][yY][zZ][eE]\",\n      }[$__range])\n    and on(instance, job)\n    pg_replication_is_replica == 1\n  )\n)\n",
          "format": "table",
          "instant": true,
          "interval": "1m",
          "intervalFactor": 1,
          "legendFormat": "",
          "refId": "A"
        }
      ],
      "timeFrom": null,
      "timeShift": null,
      "title": "Longest Samples Transactions observed running on Secondaries",
      "transformations": [

      ],
      "type": "table"
    }
  ],
  "refresh": "",
  "rows": [

  ],
  "schemaVersion": 16,
  "style": "light",
  "tags": [
    "managed",
    "alerts",
    "alert-target",
    "type:patroni"
  ],
  "templating": {
    "list": [
      {
        "current": {
          "text": "Global",
          "value": "Global"
        },
        "hide": 0,
        "label": null,
        "name": "PROMETHEUS_DS",
        "options": [

        ],
        "query": "prometheus",
        "refresh": 1,
        "regex": "",
        "type": "datasource"
      },
      {
        "allValue": null,
        "current": {
          "text": "gprd",
          "value": "gprd"
        },
        "datasource": "$PROMETHEUS_DS",
        "hide": 0,
        "includeAll": false,
        "label": null,
        "multi": false,
        "name": "environment",
        "options": [

        ],
        "query": "label_values(gitlab_service_ops:rate, environment)",
        "refresh": 1,
        "regex": "",
        "sort": 1,
        "tagValuesQuery": "",
        "tags": [

        ],
        "tagsQuery": "",
        "type": "query",
        "useTags": false
      }
    ]
  },
  "time": {
    "from": "now-6h/m",
    "to": "now/m"
  },
  "timepicker": {
    "refresh_intervals": [
      "1m",
      "5m",
      "10m",
      "15m",
      "30m"
    ],
    "time_options": [
      "5m",
      "15m",
      "1h",
      "6h",
      "12h",
      "24h",
      "2d",
      "7d",
      "30d"
    ]
  },
  "timezone": "utc",
  "title": "alerts: Long running transactions",
  "uid": "alerts-long_running_transactions",
  "version": 2937
}